%YAML 1.1
%TAG !u! tag:unity3d.com,2011:
--- !u!1045 &1
EditorBuildSettings:
  m_ObjectHideFlags: 0
  serializedVersion: 2
  m_Scenes:
  - enabled: 1
    path: Assets/Scenes/SampleScene.unity
    guid: 9fc0d4010bbf28b4594072e72b8655ab
  m_configObjects:
    Unity.XR.Oculus.Settings: {fileID: 11400000, guid: 86539b12a9cf548d5afb3f5f4d2d05ad, type: 2}
    com.unity.xr.management.loader_settings: {fileID: 11400000, guid: 8e2f89ed1f21648e3897e900e1f19a06, type: 2}
    com.unity.xr.openxr.settings4: {fileID: 11400000, guid: 3561ec13639884e29bb11a3c8dfddd95, type: 2}
