{
  "project_info": {
    "project_number": "576331294390",
    "firebase_url": "https://witty-chat-47deb.firebaseio.com",
    "project_id": "witty-chat-47deb",
    "storage_bucket": "witty-chat-47deb.appspot.com"
  },
  "client": [
    {
      "client_info": {
        "mobilesdk_app_id": "1:576331294390:android:eed6f916aacdca0964a817",
        "android_client_info": {
          "package_name": "com.twilio.chat.witty"
        }
      },
      "oauth_client": [
        {
          "client_id": "576331294390-hnbtpq4ejct3au9djomh43mlt25agbul.apps.googleusercontent.com",
          "client_type": 3
        }
      ],
      "api_key": [
        {
          "current_key": "AIzaSyCuvK7NxnfehqDpgZ0DoIvoboUupEhmH2A"
        }
      ],
      "services": {
        "appinvite_service": {
          "other_platform_oauth_client": [
            {
              "client_id": "576331294390-hnbtpq4ejct3au9djomh43mlt25agbul.apps.googleusercontent.com",
              "client_type": 3
            }
          ]
        }
      }
    },
    {
      "client_info": {
        "mobilesdk_app_id": "1:576331294390:android:473eff6a560fa4fd64a817",
        "android_client_info": {
          "package_name": "com.twilio.conversations.demo"
        }
      },
      "oauth_client": [
        {
          "client_id": "576331294390-hnbtpq4ejct3au9djomh43mlt25agbul.apps.googleusercontent.com",
          "client_type": 3
        }
      ],
      "api_key": [
        {
          "current_key": "AIzaSyCuvK7NxnfehqDpgZ0DoIvoboUupEhmH2A"
        }
      ],
      "services": {
        "appinvite_service": {
          "other_platform_oauth_client": [
            {
              "client_id": "576331294390-hnbtpq4ejct3au9djomh43mlt25agbul.apps.googleusercontent.com",
              "client_type": 3
            }
          ]
        }
      }
    }
  ],
  "configuration_version": "1"
}