{
  "project_info": {
    "project_number": "856552430929",
    "firebase_url": "https://hindugemeinde-magazine.firebaseio.com",
    "project_id": "hindugemeinde-magazine",
    "storage_bucket": "hindugemeinde-magazine.appspot.com"
  },
  "client": [
    {
      "client_info": {
        "mobilesdk_app_id": "1:856552430929:android:c1c3c7668b2caf8e368770",
        "android_client_info": {
          "package_name": "com.hindugemeinde.magazine"
        }
      },
      "oauth_client": [
        {
          "client_id": "856552430929-5jrmrtodj1qrgpdd8k0brailnu5d9f5f.apps.googleusercontent.com",
          "client_type": 3
        }
      ],
      "api_key": [
        {
          "current_key": "AIzaSyBtEKqmVUNiS5TQA97WoQngS0dol7S4-g8"
        }
      ],
      "services": {
        "appinvite_service": {
          "other_platform_oauth_client": [
            {
              "client_id": "856552430929-5jrmrtodj1qrgpdd8k0brailnu5d9f5f.apps.googleusercontent.com",
              "client_type": 3
            }
          ]
        }
      }
    }
  ],
  "configuration_version": "1"
}