{
	"menu_id": "vrplus_menu_tweaks",
	"parent_menu_id": "vrplus_menu_main",
	"title": "vrplus_menu_tweaks",
	"description": "vrplus_menu_tweaks_desc",
	"items": [
		{
			"type": "slider",
			"id": "vrplus_laser_hue",
			"title": "vrplus_laser_hue",
			"description": "vrplus_laser_hue_desc",
			"callback": "vrplus_laser_hue",
			"value": "laser_hue",
			"max": 1,
			"min": 0,
			"step": 0.1,
			"priority": 99
		},
		{
			"type": "toggle",
			"id": "vrplus_laser_disco",
			"title": "vrplus_laser_disco",
			"description": "vrplus_laser_disco_desc",
			"callback": "vrplus_laser_disco",
			"value": "laser_disco",
			"priority": 98
		}
	]
}
