mode: set
movies-services/transport/http/imdb/detail_movie.go:10.40,14.21 4 1
movies-services/transport/http/imdb/detail_movie.go:17.2,19.16 3 1
movies-services/transport/http/imdb/detail_movie.go:22.2,27.11 4 1
movies-services/transport/http/imdb/detail_movie.go:14.21,16.3 1 1
movies-services/transport/http/imdb/detail_movie.go:19.17,21.3 0 0
movies-services/transport/http/imdb/search_movie.go:10.52,14.21 4 1
movies-services/transport/http/imdb/search_movie.go:18.2,18.15 1 1
movies-services/transport/http/imdb/search_movie.go:24.2,25.16 2 1
movies-services/transport/http/imdb/search_movie.go:28.2,33.11 4 1
movies-services/transport/http/imdb/search_movie.go:14.21,16.3 1 1
movies-services/transport/http/imdb/search_movie.go:18.15,20.3 1 1
movies-services/transport/http/imdb/search_movie.go:20.8,22.3 1 1
movies-services/transport/http/imdb/search_movie.go:25.17,27.3 0 0
