<?xml version="1.0" encoding="utf-8"?>
<!-- Generator: Adobe Illustrator 21.1.0, SVG Export Plug-In . SVG Version: 6.00 Build 0)  -->
<svg version="1.1" id="Layer_1" xmlns="http://www.w3.org/2000/svg" xmlns:xlink="http://www.w3.org/1999/xlink" x="0px" y="0px"
	 viewBox="0 0 528.3 792" style="enable-background:new 0 0 528.3 792;" xml:space="preserve">
<style type="text/css">
	.st0{fill:#939393;}
</style>
<g>
	<g>
		<g>
			<g>
				<path class="st0" d="M264.1,0C118.5,0,0,118.4,0,264v264.4c0,145.6,118.5,264,264.1,264s264.1-118.4,264.1-264V264
					C528.3,118.4,409.8,0,264.1,0z M498.9,528.4c0,129.4-105.3,234.6-234.8,234.6S29.3,657.8,29.3,528.4V264
					c0-129.4,105.3-234.7,234.8-234.7S498.9,134.6,498.9,264V528.4z"/>
				<path class="st0" d="M264.1,88c-8.1,0-14.7,6.6-14.7,14.7v132.9c0,8.1,6.6,14.7,14.7,14.7s14.7-6.6,14.7-14.7V102.7
					C278.8,94.6,272.2,88,264.1,88z"/>
			</g>
		</g>
	</g>
</g>
</svg>
