%!PS-Adobe-3.0 EPSF-3.0
%%BoundingBox: 0 0 108 127
%%HiResBoundingBox: 0 0 107.424 126.4769
%%Title: ufcd-logo-e1-left-a5-color
%%CreationDate: 2009-12-08T12:58+0100
%%Creator: Project ufcd
%%LanguageLevel: 2
%%DocumentData: Clean7Bit
%%Pages: 1
%%EndComments
%%Page: 1 1
save
0 0 107.424 126.4769 rectclip
9 dict begin
/k{setcmykcolor}bind def
/p{closepath}bind def
/c{curveto}bind def
/f{fill}bind def
/l{lineto}bind def
/m{moveto}bind def
/s{setoverprint}bind def
/np{newpath}bind def
/clp{clip np}bind def
gsave
np
gsave
-26.82 138.7179 m
-26.82 .0089 l
107.424 .0089 l
107.424 138.7179 l
p
clp
gsave
-26.82 138.7179 m
-26.82 42.337 l
49.7161 42.337 l
49.7161 138.7179 l
-26.82 138.7179 l
clp
14.3089 109.1862 m
10.2518 104.8019 6.5999 99.5592 4.1732 93.3937 c
3.576 91.8756 3.2 90.1466 2.6409 88.444 c
2.0994 86.7926 1.6033 84.9659 1.345 83.2584 c
-1.8127 62.3785 6.012 46.3468 17.2547 35.9969 c
25.8792 28.0599 38.5882 21.1929 54.9691 22.0909 c
71.4202 22.9929 81.899 29.6829 90.561 38.4719 c
92.737 40.6808 94.711 43.0812 96.334 45.6613 c
101.409 53.7199 105.03 63.6198 104.467 76.4225 c
104.119 84.3214 102.098 90.8546 99.162 97.047 c
97.743 100.0475 96.256 102.7575 94.33 105.1788 c
92.414 107.5914 90.526 110.0787 88.203 112.1325 c
79.192 120.1007 66.8753 126.8903 49.9007 125.8033 c
33.2972 124.7408 22.6302 118.1793 14.3089 109.1862 c
14.3089 109.1862 l
p
50.4905 126.5104 m
66.9202 127.2257 80.063 120.7086 88.674 112.3678 c
97.481 103.84 104.227 92.3248 105.174 76.4225 c
105.68 67.924 103.871 60.4547 101.285 54.1476 c
98.692 47.8195 95.27 42.3644 91.032 38.0009 c
82.244 28.9519 71.2073 22.1549 54.8499 21.5009 c
38.6234 20.8529 25.4886 27.1669 16.6658 35.6439 c
12.116 40.0148 8.535 44.8683 5.4696 50.8488 c
2.4886 56.6613 .3128 63.6217 .0487 71.7086 c
-0.5026 88.5607 5.7742 100.9948 14.0731 110.0114 c
20.2938 116.7706 28.4349 121.7701 38.8226 124.861 c
42.4329 125.9347 46.3421 126.3297 50.4905 126.5104 c
50.4905 126.5104 l
p
false s
0.7 .45 0 0 k
f
69.2288 122.2682 m
58.7991 121.6974 47.9105 122.3727 36.5823 122.3859 c
46.098 125.9567 59.8323 125.7159 69.2288 122.2682 c
69.2288 122.2682 l
p
f
18.3153 42.2433 m
18.2684 41.5284 19.0789 41.671 19.6121 41.5363 c
20.4984 42.38 21.3563 43.2491 22.2049 44.13 c
22.1878 44.7023 22.0189 45.1222 21.8509 45.5441 c
20.3499 44.7667 19.4554 43.382 18.3153 42.2433 c
18.3153 42.2433 l
p
7.2376 87.0294 m
7.3402 84.9323 11.7869 84.5382 12.5408 86.2042 c
11.2064 86.8219 8.8846 87.484 7.2376 87.0294 c
7.2376 87.0294 l
p
36.2298 121.9147 m
22.8411 117.2325 13.367 108.6339 7.3553 96.5758 c
7.5257 96.2365 8.0565 96.8331 8.2982 96.4576 c
8.3065 95.8395 8.659 95.1393 7.9442 95.0431 c
7.4578 95.1857 7.8104 96.1666 7.2376 96.2223 c
5.5828 93.5558 4.4949 90.3219 3.702 86.7941 c
4.5848 86.1842 5.9105 86.0167 7.2376 85.8512 c
7.1087 86.7433 6.3885 87.0455 6.1766 87.8546 c
6.702 88.2325 7.3016 88.5367 7.8265 88.9157 c
9.0609 88.2487 11.1512 87.8595 12.7767 87.9728 c
12.7391 86.9147 13.1986 85.9611 13.7196 85.1437 c
12.994 84.5729 12.2532 84.0177 11.4803 83.4943 c
9.6488 84.2555 7.2488 84.671 4.8802 84.5548 c
4.6595 85.2765 4.452 86.0118 3.702 86.2042 c
3.0154 85.1808 2.8655 83.7242 2.6409 82.4327 c
2.4051 81.0763 2.1507 79.6632 2.0516 78.3082 c
0.7332 60.1969 8.0071 47.6281 16.4295 38.5909 c
17.4544 39.255 18.4241 39.9757 19.0223 41.0656 c
18.7283 41.5558 17.5721 41.1866 16.9017 41.3019 c
16.9188 41.9484 16.9144 42.5714 16.7835 43.0695 c
18.4871 43.9132 19.3167 44.923 20.4368 46.3683 c
21.3211 46.2199 22.597 46.2804 23.2654 46.2511 c
23.3035 45.2687 23.618 44.5616 23.8553 43.7765 c
21.9241 42.132 19.8543 40.6261 18.7869 38.1179 c
18.2908 38.3679 17.7352 38.5599 16.9017 38.4719 c
17.2855 37.2239 18.5452 36.4799 19.494 35.6439 c
26.3402 29.6089 35.7913 25.3159 46.9534 23.5049 c
34.6458 24.6729 25.0804 30.1319 17.4905 36.9409 c
11.8963 41.9601 7.5823 48.8644 4.6444 56.505 c
3.533 59.3937 2.5775 62.7311 2.0516 65.9337 c
-0.2829 80.152 4.3861 92.6188 9.2405 101.2897 c
13.9988 107.5172 19.2083 114.1129 26.6839 118.1432 c
27.8499 118.7716 29.2484 119.358 30.5726 120.0284 c
32.4378 120.9733 33.6722 121.9547 36.2298 121.9147 c
36.2298 121.9147 l
p
f
38.9398 121.9147 m
47.9056 121.4034 59.4105 121.9747 67.2249 121.443 c
66.7464 120.5792 65.4417 120.9718 64.6312 120.9718 c
55.5491 120.9718 49.0511 120.7057 40.3538 121.089 c
39.8402 121.1119 38.6702 120.9479 38.4691 121.6788 c
38.6429 121.7399 38.7659 121.8532 38.9398 121.9147 c
38.9398 121.9147 l
p
f
grestore
40.0003 120.6178 m
40.1195 120.6178 40.2366 120.6178 40.3538 120.6178 c
40.5736 117.7506 40.7318 115.2135 40.472 112.0143 c
39.682 112.1193 39.9124 113.4181 39.8831 114.1359 c
39.8079 116.0143 39.9398 118.4445 39.8831 120.2643 c
39.8499 120.4547 39.9945 120.4674 40.0003 120.6178 c
40.0003 120.6178 l
p
false s
0.7 .45 0 0 k
f
gsave
-26.82 138.7179 m
-26.82 42.337 l
49.7161 42.337 l
49.7161 138.7179 l
-26.82 138.7179 l
clp
48.1331 120.5006 m
48.5189 118.2926 48.5238 114.3444 48.1331 112.0143 c
47.3363 112.0802 47.6663 113.2408 47.6614 113.7824 c
47.6409 115.6901 47.6761 118.2189 47.6614 120.1466 c
47.6614 120.2643 47.6614 120.382 47.6614 120.5006 c
47.8187 120.5006 47.9749 120.5006 48.1331 120.5006 c
48.1331 120.5006 l
p
f
53.3187 120.5006 m
53.1624 118.692 56.3265 119.4025 56.5003 117.5538 c
56.2796 117.2194 55.5804 116.8849 55.0863 117.2003 c
55.1468 117.8312 55.6976 117.5138 56.0296 117.6715 c
54.6976 118.608 51.3363 118.6305 50.0179 117.6715 c
49.9339 117.3517 50.5745 117.756 50.4905 117.4357 c
50.3909 116.8556 49.7464 117.4796 49.429 117.4357 c
49.6761 118.8785 51.2425 119.0011 52.4925 119.4396 c
52.5257 119.8634 52.2757 120.0075 52.2581 120.382 c
52.4534 120.5792 52.9495 120.4752 53.3187 120.5006 c
53.3187 120.5006 l
p
f
grestore
47.0726 120.2643 m
47.5648 117.8331 47.1702 115.2531 47.307 112.1325 c
46.7601 114.3737 47.2269 117.631 47.0726 120.2643 c
47.0726 120.2643 l
p
f
48.723 120.2643 m
48.8597 120.2833 48.932 120.2379 48.9573 120.1466 c
48.7757 117.0602 49.178 115.2199 48.6038 112.3678 c
48.806 115.0817 48.5335 117.6046 48.723 120.2643 c
48.723 120.2643 l
p
f
32.222 119.5573 m
32.1839 118.9342 31.8597 118.0787 31.1624 118.4962 c
31.3441 118.9747 31.5579 119.9415 32.222 119.5573 c
32.222 119.5573 l
p
f
38.7044 118.2609 m
38.178 117.6871 37.7855 116.9796 37.4085 116.2575 c
37.4915 116.7628 37.5999 117.2433 37.8792 117.5538 c
37.5374 118.0763 36.9241 118.3268 36.348 118.6144 c
36.3109 116.921 37.1195 115.0709 37.6439 113.5465 c
37.9202 113.5094 38.0863 113.3605 38.4691 113.4288 c
38.4144 112.8156 38.0296 112.5328 37.8792 112.0143 c
37.4212 112.3029 36.889 112.5162 36.348 112.7218 c
36.5609 114.4352 35.5814 115.9572 35.1683 117.4357 c
35.5902 118.1534 35.9945 118.8898 36.348 119.6749 c
37.4075 119.4782 38.0345 118.8473 38.7044 118.2609 c
38.7044 118.2609 l
p
f
46.6019 117.6715 m
46.2913 117.3961 46.1536 118.0089 45.7757 118.025 c
44.6116 118.1617 43.3929 118.1827 42.3577 117.9074 c
41.9173 117.924 41.847 117.1808 41.5335 117.4357 c
41.8841 119.5245 46.182 120.0748 46.6019 117.6715 c
46.6019 117.6715 l
p
f
42.1224 117.4357 m
42.5296 117.5182 42.5452 117.0226 42.3577 116.8468 c
41.9495 116.7643 41.9359 117.2599 42.1224 117.4357 c
42.1224 117.4357 l
p
f
28.6868 115.3146 m
29.4476 113.3634 30.3382 111.5446 31.8695 110.3649 c
32.0863 112.2028 30.5023 115.5309 28.6868 115.3146 c
28.6868 115.3146 l
p
31.0433 116.2575 m
31.8167 113.9816 34.555 112.0319 32.8118 109.3043 c
31.97 109.3658 31.2855 109.5841 30.3372 109.5402 c
29.4945 110.7799 28.8304 112.1989 27.7445 113.1935 c
27.7952 114.0455 28.0726 114.6715 28.098 115.5504 c
27.9085 115.9899 27.305 116.0143 26.6839 116.0216 c
26.6448 116.5709 26.7747 116.9508 26.9193 117.318 c
28.3128 116.9835 29.6839 116.6266 31.0433 116.2575 c
31.0433 116.2575 l
p
f
37.4085 116.1393 m
37.8265 115.9694 37.5609 115.1134 37.8792 114.8429 c
38.3363 114.7125 38.2991 115.2599 38.5872 114.9611 c
38.5257 114.7867 38.4124 114.6642 38.3509 114.4894 c
37.6351 114.6193 37.181 115.4366 37.4085 116.1393 c
37.4085 116.1393 l
p
f
41.7679 114.8429 m
42.9573 114.4606 43.5921 113.5245 43.7718 112.1325 c
43.0863 112.7819 42.8597 113.8908 41.6507 114.0182 c
41.6527 114.3312 41.6058 114.691 41.7679 114.8429 c
41.7679 114.8429 l
p
f
gsave
-26.82 138.7179 m
-26.82 42.337 l
49.7161 42.337 l
49.7161 138.7179 l
-26.82 138.7179 l
clp
46.4827 114.6071 m
46.1644 113.629 45.0687 113.4283 44.8323 112.3678 c
44.6995 113.3283 45.3568 114.5148 46.4827 114.6071 c
46.4827 114.6071 l
p
f
52.0218 112.0143 m
51.8499 111.8322 51.4183 111.9108 51.0784 111.8966 c
50.805 112.173 50.7659 112.6832 50.3714 112.8395 c
50.3529 112.4752 50.6507 112.1735 50.3714 111.8966 c
49.9886 111.8287 49.8245 111.9772 49.5472 112.0143 c
49.1937 113.2008 49.762 114.2526 50.7249 114.4894 c
50.9085 113.4161 52.0823 113.3326 52.0218 112.0143 c
52.0218 112.0143 l
p
f
grestore
26.2122 113.4288 m
26.9232 111.7438 27.8216 110.2457 28.9222 108.9503 c
29.3675 108.8502 29.4759 109.3419 29.7484 109.068 c
29.6155 108.4157 29.9779 107.795 29.7484 107.4181 c
28.9749 107.3922 28.5296 107.692 27.8616 107.7721 c
27.5892 107.3761 27.8206 106.4777 27.7445 105.8864 c
26.8382 105.8053 26.2933 106.0856 25.387 106.0045 c
24.8641 107.6813 23.5247 108.5421 22.5584 109.775 c
22.1863 109.8331 22.1419 109.5631 21.7337 109.6574 c
21.7635 110.3346 21.6448 111.1598 21.8509 111.6608 c
22.556 111.6588 22.8821 111.2775 23.619 111.3073 c
24.1639 109.691 25.4573 108.8243 26.2122 107.4181 c
26.6448 107.4562 27.0198 107.0822 27.2718 107.3004 c
27.7796 109.5372 25.846 110.3522 25.2689 111.8966 c
24.909 111.9821 24.9227 111.6935 24.5618 111.7789 c
24.5067 113.2345 24.8724 114.2286 26.2122 113.4288 c
26.2122 113.4288 l
p
f
46.4827 113.5465 m
46.4827 113.0748 46.4827 112.6036 46.4827 112.1325 c
46.2415 111.9503 45.428 111.9503 45.1868 112.1325 c
45.3577 112.8649 45.7493 113.3766 46.4827 113.5465 c
46.4827 113.5465 l
p
f
gsave
-26.82 138.7179 m
-26.82 42.337 l
49.7161 42.337 l
49.7161 138.7179 l
-26.82 138.7179 l
clp
41.7679 113.4288 m
42.7405 113.4967 42.8089 112.6622 43.1829 112.1325 c
42.9818 111.8629 42.2835 112.089 41.887 112.0143 c
41.7825 112.3976 41.5013 113.046 41.7679 113.4288 c
41.7679 113.4288 l
p
f
51.7864 111.0719 m
51.6214 110.4157 50.6839 110.7316 50.2542 110.7179 c
47.3441 110.6256 43.8714 110.7179 41.2972 110.8361 c
40.2581 110.8839 39.0316 110.5201 38.2327 111.1896 c
38.2132 111.484 38.4144 111.5582 38.5872 111.6608 c
42.4964 111.4113 46.3226 111.881 50.6077 111.5431 c
50.9339 111.5172 51.846 111.8156 51.7864 111.0719 c
51.7864 111.0719 l
p
f
51.1976 109.4215 m
50.888 108.2936 49.3255 108.9186 48.4857 108.9503 c
44.557 109.0968 39.8011 108.5607 35.5218 108.9503 c
35.3831 109.7809 35.8792 109.4318 36.2298 109.5402 c
37.887 110.049 40.9544 109.6574 43.6546 109.6574 c
46.4515 109.6574 49.2288 109.8429 51.1976 109.4215 c
51.1976 109.4215 l
p
f
grestore
20.4368 104.9435 m
21.2244 104.2462 21.7152 102.6495 23.2654 103.4113 c
23.1727 105.2037 21.9139 105.8317 21.0267 106.8287 c
20.8231 106.2076 20.6888 105.5162 20.4368 104.9435 c
20.4368 104.9435 l
p
18.6693 105.4147 m
19.0638 105.2467 19.807 105.2467 20.2015 105.4147 c
22.2405 107.8263 16.8748 108.6119 18.6693 105.4147 c
18.6693 105.4147 l
p
18.9051 108.9503 m
19.8499 108.8351 20.47 108.3942 21.6155 108.4791 c
22.5374 107.2013 23.0687 105.5324 25.0335 105.297 c
25.1561 104.9645 25.2581 104.1945 25.0335 103.8829 c
24.6004 103.8444 23.9896 103.983 23.7366 103.7643 c
23.5047 103.4474 23.6668 102.735 23.619 102.2325 c
21.6185 101.1388 21.1868 103.1007 19.848 103.6471 c
19.8216 104.0265 20.0565 104.1456 19.9656 104.59 c
19.2708 104.4323 18.5242 104.441 17.9622 104.7081 c
16.931 106.3605 18.6072 107.5402 18.9051 108.9503 c
18.9051 108.9503 l
p
f
36.9359 108.361 m
34.5198 106.0631 31.8265 104.0426 29.0413 102.1149 c
28.7347 101.7921 28.5618 101.3361 27.8616 101.4074 c
30.3695 104.007 33.5081 105.9752 36.2298 108.361 c
36.4652 108.361 36.7015 108.361 36.9359 108.361 c
36.9359 108.361 l
p
f
43.7718 106.0045 m
43.5745 104.2672 46.1331 104.9728 47.4261 104.3541 c
48.0667 104.047 47.8011 103.6095 48.4857 103.6471 c
48.3558 104.9855 47.2523 106.5104 45.8929 105.5328 c
45.7913 105.7853 45.93 106.1603 45.7757 106.5934 c
45.0609 107.193 43.8675 106.8419 43.7718 106.0045 c
43.7718 106.0045 l
p
48.723 102.5866 m
47.932 103.1276 47.6019 103.9889 46.3655 104.236 c
44.9749 104.5133 43.8519 104.1056 43.4183 105.1788 c
42.9847 106.254 43.8382 107.2736 44.8323 107.4181 c
47.1575 107.757 49.0628 105.3644 48.723 102.5866 c
48.723 102.5866 l
p
f
41.6507 103.0573 m
41.2054 103.0709 41.0169 102.8273 40.9437 102.4684 c
40.8636 101.5431 41.6282 101.0363 42.4759 101.4074 c
43.2562 103.088 41.6937 104.2643 41.4154 105.6505 c
40.4613 104.9655 40.9134 103.6027 41.6507 103.0573 c
41.6507 103.0573 l
p
42.2405 106.7111 m
41.43 105.2477 45.0277 100.7482 41.887 100.7003 c
39.1937 100.6598 39.8988 106.3595 42.2405 106.7111 c
42.2405 106.7111 l
p
f
46.9534 102.2325 m
44.7347 103.0997 44.6702 100.028 43.1829 99.4039 c
44.0247 99.1359 45.3929 99.297 45.6585 99.9933 c
45.8187 100.401 45.1273 100.549 45.5394 100.819 c
46.0316 100.8776 46.0599 100.4738 46.6019 100.5831 c
47.1507 100.8605 47.348 101.6344 46.9534 102.2325 c
46.9534 102.2325 l
p
47.5433 100.5831 m
46.806 99.2282 44.2171 98.3302 42.4759 99.4039 c
43.4993 100.1486 44.5579 100.8575 44.8323 102.3507 c
45.9886 103.4635 48.0804 102.8224 47.5433 100.5831 c
47.5433 100.5831 l
p
f
10.6551 101.526 m
10.9271 101.5616 10.786 101.1852 11.0091 101.1715 c
10.8416 100.2042 9.638 99.4645 10.4193 98.5787 c
10.9202 98.7462 11.2108 99.1237 11.598 99.4039 c
13.2947 98.5641 15.1155 96.4406 17.2547 97.1647 c
17.6502 96.6959 17.9564 96.1373 18.1981 95.5153 c
17.3226 95.5651 16.8099 95.2521 16.1942 95.0431 c
14.5701 96.2867 12.8182 97.4025 10.4193 97.8722 c
10.1673 98.445 9.8494 98.9523 9.4764 99.4039 c
9.6927 100.2887 10.4569 100.6246 10.6551 101.526 c
10.6551 101.526 l
p
f
30.9261 97.5192 m
28.137 97.5192 25.348 97.5192 22.5584 97.5192 c
22.4422 98.1505 23.6292 98.6715 24.3265 99.2863 c
25.1258 99.9913 25.7855 100.8463 26.5648 101.4074 c
28.2171 100.3097 29.5003 98.8424 30.9261 97.5192 c
30.9261 97.5192 l
p
f
30.5726 96.8116 m
28.4095 96.3419 24.9173 96.5739 22.5584 96.6935 c
24.1717 97.3312 28.1654 97.1525 30.5726 96.8116 c
30.5726 96.8116 l
p
f
15.7225 94.4542 m
16.1741 94.0416 16.5267 93.5299 16.6658 92.8043 c
16.0242 92.6603 15.2796 92.6188 14.8973 92.2155 c
13.4529 92.8922 12.1707 94.5861 10.1839 93.983 c
9.9378 94.6403 9.4168 95.0231 9.3587 95.8683 c
9.9036 95.9528 10.3778 96.1066 10.7733 96.34 c
11.9197 95.2477 13.3372 94.4254 15.0154 93.8649 c
15.4276 93.8859 15.6092 94.1364 15.7225 94.4542 c
15.7225 94.4542 l
p
f
27.7445 95.7511 m
27.5062 94.4025 27.7581 92.5514 27.8616 91.1544 c
28.5062 91.1378 29.0355 91.2379 29.512 91.3898 c
29.4847 92.8947 29.4534 94.3961 29.2767 95.7511 c
28.8968 96.0143 28.1663 95.8151 27.7445 95.7511 c
27.7445 95.7511 l
p
29.7484 96.1041 m
29.7083 94.297 29.9554 92.7775 29.8655 90.9186 c
29.222 90.7902 28.014 90.6832 27.3909 90.9186 c
27.3978 92.6935 27.1888 94.2521 27.2718 96.1041 c
28.0804 96.3175 28.9866 96.3688 29.7484 96.1041 c
29.7484 96.1041 l
p
f
23.9725 95.7511 m
23.806 94.6437 24.0198 92.4962 24.0906 91.2726 c
24.5628 91.0118 25.3695 91.2897 25.8577 91.3898 c
25.8948 92.9186 25.8402 94.3571 25.7405 95.7511 c
25.307 96.0055 24.4403 95.837 23.9725 95.7511 c
23.9725 95.7511 l
p
23.619 96.2223 m
24.4188 96.1574 25.4857 96.3605 26.0941 96.1041 c
26.0238 94.2662 26.182 92.6559 26.2122 90.9186 c
25.595 90.7267 24.2357 90.7267 23.619 90.9186 c
23.7786 92.7853 23.2913 94.5739 23.619 96.2223 c
23.619 96.2223 l
p
f
26.5648 96.2223 m
26.7562 96.2555 26.7679 96.111 26.9193 96.1041 c
26.7093 94.2452 27.6038 91.7384 26.5648 90.8014 c
26.3704 92.3405 26.3704 94.6832 26.5648 96.2223 c
26.5648 96.2223 l
p
f
23.0296 96.1041 m
23.4627 94.8024 23.2127 92.2101 23.2654 90.9186 c
22.5169 91.984 23.0228 94.9923 23.0296 96.1041 c
23.0296 96.1041 l
p
f
gsave
-26.82 138.7179 m
-26.82 42.337 l
49.7161 42.337 l
49.7161 138.7179 l
-26.82 138.7179 l
clp
30.1019 96.1041 m
30.6409 94.9054 30.4193 92.1725 30.4554 90.9186 c
29.8558 92.2755 30.2933 94.0582 30.1019 96.1041 c
30.1019 96.1041 l
p
f
51.9046 92.3331 m
50.1341 91.8639 49.1038 90.6554 48.6038 88.9157 c
47.6019 88.5973 46.4027 88.9528 45.7757 89.3868 c
45.7679 91.9879 48.6116 93.9786 50.4905 94.8082 c
51.4866 95.2477 51.7991 93.3649 51.9046 92.3331 c
51.9046 92.3331 l
p
f
9.9481 93.1574 m
9.8743 92.6813 9.2381 92.7677 9.1234 92.3331 c
9.5423 91.5983 12.3123 90.2145 13.366 90.6832 c
13.6707 90.8185 14.0316 91.1534 13.9549 91.6256 c
14.4378 91.048 14.9661 90.5158 15.2518 89.7404 c
14.4388 89.6095 13.8807 89.2257 13.366 88.797 c
12.0511 89.319 9.428 91.1217 8.2982 89.6222 c
7.9036 90.0919 7.5799 90.6325 7.3553 91.2726 c
7.9241 91.4493 8.4647 91.6554 8.8875 91.9796 c
8.8255 92.6246 8.3758 92.882 8.2982 93.5114 c
8.7991 94.2789 9.9539 94.4166 9.9481 93.1574 c
9.9481 93.1574 l
p
f
55.557 88.9157 m
55.1488 89.0553 54.7698 89.2286 54.3792 89.3868 c
54.6077 88.8297 55.3753 88.8116 56.0296 88.6798 c
56.0316 89.0753 55.8655 89.3029 55.6761 89.5045 c
55.6116 89.3331 55.8128 88.8956 55.557 88.9157 c
55.557 88.9157 l
p
53.4359 90.3292 m
52.6995 90.3986 53.2445 89.1852 52.4925 89.2687 c
52.473 89.0133 52.9105 89.2155 53.0823 89.151 c
52.7542 88.6754 51.8128 88.9718 51.7864 89.5045 c
50.9085 88.6144 49.2972 88.4576 48.4857 87.5011 c
48.6644 87.3307 49.0843 87.9191 49.3109 88.0905 c
49.5238 87.5216 48.5296 87.1456 48.6038 86.3224 c
48.18 86.3702 48.4202 87.0817 48.014 87.1476 c
48.0823 87.9845 48.6439 88.3253 49.1937 88.6798 c
48.7874 93.3253 56.8831 92.6823 56.264 88.6798 c
56.8284 88.1832 57.5413 87.8351 57.4437 86.6764 c
57.0745 86.6222 57.0667 86.9279 57.0902 87.2653 c
56.4788 88.2633 54.9339 88.3302 54.0257 89.0328 c
54.0003 89.6241 53.9827 90.0416 53.4359 90.3292 c
53.4359 90.3292 l
p
f
grestore
41.18 90.5651 m
41.0345 90.1241 38.972 89.6657 39.1761 90.6832 c
39.6741 90.7413 40.8929 91.0475 41.18 90.5651 c
41.18 90.5651 l
p
f
31.1624 90.2116 m
29.8675 89.9957 28.637 90.0367 27.3909 90.0939 c
25.7308 90.1696 23.6536 89.5719 22.2049 90.2116 c
22.8973 90.694 23.8885 90.423 24.7977 90.4474 c
26.8011 90.5006 29.3773 90.9362 31.1624 90.2116 c
31.1624 90.2116 l
p
f
44.598 89.858 m
44.2386 89.1412 42.1585 89.566 41.4154 89.6222 c
41.4154 89.7404 41.4154 89.858 41.4154 89.9762 c
42.18 90.0914 44.0286 90.3253 44.598 89.858 c
44.598 89.858 l
p
f
41.18 89.858 m
41.43 88.38 42.9945 88.2159 44.4788 87.9728 c
44.4124 87.4352 44.6878 87.2384 44.598 86.6764 c
43.2952 87.0636 42.3558 87.8126 41.4154 88.5616 c
41.1751 88.527 41.1839 88.2428 40.9437 88.2086 c
41.1087 87.588 41.5462 87.2389 42.0042 86.9117 c
42.1302 87.277 41.2581 87.6559 41.2972 88.3258 c
42.3597 86.9137 44.8714 86.9508 45.1868 84.7902 c
44.7874 85.796 43.2523 85.9401 42.3577 85.2618 c
41.3929 85.8673 41.3196 87.3663 40.5902 88.2086 c
39.9945 86.9371 40.9749 84.9235 40.5902 83.4943 c
40.3128 83.4562 40.1478 83.3073 39.7659 83.3756 c
39.6644 85.4362 40.1038 88.0363 39.1761 89.2687 c
39.638 89.2594 39.9114 89.0612 40.2366 88.9157 c
40.5296 89.2159 39.5911 89.2848 39.6468 89.7404 c
39.9652 89.9723 40.678 89.8102 41.18 89.858 c
41.18 89.858 l
p
f
32.6937 89.7404 m
32.887 88.337 30.3988 88.9264 29.3939 88.9157 c
28.2054 88.9015 26.9446 88.6798 25.8577 88.797 c
25.6331 88.7843 25.9964 88.403 25.8577 88.0905 c
25.0091 87.9088 24.7381 88.3053 24.4442 88.6798 c
23.9407 84.6071 24.8558 79.7228 24.0906 76.6578 c
23.951 80.3053 23.7381 84.778 23.9725 88.6798 c
23.7322 88.9503 22.994 88.7223 22.5584 88.797 c
22.7049 88.4728 23.6502 88.9469 23.5013 88.3258 c
23.3861 87.8126 22.3494 88.2203 21.8509 88.0905 c
21.8509 87.0294 21.8509 85.9689 21.8509 84.9083 c
22.2034 84.671 22.9632 84.8409 23.5013 84.7902 c
23.0516 84.1481 23.6175 83.9362 23.5013 83.0226 c
23.221 82.9489 22.9525 82.8639 22.9119 82.5514 c
22.7537 82.8248 22.491 82.9943 22.2049 83.1398 c
22.0272 83.8287 22.4998 83.8663 22.6761 84.2013 c
22.6644 84.5031 22.2371 84.3903 22.0872 84.5548 c
21.6409 82.4103 21.9842 80.4625 21.9691 78.5441 c
21.9656 78.0641 22.0335 77.0314 21.4979 76.6578 c
21.3875 80.5153 21.429 84.5206 21.3797 88.5616 c
21.2186 88.8717 20.4925 88.6173 20.5555 89.151 c
21.5989 90.0226 24.701 89.5538 26.0941 89.6222 c
28.2738 89.7291 30.5052 89.7877 32.6937 89.7404 c
32.6937 89.7404 l
p
f
26.9193 88.6798 m
26.9046 88.4684 27.0628 88.4308 27.0364 88.2086 c
26.8655 88.0348 26.2659 88.0348 26.0941 88.2086 c
26.054 88.6798 26.431 88.7355 26.9193 88.6798 c
26.9193 88.6798 l
p
f
28.098 88.6798 m
28.0823 88.4684 28.2425 88.4308 28.2152 88.2086 c
28.0443 88.0348 27.4437 88.0348 27.2718 88.2086 c
27.2718 88.3258 27.2718 88.444 27.2718 88.5616 c
27.4241 88.7238 27.7855 88.6783 28.098 88.6798 c
28.098 88.6798 l
p
f
28.5687 88.6798 m
28.6868 88.6798 28.805 88.6798 28.9222 88.6798 c
29.0423 84.6442 29.2718 80.3522 28.9222 76.7765 c
28.2874 77.132 28.5687 78.1359 28.5687 78.7799 c
28.5687 81.6998 28.4925 85.7282 28.5687 88.3258 c
28.5687 88.444 28.5687 88.5616 28.5687 88.6798 c
28.5687 88.6798 l
p
f
30.5726 88.6798 m
30.553 88.5426 30.598 88.4699 30.6898 88.444 c
30.6859 88.0548 30.3558 87.9933 29.9837 87.9728 c
29.8851 88.1095 29.8284 88.2882 29.8655 88.5616 c
30.0042 88.6974 30.2816 88.695 30.5726 88.6798 c
30.5726 88.6798 l
p
f
30.9261 88.6798 m
31.2952 88.5978 31.0804 88.3649 31.0433 88.0905 c
30.7445 88.1022 30.7659 88.5289 30.9261 88.6798 c
30.9261 88.6798 l
p
f
30.6898 79.84 m
30.7327 78.9381 31.3372 77.9747 31.3968 77.4835 c
31.2464 78.3239 31.6663 79.6427 31.2796 79.9586 c
31.2991 79.7028 30.8616 79.9049 30.6898 79.84 c
30.6898 79.84 l
p
29.512 77.3654 m
29.137 78.0182 29.848 78.5978 29.8655 79.2506 c
28.4847 80.2477 30.1624 80.8912 30.1019 82.4327 c
30.1155 82.879 29.4124 82.6085 29.3939 83.0226 c
29.2669 83.6207 29.6116 83.7477 29.8655 83.9655 c
29.9583 84.4508 29.3011 84.1866 29.3939 84.6725 c
29.9407 84.754 30.1556 85.1681 30.1019 85.8512 c
30.098 86.2789 29.5433 86.1574 29.3939 86.4401 c
29.387 87.337 30.1351 87.1598 29.512 87.8546 c
30.014 87.8068 30.7259 87.9689 31.0433 87.7365 c
30.9671 87.5787 30.7923 87.5172 30.5726 87.5011 c
30.5091 86.9655 31.1995 87.1866 31.1624 86.6764 c
31.2532 86.0743 30.4398 86.3756 30.3372 85.9689 c
30.2738 85.5133 30.5472 85.3937 30.4554 84.9083 c
30.4359 84.5748 31.181 85.006 31.1624 84.6725 c
31.3089 84.172 30.7698 84.3571 30.6898 84.0826 c
30.806 83.6491 31.3695 83.6617 31.2796 83.0226 c
31.1116 82.6803 30.5062 82.7755 30.3372 82.4327 c
30.2796 82.0612 30.5491 82.0172 30.4554 81.608 c
32.4241 82.3502 30.8314 86.6525 31.515 88.6798 c
31.9691 88.6412 31.9534 88.0953 31.9866 87.8546 c
32.2113 86.234 31.7171 84.5128 31.8695 82.5514 c
34.4573 83.9708 36.4905 85.943 39.0579 87.3834 c
38.972 86.2325 37.6898 85.816 36.9359 85.2618 c
34.5765 83.5255 32.0111 81.7575 29.6292 79.9586 c
32.9163 81.7018 35.8226 84.4498 39.0579 85.8512 c
39.0579 84.9474 39.0579 84.0441 39.0579 83.1398 c
38.3948 82.4288 37.4486 81.9996 37.055 81.0192 c
37.7054 79.6027 39.1878 78.756 39.0579 76.7765 c
38.7884 72.651 39.303 66.3927 39.0579 61.4547 c
38.8392 57.0499 39.0003 51.7491 38.9398 47.4288 c
38.305 47.2199 36.9905 47.2628 36.348 47.4288 c
35.8616 56.2023 36.9945 66.84 36.348 75.3619 c
36.1468 78.0045 35.2581 80.3727 32.1048 79.9586 c
31.6751 79.0353 32.182 77.6144 31.6331 76.6578 c
f
29.3939 88.5616 m
29.7054 88.5973 29.6976 88.3156 29.7484 88.0905 c
29.3538 87.9723 29.3607 88.2535 29.3939 88.5616 c
29.3939 88.5616 l
p
f
gsave
-26.82 138.7179 m
-26.82 42.337 l
49.7161 42.337 l
49.7161 138.7179 l
-26.82 138.7179 l
clp
22.2049 87.6188 m
22.3304 87.8864 22.9456 87.6637 23.2654 87.7365 c
23.0526 87.1735 23.2957 87.0739 23.619 86.7941 c
23.4652 86.0377 22.6868 86.1373 23.0296 85.1437 c
22.597 85.4181 22.8641 86.3922 22.0872 86.3224 c
21.8763 86.9694 22.9071 87.2135 22.2049 87.6188 c
22.2049 87.6188 l
p
f
49.429 87.5011 m
49.9876 87.1071 49.0706 86.6085 49.7825 86.4401 c
49.8519 86.0182 49.4339 86.0817 49.0755 86.087 c
48.6605 86.5221 49.0042 87.2433 49.429 87.5011 c
49.429 87.5011 l
p
f
47.6614 87.0294 m
47.8812 86.1881 48.5521 85.799 49.429 85.6154 c
49.4105 85.2423 49.7425 85.2213 49.6644 84.7902 c
49.1771 84.2174 48.8343 83.5001 48.1331 83.1398 c
46.9046 83.7194 46.3597 84.9821 46.012 86.4401 c
46.3519 86.8453 46.8353 87.109 47.6614 87.0294 c
47.6614 87.0294 l
p
f
grestore
40.9437 86.2042 m
41.3988 85.9528 41.6566 85.5026 41.887 85.026 c
41.7874 84.693 41.5589 84.4899 41.18 84.4366 c
41.0052 84.9308 41.0296 85.6222 40.9437 86.2042 c
40.9437 86.2042 l
p
f
40.8265 83.1398 m
41.4085 84.09 42.3118 84.7179 43.3011 85.2618 c
44.2152 84.4074 44.9105 83.3356 45.4222 82.0797 c
44.7796 81.8976 44.4154 81.4366 43.89 81.1368 c
42.7484 81.6837 41.1556 81.7809 40.8265 83.1398 c
40.8265 83.1398 l
p
f
gsave
-26.82 138.7179 m
-26.82 42.337 l
49.7161 42.337 l
49.7161 138.7179 l
-26.82 138.7179 l
clp
44.0081 85.2618 m
45.0579 84.504 45.9154 82.9274 46.3655 81.962 c
45.7913 81.2399 44.7464 80.9879 44.1253 80.3121 c
43.8079 81.3859 45.3773 81.4606 45.7757 82.1974 c
45.3109 83.3429 44.3988 84.0431 44.0081 85.2618 c
44.0081 85.2618 l
p
f
49.3109 83.7296 m
49.4222 83.816 49.4905 83.944 49.5472 84.0826 c
51.1087 83.5631 51.7933 82.1661 52.2581 80.547 c
51.4691 81.8019 50.3323 82.7076 49.3109 83.7296 c
49.3109 83.7296 l
p
f
25.5042 83.9655 m
25.9359 84.0714 25.6624 83.2999 25.387 83.3756 c
25.2894 83.7091 25.553 83.6813 25.5042 83.9655 c
25.5042 83.9655 l
p
f
46.9534 77.0123 m
47.1048 78.1447 46.5374 78.5597 45.8929 78.8981 c
46.4027 78.424 46.6195 77.6588 46.9534 77.0123 c
46.9534 77.0123 l
p
51.7864 80.6652 m
51.8226 80.3546 51.5404 80.3615 51.3148 80.3121 c
51.3148 80.0363 51.3148 79.7614 51.3148 79.4869 c
51.3616 79.0221 52.3636 79.5143 52.139 78.7799 c
52.2991 78.816 52.2366 79.0748 52.2581 79.2506 c
52.5316 79.1325 52.637 78.8453 52.6116 78.4254 c
52.2757 78.3556 52.1292 78.5309 51.4329 78.4254 c
50.7493 79.7072 50.1898 81.111 48.723 81.608 c
49.2904 80.9191 50.6419 79.9933 50.8431 78.5441 c
50.0374 78.5885 49.8275 78.5299 49.1937 78.7799 c
49.1087 79.1403 49.3138 79.2091 49.3109 79.4869 c
48.6546 78.0226 48.6898 75.8649 48.6038 73.8297 c
47.5003 74.0807 47.803 76.4039 47.8968 77.837 c
47.9554 78.7223 48.2445 79.6593 48.2503 80.547 c
47.3138 79.1666 47.6683 76.4948 47.307 74.5367 c
46.6429 74.6188 46.0071 74.7286 45.4222 74.8908 c
45.3499 76.4323 45.3441 77.8214 44.4788 78.7799 c
44.5843 78.15 44.9935 77.2887 44.8323 76.7765 c
43.807 77.3214 42.1292 77.8429 41.6507 78.5441 c
41.7913 79.1085 42.7425 78.8834 43.0648 78.6613 c
42.9905 80.1188 42.1038 80.7648 41.5335 81.7262 c
43.1429 81.5685 43.7581 80.4152 44.3616 79.2506 c
45.0804 79.3419 45.1859 78.8185 45.4222 78.4254 c
45.3851 78.6769 45.6751 78.9025 45.5394 79.2506 c
45.8821 79.4039 46.3773 79.4039 46.7181 79.2506 c
47.0999 79.4899 46.1839 79.4132 46.2464 79.7223 c
46.6409 80.5856 47.0472 81.4371 48.1331 81.608 c
48.0179 81.7682 47.7357 81.7614 47.6614 81.962 c
48.4827 84.3483 51.4183 82.2257 51.7864 80.6652 c
51.7864 80.6652 l
p
f
grestore
5.116 81.3722 m
4.5633 83.2643 6.6463 83.3478 6.8836 82.3151 c
7.0618 81.5402 6.1976 80.9259 5.116 81.3722 c
5.116 81.3722 l
p
f
42.3577 80.3121 m
41.4847 79.4557 39.973 79.2399 39.2933 78.1906 c
38.596 79.0245 38.0814 80.0426 37.5257 81.0192 c
37.9193 82.1969 39.2347 82.4528 40.2366 83.0226 c
41.5296 82.7057 40.973 80.5367 42.3577 80.3121 c
42.3577 80.3121 l
p
f
10.0657 82.4327 m
10.4793 82.4967 11.1209 82.2433 11.0091 81.4904 c
10.7083 79.4699 7.8553 82.0968 10.0657 82.4327 c
10.0657 82.4327 l
p
f
22.7943 82.4327 m
22.931 81.942 23.6131 81.9948 23.5013 81.2545 c
22.6068 80.3385 23.7664 79.004 23.619 77.7194 c
23.1634 78.0885 23.408 79.1578 22.9119 79.4869 c
22.3626 79.2501 22.6243 78.2033 22.2049 77.837 c
21.6883 78.776 23.222 80.4098 22.2049 81.4904 c
22.1121 82.0148 22.8372 81.7228 22.7943 82.1974 c
22.7943 82.4327 l
22.7943 82.4327 l
p
f
26.5648 79.84 m
27.6575 78.2609 28.2874 76.2199 29.2767 74.5367 c
27.8929 75.4713 27.6458 77.5426 26.6839 78.8981 c
25.1785 77.7316 25.0892 75.1491 23.2654 74.3009 c
24.4432 76.07 25.5687 77.8903 26.5648 79.84 c
26.5648 79.84 l
p
f
39.5296 77.9547 m
40.1956 78.86 41.1048 79.5221 42.5941 79.6051 c
42.053 78.8424 40.4534 78.0148 39.5296 77.9547 c
39.5296 77.9547 l
p
f
7.3553 77.1295 m
7.077 76.548 6.0594 76.9005 5.4696 77.0123 c
5.6112 77.7433 5.2186 78.4352 5.4696 78.8981 c
6.2215 78.4313 7.0555 78.0475 7.3553 77.1295 c
7.3553 77.1295 l
p
f
gsave
-26.82 138.7179 m
-26.82 42.337 l
49.7161 42.337 l
49.7161 138.7179 l
-26.82 138.7179 l
clp
41.7679 71.1193 m
42.3948 70.9645 42.6488 72.3068 42.2405 72.4157 c
42.2484 71.818 41.8226 71.6539 41.7679 71.1193 c
41.7679 71.1193 l
p
41.5335 78.0724 m
41.137 76.3483 42.2132 75.0724 42.0042 73.9479 c
41.8011 72.8571 40.4202 72.942 40.2366 71.7086 c
40.2454 71.2858 40.6937 71.2999 40.8265 71.0011 c
41.2171 71.2506 40.472 71.3434 40.5902 71.7086 c
40.971 72.6246 41.9925 72.8981 42.4759 73.712 c
42.2161 74.9454 42.1331 76.3556 41.887 77.6012 c
42.1761 77.8312 42.5081 77.3502 42.9476 77.3654 c
43.2464 76.0533 42.7698 73.9674 43.6546 73.2404 c
43.4202 72.6466 43.1517 71.8746 43.4183 71.1193 c
42.2113 70.4513 40.3489 70.3473 39.7659 71.5909 c
40.4984 73.8585 38.5218 78.3536 41.5335 78.0724 c
41.5335 78.0724 l
p
f
50.2542 77.2472 m
49.8655 76.2384 50.2864 74.3932 49.7825 73.2404 c
49.5863 73.2404 49.39 73.2404 49.1937 73.2404 c
48.9417 74.5963 48.9984 76.1603 49.1937 77.6012 c
49.6995 77.6359 49.973 77.4371 50.2542 77.2472 c
50.2542 77.2472 l
p
f
grestore
2.7586 75.4801 m
3.2103 75.3029 3.5286 74.9913 3.8192 74.6549 c
3.9056 74.3331 3.5853 74.4176 3.5838 74.1837 c
3.0447 74.2731 2.7982 74.6549 2.4051 74.8908 c
2.4749 75.1359 2.6531 75.2716 2.7586 75.4801 c
2.7586 75.4801 l
p
f
11.952 74.1837 m
11.6995 73.5314 10.8675 73.4601 10.7733 72.651 c
9.6654 73.2775 6.3494 73.527 5.5877 72.4157 c
4.9363 72.4713 4.6946 72.9371 4.2913 73.2404 c
4.5374 73.8981 5.1497 74.1886 5.4696 74.7731 c
6.3992 74.1315 8.158 74.318 9.7127 74.3009 c
10.3787 75.214 11.179 74.8556 11.952 74.1837 c
11.952 74.1837 l
p
f
22.3231 73.1227 m
22.7864 72.5988 22.4715 72.0201 22.7943 71.3551 c
23.9769 71.5338 24.6473 72.7658 25.9769 72.4157 c
26.2269 71.2907 25.9622 69.651 26.2122 68.5265 c
25.3812 68.9533 25.9788 70.8077 25.6234 71.7086 c
24.9725 71.1329 25.7366 69.5353 25.387 68.879 c
24.8441 69.2794 25.1976 70.5758 24.9158 71.2369 c
24.4305 70.9757 24.7908 69.8693 24.6795 69.2335 c
24.0467 69.3859 24.6248 70.7496 24.0906 71.0011 c
23.8196 70.7223 24.0487 69.9435 23.9725 69.4689 c
23.4945 69.5411 23.6829 70.2794 23.5013 70.6481 c
23.0902 70.587 23.3284 69.8776 23.2654 69.4689 c
23.0931 69.5724 22.8919 69.6461 22.9119 69.9406 c
22.7537 69.8629 22.6922 69.6881 22.6761 69.4689 c
22.7928 68.838 23.5535 68.8536 23.9725 68.5265 c
23.7781 67.7892 24.7747 67.4161 25.7405 67.4669 c
25.8577 66.8771 25.3353 66.9279 25.0335 66.7599 c
24.91 67.297 24.6946 66.9786 24.3265 66.8771 c
24.2401 67.1984 24.5604 67.1134 24.5618 67.3478 c
24.1077 67.8751 23.1502 67.9005 22.7943 68.5265 c
22.6395 68.4845 22.6092 68.3185 22.4407 68.2911 c
22.5882 67.6915 22.8992 67.256 23.3836 66.9943 c
22.8743 66.6075 22.5062 67.3693 22.2049 67.5841 c
21.6751 67.5236 21.492 67.1173 21.1439 66.8771 c
20.9559 67.382 22.0574 67.6105 21.7337 68.6437 c
20.6483 68.3556 20.3441 66.922 19.0223 67.2296 c
19.1287 67.5743 19.1287 67.5919 19.0223 67.9366 c
20.4549 67.5529 20.6971 69.0958 21.7337 69.4689 c
21.8304 69.8029 21.5677 69.7745 21.6155 70.0582 c
21.2987 70.1403 21.388 69.8151 21.262 69.7047 c
20.9656 69.8014 21.0975 70.3263 20.9085 70.5299 c
20.5101 70.4572 20.7591 69.7365 20.5555 69.4689 c
20.0125 69.5158 20.6258 70.7189 20.0833 70.7653 c
19.8016 70.3409 19.9964 69.4386 19.494 69.2335 c
19.4993 69.9064 19.4495 70.5241 19.2586 71.0011 c
18.7244 70.7501 19.2181 69.4708 18.9051 68.9982 c
18.2772 69.2736 19.0609 70.9611 18.4339 71.2369 c
18.1888 71.2062 18.4017 70.7194 18.1981 70.6481 c
17.7567 70.7565 18.0438 71.5944 17.9622 72.0621 c
19.2835 73.0485 19.9954 71.0524 21.7337 71.3551 c
21.8436 71.441 21.9119 71.5695 21.9691 71.7086 c
21.9969 72.2076 21.7244 72.4064 21.3797 72.5333 c
21.6497 72.7741 21.8255 73.1095 22.3231 73.1227 c
22.3231 73.1227 l
p
f
2.4051 72.4157 m
3.8187 73.0026 2.6141 69.9542 3.8192 69.9406 c
4.2864 70.1412 4.1922 70.9034 4.5267 71.2369 c
6.5628 71.0153 9.5853 70.8844 10.8909 72.298 c
11.4129 72.1129 11.8665 71.8595 12.1873 71.4728 c
11.9671 70.8287 11.3314 70.6002 11.0091 70.0582 c
8.7777 70.5563 5.6536 70.025 4.1732 68.9982 c
3.7904 69.5568 3.2435 69.9533 2.6409 70.2941 c
2.5111 70.9406 2.4188 72.0172 2.4051 72.4157 c
2.4051 72.4157 l
p
f
43.7718 69.9406 m
43.9593 69.4982 44.263 69.174 44.2445 68.5265 c
42.7093 68.4181 41.3704 68.5861 39.7659 68.4083 c
38.8343 70.7223 42.1878 69.7506 43.7718 69.9406 c
43.7718 69.9406 l
p
f
10.8909 69.3517 m
11.5555 69.3087 11.9251 68.9708 12.4232 68.7618 c
12.3206 68.0783 11.5145 68.0997 11.598 67.2296 c
9.9515 67.6993 7.1971 67.337 6.2947 66.2872 c
6.744 64.7726 11.0081 65.3273 11.4803 66.7599 c
11.8016 66.3341 12.4862 66.2716 13.0125 66.0509 c
12.8607 65.299 12.1922 65.0646 12.0692 64.2833 c
10.6663 64.7687 7.2322 64.5802 6.8836 62.8698 c
6.2196 62.9127 5.8499 63.2487 5.3514 63.4596 c
5.5203 64.3107 6.3729 64.4806 6.5306 65.3439 c
6.1683 65.9259 5.471 66.17 4.8802 66.5226 c
5.2952 67.2472 5.6688 68.0138 6.2947 68.5265 c
7.7991 68.4259 10.2816 68.1818 10.8909 69.3517 c
10.8909 69.3517 l
p
f
43.4183 67.8185 m
43.9622 66.7521 43.5023 64.6818 43.6546 63.2233 c
42.8675 64.1603 43.4691 66.7911 43.4183 67.8185 c
43.4183 67.8185 l
p
f
43.89 67.8185 m
44.0804 67.8517 44.0921 67.7081 44.2445 67.7013 c
44.1146 66.1212 44.2503 65.3253 44.2445 63.2233 c
43.7796 64.6329 44.0218 66.2697 43.89 67.8185 c
43.89 67.8185 l
p
f
28.5687 67.7013 m
28.3607 67.4533 28.303 67.3536 28.4515 66.9943 c
27.5413 66.6163 27.6527 67.1154 27.0364 66.7599 c
26.5745 66.9669 27.6165 67.257 27.1546 67.4669 c
27.5023 67.6115 28.1663 67.3712 28.5687 67.7013 c
28.5687 67.7013 l
p
f
gsave
-26.82 138.7179 m
-26.82 42.337 l
49.7161 42.337 l
49.7161 138.7179 l
-26.82 138.7179 l
clp
12.3055 63.4596 m
12.9588 63.4049 13.2781 63.0182 13.7196 62.7506 c
13.7083 61.9371 13.1571 61.6637 13.2479 60.7477 c
11.6234 60.3297 9.7283 60.1832 8.8875 58.9796 c
7.8612 59.3683 6.9437 59.8649 6.1766 60.5114 c
6.4271 61.4 7.2166 61.7516 7.3553 62.7506 c
7.8763 62.6041 8.1458 62.2067 8.6517 62.0446 c
8.16 61.5934 7.6361 61.1735 7.5911 60.277 c
8.1766 60.3356 11.075 60.9371 12.0692 61.5739 c
12.9652 62.1442 12.5438 62.8112 12.3055 63.4596 c
12.3055 63.4596 l
p
f
66.0472 62.3981 m
66.7464 60.5387 64.0023 61.3336 63.0999 61.3375 c
56.5706 61.3649 46.6019 61.1676 39.4114 61.4547 c
39.4847 61.775 39.262 62.3903 39.5296 62.5153 c
47.4163 62.7037 57.8734 62.8346 66.0472 62.3981 c
66.0472 62.3981 l
p
f
grestore
10.8909 62.1617 m
11.1761 61.8688 10.5404 61.4977 10.0657 61.5739 c
10.2376 61.8727 10.7801 61.8004 10.8909 62.1617 c
10.8909 62.1617 l
p
f
24.2083 61.1012 m
24.5672 60.9879 24.6829 60.6325 25.2689 60.7477 c
25.4691 60.195 24.7152 60.5934 24.9158 60.0407 c
24.5906 60.2262 24.5682 60.7145 23.9725 60.6305 c
24.0233 60.816 24.3431 60.7301 24.2083 61.1012 c
24.2083 61.1012 l
p
f
gsave
-26.82 138.7179 m
-26.82 42.337 l
49.7161 42.337 l
49.7161 138.7179 l
-26.82 138.7179 l
clp
41.4154 60.3942 m
40.9495 59.7203 40.3499 59.1808 39.5296 58.8624 c
39.2855 59.2843 39.4681 60.1364 39.4114 60.7477 c
39.9847 60.9684 41.2738 60.9879 41.4154 60.3942 c
41.4154 60.3942 l
p
f
51.0784 60.7477 m
49.0159 60.1813 45.5999 60.736 43.6546 60.3942 c
43.5921 60.4899 43.5316 60.5856 43.5364 60.7477 c
45.7777 60.941 48.8382 60.945 51.0784 60.7477 c
51.0784 60.7477 l
p
f
42.9476 60.7477 m
42.7103 60.0075 41.9027 59.4718 41.2972 58.9796 c
40.7308 58.5187 40.1058 57.7609 39.4114 57.8019 c
40.305 59.0695 41.5355 59.9996 42.9476 60.7477 c
42.9476 60.7477 l
p
f
46.012 58.3898 m
45.6448 58.2843 45.8929 57.5656 45.6585 57.3292 c
45.1468 57.3292 44.6361 57.3292 44.1253 57.3292 c
44.2366 58.2257 43.6927 58.4679 43.5364 59.0968 c
46.221 59.1925 48.2679 59.4933 50.7249 59.214 c
50.7991 58.6202 51.0511 58.2042 51.0784 57.5656 c
50.847 57.3312 50.4066 57.4894 50.137 57.5656 c
50.2191 58.0792 49.9359 58.2277 50.0179 58.7433 c
49.2679 58.8253 49.4456 57.9816 49.1937 57.5656 c
48.4456 57.6417 47.388 57.4093 46.8363 57.6827 c
46.3382 57.6964 46.6361 58.5031 46.012 58.3898 c
46.012 58.3898 l
p
f
grestore
41.6507 58.7433 m
41.8109 58.2277 41.6663 58.1378 41.5335 57.6827 c
41.096 57.632 40.5511 57.2472 40.2366 57.4464 c
40.2659 57.8781 40.8353 58.712 41.6507 58.7433 c
41.6507 58.7433 l
p
f
46.6019 57.3292 m
46.9935 57.3292 47.387 57.3292 47.7796 57.3292 c
47.5218 56.8019 47.1302 56.4074 46.6019 56.1515 c
45.6741 56.3468 46.0296 57.171 46.012 58.1534 c
46.5296 58.2003 46.4183 57.6183 46.6019 57.3292 c
46.6019 57.3292 l
p
f
40.5902 57.3292 m
40.8265 57.3292 41.0609 57.3292 41.2972 57.3292 c
41.4095 56.9034 40.8333 57.1652 40.5902 57.0949 c
40.5902 57.3292 l
40.5902 57.3292 l
p
f
43.4183 56.9757 m
43.5364 56.9757 43.6546 56.9757 43.7718 56.9757 c
43.9642 56.6183 44.1185 56.2218 44.1253 55.6788 c
43.5472 55.7687 43.3245 56.214 43.4183 56.9757 c
43.4183 56.9757 l
p
f
40.472 56.6222 m
40.5902 56.6222 40.7073 56.6222 40.8265 56.6222 c
40.7562 54.9816 40.7669 52.632 41.2972 50.9659 c
41.0218 50.9659 40.7474 50.9659 40.472 50.9659 c
39.7503 52.714 39.807 54.7531 40.472 56.6222 c
40.472 56.6222 l
p
f
45.6585 55.4445 m
45.9398 55.6574 44.9945 55.6378 45.1868 56.1515 c
45.7073 56.4249 46.2747 56.1769 46.4827 55.798 c
46.1019 54.7648 45.4456 54.007 44.7152 53.3214 c
43.555 53.4601 43.0579 54.2589 42.1224 54.6183 c
41.7718 53.3234 42.471 52.0597 42.7113 50.9659 c
42.4495 50.7179 42.1429 51.089 41.6507 50.9659 c
41.3323 52.5245 40.7874 55.0909 41.5335 56.6222 c
42.8558 56.5714 43.0784 55.4171 44.1253 55.089 c
44.7288 55.2452 45.0277 55.9425 45.6585 55.4445 c
45.6585 55.4445 l
p
f
15.4871 54.6183 m
16.2069 54.7101 16.5902 54.464 17.2547 54.5011 c
17.4202 53.9249 17.0233 53.1515 17.0194 52.38 c
15.3021 51.8585 13.9451 50.9757 12.659 50.0226 c
12.5965 49.5929 13.1761 49.4933 12.8944 49.1984 c
12.221 49.2706 11.4647 49.2609 10.8909 49.4327 c
11.0321 50.0773 11.3631 50.5324 11.4803 51.2003 c
11.1414 51.5695 10.2244 51.3585 9.7127 51.5538 c
9.6409 52.2941 9.8846 52.7179 10.0657 53.2042 c
10.491 53.1574 10.8563 53.0519 11.2449 52.9679 c
11.2674 52.5128 11.2488 52.1007 11.1263 51.7902 c
13.1849 51.421 14.5335 52.7824 15.7225 53.6749 c
15.8519 54.1984 15.5233 54.2628 15.4871 54.6183 c
15.4871 54.6183 l
p
f
42.5941 53.6749 m
43.6907 53.3195 43.6888 51.8644 44.1253 50.8488 c
43.8509 50.8488 43.5755 50.8488 43.3011 50.8488 c
42.8695 51.5519 42.5335 52.8605 42.5941 53.6749 c
42.5941 53.6749 l
p
f
39.4114 53.4406 m
39.6995 52.9015 39.8646 51.6163 39.7659 51.0831 c
39.0394 51.2609 39.5775 52.7023 39.4114 53.4406 c
39.4114 53.4406 l
p
f
gsave
-26.82 138.7179 m
-26.82 42.337 l
49.7161 42.337 l
49.7161 138.7179 l
-26.82 138.7179 l
clp
47.4261 52.4972 m
47.6273 52.0324 47.765 51.5011 47.7796 50.8488 c
47.473 50.5558 47.2015 50.962 46.7181 50.8488 c
46.7181 51.005 46.7181 51.1613 46.7181 51.3195 c
46.2503 51.0441 45.5921 50.5851 44.8323 50.9659 c
44.8489 51.5714 44.3704 51.6827 44.3616 52.2609 c
44.9544 52.7296 46.5355 52.7042 47.4261 52.4972 c
47.4261 52.4972 l
p
f
50.2542 52.38 m
50.262 51.7824 50.0511 51.4034 50.137 50.7296 c
49.6693 50.7726 49.0062 50.6222 48.723 50.8488 c
48.7347 51.7941 49.1663 52.8937 50.2542 52.38 c
50.2542 52.38 l
p
f
18.9051 51.673 m
18.8475 51.0226 18.6336 50.5304 18.5511 49.9054 c
18.8411 49.4484 19.7122 49.5734 20.4368 49.5519 c
20.2728 48.9699 20.3221 48.173 20.3196 47.4288 c
18.72 46.7902 17.4613 45.8097 16.3118 44.7199 c
16.199 44.212 16.9949 44.257 16.6658 43.8937 c
15.9979 43.8937 15.3304 43.8937 14.6619 43.8937 c
14.6732 44.589 15.0057 44.9659 14.8973 45.7784 c
16.744 46.3683 18.369 47.1788 18.9051 49.0792 c
17.9774 50.0284 14.9539 47.6808 14.3089 46.4874 c
13.7264 46.5714 13.0355 46.548 12.5408 46.7218 c
12.595 47.257 12.7528 47.6886 12.7767 48.255 c
14.64 48.2277 15.7474 49.7921 17.2547 50.4933 c
17.4202 51.0011 17.2293 51.4015 17.2547 51.5538 c
17.7283 51.671 18.2894 51.6984 18.9051 51.673 c
18.9051 51.673 l
p
f
65.928 50.1417 m
65.9359 49.5597 66.0218 47.9425 65.8109 47.1945 c
65.0882 48.3507 64.7152 49.7238 63.0999 49.4327 c
61.6546 49.173 62.2249 47.4113 60.7425 47.0753 c
60.2445 48.5753 58.5316 50.2726 56.971 48.7257 c
56.5238 48.2824 56.3109 47.1476 55.7933 47.0753 c
54.8968 46.9523 55.1937 47.6984 54.6155 48.4913 c
54.2757 48.9542 53.3363 49.6027 52.3753 49.4327 c
51.0589 49.2003 51.1116 47.0382 49.5472 47.3116 c
48.8841 50.1339 45.6429 49.9718 44.8323 47.3116 c
44.6761 47.3116 44.5189 47.3116 44.3616 47.3116 c
43.7269 48.4503 43.1243 49.8702 41.7679 49.7863 c
40.4808 49.7062 40.4407 48.1906 39.5296 47.4288 c
39.3685 48.1339 39.3089 49.5636 39.5296 50.2589 c
39.5101 50.3956 39.555 50.4679 39.6468 50.4933 c
48.2405 50.3585 58.0394 50.2101 65.928 50.1417 c
65.928 50.1417 l
p
f
35.0511 46.7218 m
35.0745 45.9913 35.0599 45.2999 34.8148 44.837 c
33.014 44.8722 30.5179 44.7433 29.2767 44.9542 c
29.3519 45.546 29.1214 46.4445 29.3939 46.8409 c
31.0413 46.9952 33.5814 47.1281 35.0511 46.7218 c
35.0511 46.7218 l
p
f
35.8753 46.8409 m
47.262 46.7296 58.4066 46.6847 69.5823 46.6046 c
69.5238 45.9562 69.7132 45.0597 69.4652 44.6007 c
63.8402 44.7003 57.5823 44.462 52.3753 44.6007 c
46.8382 44.7491 41.5023 44.7491 35.7581 44.9542 c
35.5257 45.2726 35.6878 45.9835 35.64 46.4874 c
35.6351 46.6886 35.7279 46.7921 35.8753 46.8409 c
35.8753 46.8409 l
p
f
33.0472 44.0109 m
34.5023 44.2863 36.4652 44.0519 38.1155 44.13 c
40.137 42.1437 42.5989 40.5988 43.1829 37.1769 c
40.4984 40.1476 37.265 42.5734 33.0472 44.0109 c
33.0472 44.0109 l
p
f
39.1761 44.13 m
40.1195 44.13 41.0609 44.13 42.0042 44.13 c
42.4105 43.7101 42.8695 43.3449 42.9476 42.5968 c
42.3021 42.6144 41.8265 42.462 41.2972 42.3624 c
41.5648 41.4913 42.1859 40.9718 42.4759 40.1222 c
41.9202 40.507 41.3773 41.3195 40.8265 42.0089 c
40.2493 42.7277 39.6527 43.4406 39.1761 44.13 c
39.1761 44.13 l
p
f
grestore
43.0648 44.13 m
44.0159 44.2159 44.6019 43.9386 45.5394 44.0109 c
45.7728 43.5773 46.1429 43.2784 46.1292 42.5968 c
45.3831 42.5968 44.6361 42.5968 43.89 42.5968 c
43.5784 43.0714 43.1282 43.4074 43.0648 44.13 c
43.0648 44.13 l
p
f
gsave
-26.82 138.7179 m
-26.82 42.337 l
49.7161 42.337 l
49.7161 138.7179 l
-26.82 138.7179 l
clp
46.4827 44.0109 m
47.2679 44.0109 48.054 44.0109 48.8402 44.0109 c
49.1312 43.6359 49.4515 43.2863 49.429 42.5968 c
48.637 42.421 48.1976 42.6183 47.0726 42.5968 c
46.9027 43.0519 46.3011 43.5851 46.4827 44.0109 c
46.4827 44.0109 l
p
f
52.4925 43.8937 m
52.4554 43.4601 52.5941 42.8507 52.3753 42.5968 c
51.1605 42.2218 49.5872 42.4699 49.7825 43.8937 c
50.5667 44.0324 51.722 44.0929 52.4925 43.8937 c
52.4925 43.8937 l
p
f
25.9769 43.423 m
25.9827 42.6476 25.5482 42.1691 25.8577 41.4191 c
24.5877 40.5284 23.4915 39.464 22.5584 38.2379 c
22.432 37.7979 22.8514 37.9019 22.7943 37.5299 c
22.3255 37.3309 21.5511 37.4369 20.9085 37.4109 c
20.8719 38.0769 21.117 38.4599 21.0267 39.1788 c
22.5872 39.7804 23.3348 41.1925 24.3265 42.3624 c
24.3455 42.7355 24.013 42.755 24.0906 43.1866 c
24.7347 43.2491 25.223 43.4679 25.9769 43.423 c
25.9769 43.423 l
p
f
36.348 112.486 m
36.3323 111.9518 36.0589 111.6744 35.9945 111.1896 c
35.4007 111.3029 35.182 111.7926 34.4613 111.7789 c
33.7806 113.5338 33.2855 115.4742 32.1048 116.7286 c
32.2972 117.2037 32.4329 117.736 32.6937 118.1432 c
34.2337 118.0328 33.9984 115.5206 34.6976 114.9611 c
34.9202 114.2418 35.1761 112.6383 36.348 112.486 c
36.348 112.486 l
p
f
62.7464 73.358 m
63.68 72.9157 63.2288 71.0909 64.0433 70.5299 c
64.2816 71.0748 63.3167 71.9801 63.6898 72.651 c
64.4163 72.4742 64.5335 71.6881 64.9866 71.2369 c
65.5023 72.2467 63.5999 73.7457 62.7464 73.358 c
62.7464 73.358 l
p
62.0394 73.712 m
61.3382 76.8214 62.3421 81.6364 60.0355 83.1398 c
61.6722 80.9664 61.0589 76.5426 62.0394 73.712 c
62.0394 73.712 l
p
62.6292 78.7799 m
62.6722 80.505 63.0511 82.5211 63.3363 83.6115 c
62.5921 82.65 61.9339 80.3995 62.6292 78.7799 c
62.6292 78.7799 l
p
46.8363 103.1754 m
43.6771 103.4279 44.5325 99.6652 41.6507 99.6398 c
44.0833 97.151 50.2113 100.0372 46.8363 103.1754 c
46.8363 103.1754 l
p
61.4515 99.9933 m
60.5433 101.1256 61.1312 103.2887 59.682 103.6471 c
58.2796 103.9938 57.2972 103.1178 57.2073 101.9967 c
57.0433 99.9357 59.7679 98.4523 62.5101 99.0504 c
62.0745 99.5963 61.8519 99.4933 61.4515 99.9933 c
61.4515 99.9933 l
p
61.5687 102.1149 m
61.514 100.6827 62.4417 99.3234 63.9241 99.7575 c
66.6488 100.5553 66.1214 106.736 63.4534 106.9469 c
64.8577 104.9078 62.6273 103.1788 61.5687 102.1149 c
61.5687 102.1149 l
p
39.8831 103.1754 m
39.8988 101.6993 41.4212 99.5089 42.9476 100.819 c
45.0277 102.6036 40.6956 105.2672 42.7113 107.4181 c
41.5374 106.9083 39.8607 105.299 39.8831 103.1754 c
39.8831 103.1754 l
p
44.3616 107.5363 m
43.6116 107.3366 43.0101 106.3512 43.0648 105.6505 c
43.221 103.6461 45.4661 104.6261 47.0726 103.8829 c
48.2894 103.319 47.971 102.4498 48.6038 101.2897 c
49.9017 104.0533 47.6253 108.4044 44.3616 107.5363 c
44.3616 107.5363 l
p
58.6214 104.3541 m
59.6429 104.6232 60.7796 103.965 61.5687 104.1188 c
63.9905 104.5905 63.2288 107.7994 61.096 107.8898 c
58.7933 107.9874 56.4456 105.3048 56.8538 102.9401 c
57.6859 103.5695 57.6917 104.1085 58.6214 104.3541 c
58.6214 104.3541 l
p
54.7327 107.0651 m
55.1312 106.3639 56.3441 106.4772 56.264 105.297 c
56.5921 106.4616 57.4808 107.066 58.1507 107.8898 c
56.514 107.9279 55.5765 107.8956 54.7327 107.0651 c
54.7327 107.0651 l
p
39.1761 103.8829 m
39.3743 105.8449 40.6722 106.7067 41.6507 107.8898 c
40.7874 107.8898 39.9222 107.8898 39.0579 107.8898 c
38.9359 106.7941 38.7347 104.7882 39.1761 103.8829 c
39.1761 103.8829 l
p
54.3792 107.5363 m
54.7562 107.8082 54.1273 108.0616 54.262 108.4791 c
56.9925 108.0875 62.6448 108.7604 66.2816 108.0075 c
66.1312 107.4908 65.0491 107.9049 64.514 107.7721 c
64.9886 107.027 66.0941 105.8956 66.4007 104.59 c
66.5589 105.36 66.5902 107.0177 66.5179 108.1261 c
68.0042 107.3004 69.5726 106.0407 71.1136 104.8258 c
72.6273 103.6325 74.055 102.2399 75.592 101.1715 c
74.178 101.4733 70.1546 102.5577 69.4652 100.819 c
69.1585 100.0485 69.3909 98.8551 69.346 97.6364 c
69.2269 94.3956 69.1917 89.1749 69.2288 86.2042 c
68.3558 86.6281 67.6956 87.2653 66.8714 87.7365 c
69.0628 85.8043 71.5296 84.1451 73.825 82.3151 c
74.002 83.5651 73.618 86.4523 73.944 88.444 c
74.58 86.3615 73.873 83.4699 74.414 81.7262 c
74.461 82.1896 75.266 81.8947 75.241 82.4327 c
75.399 83.1818 74.354 82.7252 74.414 83.3756 c
74.332 83.8121 74.602 83.8966 75.002 83.8473 c
75.201 84.2911 74.455 84.3839 74.768 84.5548 c
75.241 84.5548 75.711 84.5548 76.182 84.5548 c
75.838 84.0631 75.967 83.8395 76.535 83.7296 c
76.651 82.9474 75.895 83.0348 75.592 82.6686 c
75.496 82.0231 76.237 82.212 76.416 81.8439 c
76.522 81.2306 75.76 81.4801 75.592 81.1368 c
75.709 80.3893 76.782 80.5968 76.535 79.4869 c
73.139 81.984 69.721 84.4586 66.5179 87.1476 c
66.5413 87.6027 66.5218 88.0158 66.4007 88.3258 c
65.6956 88.1368 64.7054 87.2614 64.0433 88.0905 c
63.4945 87.5792 62.9007 87.111 62.3929 86.5582 c
62.9866 86.4777 63.4456 87.5475 64.1605 87.7365 c
63.8577 86.0367 62.7523 85.1368 62.0394 83.8473 c
61.7249 83.8473 61.4105 83.8473 61.096 83.8473 c
62.8187 82.6207 63.6312 86.3497 64.514 87.3834 c
64.6995 83.2394 62.9183 78.1027 62.6292 73.8297 c
63.8519 76.9113 64.3812 81.2985 64.9866 85.2618 c
65.1175 86.1241 64.8265 87.6071 65.928 87.8546 c
65.8089 82.358 65.6956 76.4884 65.5745 71.3551 c
65.1976 70.8283 64.5394 70.5836 64.1605 70.0582 c
63.5218 70.5587 62.3226 70.4987 61.4515 70.7653 c
61.3909 73.4274 61.1136 76.7555 60.0355 78.7799 c
60.389 80.36 59.0335 81.2277 58.5042 82.3151 c
59.1956 83.1564 59.7933 84.09 60.2718 85.1437 c
60.7386 85.0089 61.6448 83.8732 62.0394 84.7902 c
61.4027 84.6866 60.5238 85.2838 60.5081 85.8512 c
60.4691 87.1525 63.5726 87.5221 63.9241 88.6798 c
62.807 88.1466 62.0413 87.2638 60.7425 86.9117 c
60.6859 88.6974 63.3988 87.7135 63.4534 89.3868 c
62.6351 89.8175 61.6605 89.3864 60.5081 89.5045 c
60.6937 86.6984 59.8128 83.3839 57.9144 82.6686 c
58.3421 84.0494 59.68 84.5182 59.682 86.3224 c
59.012 85.1071 58.7113 83.5211 57.2073 83.1398 c
56.5765 83.6085 56.6448 84.7784 55.6761 84.9083 c
56.6331 85.4821 57.8382 85.8102 57.9144 87.2653 c
58.6058 87.0929 59.5394 87.1613 59.682 86.4401 c
61.1351 92.1149 55.8499 96.8561 49.5472 94.8082 c
47.0521 93.5162 44.8968 90.7345 45.4222 87.1476 c
45.7093 85.1832 46.7464 84.1271 47.6614 82.6686 c
45.7113 83.5524 44.7327 86.1989 44.8323 88.9157 c
44.9984 93.361 49.8167 96.6788 54.4964 95.7511 c
57.307 95.194 59.4437 92.8195 60.389 90.0939 c
62.2757 90.0939 64.1605 90.0939 66.0472 90.0939 c
66.1644 89.7052 65.2913 89.6432 66.0472 89.6222 c
65.887 88.9171 65.1468 88.7936 64.514 88.5616 c
65.2405 88.1915 65.6292 89.173 66.4007 89.151 c
66.2191 91.0284 66.8519 93.0226 66.4007 94.6896 c
66.0198 96.1007 64.6351 96.6862 63.5706 97.5192 c
65.0433 98.3234 66.9573 99.6818 66.4007 101.7614 c
65.7171 99.3795 63.7249 98.3082 60.9788 97.9899 c
63.3011 96.6593 65.7698 95.4742 66.1644 92.2155 c
65.8499 92.2155 65.5355 92.2155 65.221 92.2155 c
63.6507 97.5192 56.0687 96.8121 53.3187 100.9362 c
52.2113 98.233 48.8109 97.8234 46.9534 95.8683 c
46.8284 95.4059 46.928 94.715 46.7181 94.337 c
46.0491 94.069 45.7659 94.8058 45.305 94.9254 c
43.1585 95.4816 41.9866 93.2296 40.9437 91.9796 c
41.2171 94.2296 43.9085 96.3649 46.1292 94.8082 c
47.1175 98.507 53.0355 97.8629 52.9652 102.2325 c
53.4945 102.2907 53.848 102.173 54.262 102.1149 c
55.0296 100.6842 56.098 99.5529 57.7972 99.0504 c
57.303 99.7907 56.0355 101.3541 56.0296 102.5866 c
54.553 102.6788 51.803 102.4186 50.137 102.7037 c
51.928 103.4371 54.137 102.8073 55.9105 102.9401 c
55.8636 103.734 56.0159 104.3278 56.1468 104.9435 c
56.18 105.0241 54.6351 104.1857 54.6155 105.0612 c
54.1956 105.048 54.1859 104.6256 53.6722 104.7081 c
54.0042 104.672 54.178 104.1666 53.9066 103.8829 c
53.4378 103.8063 53.1878 103.9474 53.2015 104.3541 c
52.928 103.5602 52.5687 104.2731 52.0218 103.8829 c
51.4827 103.8937 51.5687 104.5289 51.1976 104.7081 c
50.5902 104.7291 49.7933 104.5607 49.6644 105.0612 c
50.4378 102.8268 49.4788 100.6466 48.3685 99.2863 c
49.8323 99.8268 50.7161 100.9454 51.4329 102.2325 c
51.7864 102.2325 52.139 102.2325 52.4925 102.2325 c
50.6331 96.5509 41.764 97.8771 40.1195 91.9796 c
39.8441 91.9796 39.5687 91.9796 39.2933 91.9796 c
39.182 95.275 42.0394 96.6173 44.4788 97.7545 c
41.7464 98.2824 40.0745 99.8698 39.1761 102.2325 c
38.2855 99.9215 40.1195 98.5226 41.4154 97.6364 c
39.7386 96.4088 38.473 94.5353 38.9398 91.5084 c
39.4085 91.4166 41.2347 92.049 41.7679 91.5084 c
41.2327 90.7936 40.2523 91.2321 39.1761 91.0367 c
38.9124 90.1613 39.1292 88.8053 39.0579 87.7365 c
38.1683 87.2516 37.5726 86.4728 36.5823 86.087 c
36.2581 88.8326 36.6019 92.5905 36.4652 95.986 c
36.3831 98.026 36.6312 101.0465 35.5218 101.8795 c
33.4749 103.4161 30.3773 102.1027 28.4515 101.0543 c
31.5863 103.6549 34.9114 106.0651 38.2327 108.4791 c
41.5863 108.3449 45.8421 108.8571 49.429 108.4791 c
49.4925 107.6305 48.4134 107.9235 47.7796 107.7721 c
48.0814 107.1295 49.1898 106.276 49.5472 105.297 c
49.3685 106.2741 50.7523 106.4625 51.1976 107.1827 c
52.3489 107.0529 52.9593 106.3937 54.0257 107.0651 c
52.014 107.1027 50.9984 107.6788 49.5472 107.7721 c
49.4622 108.132 49.6683 108.2013 49.6644 108.4791 c
50.5804 108.6808 50.7064 108.0333 51.0784 108.0075 c
51.3167 107.7394 51.471 108.5524 51.9046 108.4791 c
52.7113 107.6735 54.3245 109.0949 54.3792 107.5363 c
54.3792 107.5363 l
p
f
grestore
44.4788 79.7223 m
44.4808 81.0563 45.8226 81.0504 46.6019 81.608 c
46.7288 82.7975 45.93 83.0582 45.6585 83.8473 c
45.9593 84.0109 46.805 82.7306 47.1898 82.1974 c
46.8909 81.2765 45.9339 79.5826 44.4788 79.7223 c
44.4788 79.7223 l
p
f
gsave
-26.82 138.7179 m
-26.82 42.337 l
49.7161 42.337 l
49.7161 138.7179 l
-26.82 138.7179 l
clp
11.1263 75.5978 m
11.0745 76.1124 10.6649 77.382 11.1263 78.1906 c
10.0164 78.0494 8.95 78.5739 8.1805 78.0724 c
8.4808 76.566 10.0701 76.3483 11.1263 75.5978 c
11.1263 75.5978 l
p
6.6483 78.4254 m
7.3089 78.5519 7.3597 79.2867 7.5911 79.84 c
8.3636 79.316 9.4197 79.7526 10.3016 79.4869 c
11.1639 79.2262 11.473 78.2257 12.1873 77.9547 c
11.9905 77.0509 11.783 75.86 12.1873 75.0084 c
10.679 75.2672 9.9173 76.2741 8.6517 76.7765 c
8.3216 76.5568 8.1971 76.1305 8.0623 75.7155 c
7.4437 75.8707 6.3743 75.962 6.0589 75.4801 c
5.4388 76.0783 4.7147 76.5719 4.2913 77.3654 c
4.4949 77.9718 4.7972 78.8912 4.5267 79.6051 c
5.4393 79.4176 5.8607 78.7384 6.6483 78.4254 c
6.6483 78.4254 l
p
f
58.6214 64.9904 m
58.9652 64.9503 59.0198 66.2267 58.7405 66.0509 c
58.803 65.5958 58.5296 65.4767 58.6214 64.9904 c
58.6214 64.9904 l
p
51.9046 64.048 m
52.7562 64.3741 53.2425 65.0646 53.553 65.9337 c
52.9202 65.6642 52.6839 64.9962 52.0218 64.755 c
50.2425 66.2374 49.3421 68.5958 47.7796 70.2941 c
49.0609 68.1183 49.9847 65.5851 51.9046 64.048 c
51.9046 64.048 l
p
52.2581 67.4669 m
53.178 67.6193 53.9085 69.213 54.262 69.8229 c
53.4222 69.2872 52.887 68.4464 52.0218 67.9366 c
50.4886 68.6818 49.5345 70.007 48.2503 71.0011 c
49.2054 69.9581 50.5462 67.1818 52.2581 67.4669 c
52.2581 67.4669 l
p
52.139 66.17 m
51.6273 66.2853 51.4544 66.7404 50.9613 66.8771 c
52.5823 63.108 55.8675 70.2892 56.1468 71.3551 c
54.9124 69.5255 53.9945 67.38 52.139 66.17 c
52.139 66.17 l
p
43.5364 76.8937 m
44.3265 76.5109 44.0198 74.5172 44.1253 73.8297 c
47.0941 75.5651 48.9886 71.986 52.2581 72.298 c
52.6663 72.3366 53.0823 72.7379 53.553 72.5333 c
53.0374 72.0289 52.2073 71.837 51.1976 71.8263 c
51.431 71.0695 52.9027 71.6412 53.553 71.5909 c
52.5355 70.4869 50.6331 70.777 49.5472 71.5909 c
49.8226 71.0568 50.8519 70.0597 51.7864 70.0582 c
54.6624 70.0558 57.1546 76.4742 60.7425 73.1227 c
62.3226 69.8297 57.8363 65.6525 59.682 63.3405 c
59.557 63.0729 58.9417 63.2955 58.6214 63.2233 c
58.2288 63.8112 58.0804 64.6447 57.9144 65.463 c
57.5218 64.8449 58.0648 63.6061 57.7972 63.1061 c
57.5999 63.1061 57.4046 63.1061 57.2073 63.1061 c
56.9593 63.5651 57.1488 64.4611 57.0902 65.1095 c
56.4573 64.8771 56.9456 63.5241 56.3831 63.2233 c
55.9261 65.3429 58.0238 67.4464 58.387 69.7047 c
57.3265 67.6212 55.9925 65.8136 55.4398 63.2233 c
54.9437 63.108 54.4202 63.2838 53.6722 63.2233 c
55.0062 65.6603 56.5159 67.922 57.5609 70.6481 c
56.0882 68.1124 54.6839 65.5118 52.9652 63.2233 c
52.0863 63.028 51.5452 63.1647 50.7249 63.2233 c
49.5726 65.6837 48.3206 68.047 46.9534 70.2941 c
47.5511 68.1017 49.2962 66.0353 49.6644 63.2233 c
48.68 63.0241 48.9398 64.0695 48.723 64.6368 c
48.4534 64.1525 48.7542 63.8268 48.6038 63.2233 c
48.2738 63.0885 47.9925 63.0885 47.6614 63.2233 c
47.6448 64.0187 48.1937 64.8497 47.6614 65.463 c
47.4642 64.5978 47.4027 63.6002 46.8363 63.1061 c
46.4046 63.1061 45.972 63.1061 45.5394 63.1061 c
45.8236 64.09 46.9671 64.8048 46.4827 66.17 c
46.1624 66.2531 46.5667 65.6134 46.2464 65.6974 c
45.6136 65.8615 45.764 66.5099 45.5394 67.1115 c
44.8363 69.0109 42.928 71.5729 44.1253 73.712 c
43.4866 74.2643 43.3206 75.8766 43.5364 76.8937 c
43.5364 76.8937 l
p
f
49.429 78.3082 m
51.678 78.3185 52.9495 77.3497 54.4964 76.6578 c
54.6097 76.1422 54.7015 75.6056 54.7327 75.0084 c
53.4515 75.1398 52.3734 75.7965 51.4329 75.1261 c
51.0609 75.3839 50.7933 75.7433 50.4905 76.0695 c
50.4144 76.7335 50.806 76.9313 50.9613 77.3654 c
50.7679 77.9977 49.473 77.5265 49.429 78.3082 c
49.429 78.3082 l
p
f
grestore
34.1077 66.6408 m
33.2884 67.5695 32.3831 67.7775 31.3968 68.4083 c
31.1273 67.8204 31.929 67.2931 32.222 66.8771 c
31.4945 67.0138 31.1351 67.5177 30.8089 68.0548 c
30.3099 67.7677 30.3323 66.9601 29.512 66.9943 c
29.5823 67.5919 30.39 67.4523 30.2191 68.2911 c
29.6273 68.3712 29.6712 67.8165 29.0413 67.9366 c
29.0511 68.1036 29.0609 68.2706 28.9222 68.2911 c
29.1663 68.8732 29.9554 68.9083 30.5726 69.1154 c
30.6771 70.3424 29.8421 69.9762 29.7484 70.8839 c
29.3988 70.7208 29.5794 70.0304 29.3939 69.7047 c
28.9827 69.882 29.39 70.8795 28.9222 71.0011 c
28.6663 70.6285 28.7972 69.8698 28.5687 69.4689 c
28.1439 69.8302 28.5003 70.9718 28.098 71.3551 c
27.5677 71.0206 28.0042 69.7199 27.8616 68.9982 c
27.4378 69.673 27.6868 71.0221 27.2718 71.7086 c
26.9984 70.8825 27.2327 69.549 27.1546 68.5265 c
26.5511 69.2199 26.5286 71.4806 26.9193 72.4157 c
28.4544 72.5792 29.7386 70.8395 30.6898 72.1793 c
30.8314 72.8317 30.0804 72.5909 30.1019 73.1227 c
30.4446 73.3663 30.5452 73.5021 31.0433 73.358 c
31.3128 73.0372 31.3812 72.5167 31.3968 71.9445 c
32.6956 71.2487 33.2698 73.0695 34.6976 73.0045 c
35.2542 71.6915 34.9046 70.1432 35.1683 68.6437 c
34.5775 69.3888 34.8616 71.0084 34.6976 72.1793 c
34.2015 71.4977 34.4007 70.1193 34.3441 68.9982 c
33.8275 69.5812 34.3284 71.1823 33.9905 71.9445 c
33.557 71.3956 33.6527 70.318 33.637 69.3517 c
33.2318 69.7716 33.4163 70.7804 33.1654 71.3551 c
32.7073 70.8815 32.8802 70.4791 32.8118 69.587 c
32.3382 69.7418 32.4759 70.5084 32.4573 71.1193 c
31.8821 71.1852 32.1761 70.379 32.1048 69.9406 c
31.7991 69.8702 31.68 69.9879 31.7503 70.2941 c
31.4183 70.1559 31.3929 69.7096 31.2796 69.3517 c
32.3792 68.7228 32.8616 67.4767 34.5794 67.4669 c
34.4456 67.1202 34.5101 67.0284 34.8148 66.8771 c
34.7894 66.5802 33.9788 67.4474 34.1077 66.6408 c
34.1077 66.6408 l
p
f
gsave
-26.82 138.7179 m
-26.82 42.337 l
49.7161 42.337 l
49.7161 138.7179 l
-26.82 138.7179 l
clp
45.0687 114.7252 m
44.8968 114.9074 44.4652 114.8287 44.1253 114.8429 c
44.0062 114.4396 45.0111 114.5621 45.0687 114.7252 c
45.0687 114.7252 l
p
43.5364 116.2575 m
43.7445 116.1534 43.8812 115.8839 44.1253 116.1393 c
44.2396 116.5724 43.5472 116.608 43.5364 116.2575 c
43.5364 116.2575 l
p
44.8323 115.3146 m
45.2523 115.4454 45.18 116.068 45.7757 116.0216 c
45.9154 116.5158 45.2796 116.2316 45.1868 116.4928 c
45.2357 116.7584 45.8323 116.4752 45.7757 116.8468 c
44.8978 117.2809 45.0071 115.9508 44.8323 115.3146 c
44.8323 115.3146 l
p
43.1829 116.9645 m
43.0911 116.5509 44.1546 116.6901 44.2445 116.8468 c
44.0863 117.0851 43.4554 117.2023 43.1829 116.9645 c
43.1829 116.9645 l
p
46.012 117.4357 m
46.0413 115.986 45.7962 113.6539 44.3616 113.5465 c
42.8577 113.4347 41.6527 116.1378 42.8294 117.5538 c
44.0374 117.7853 45.0023 117.6432 46.012 117.4357 c
46.012 117.4357 l
p
f
53.553 83.9655 m
53.5159 84.402 52.2484 84.2247 52.0218 84.0826 c
52.3206 83.8903 53.1175 84.2628 53.553 83.9655 c
53.553 83.9655 l
p
52.4925 84.7902 m
52.7679 84.7902 53.0433 84.7902 53.3187 84.7902 c
53.2484 85.0343 53.4652 85.5646 53.2015 85.6154 c
53.3421 84.9625 52.6214 85.173 52.4925 84.7902 c
52.4925 84.7902 l
p
53.6722 86.5582 m
53.8812 86.4518 54.0159 86.2736 54.262 86.2042 c
54.2991 86.4811 54.6253 86.4684 54.7327 86.6764 c
54.4886 86.8864 53.9261 86.6984 53.6722 86.5582 c
53.6722 86.5582 l
p
50.8431 86.6764 m
51.2464 86.7643 50.9925 86.1969 51.4329 86.3224 c
51.7327 86.337 51.89 86.4938 51.9046 86.7941 c
51.4085 86.6437 50.9183 87.1012 50.8431 86.6764 c
50.8431 86.6764 l
p
53.4359 87.1476 m
53.6761 87.6637 54.5179 87.3346 54.8499 87.5011 c
54.6527 88.1471 52.973 87.8019 53.4359 87.1476 c
53.4359 87.1476 l
p
50.7249 87.5011 m
51.0989 87.6652 51.7669 87.6652 52.139 87.5011 c
52.2855 87.882 51.7581 87.5909 51.9046 87.9728 c
51.2757 88.0504 50.8724 87.9039 50.7249 87.5011 c
50.7249 87.5011 l
p
50.0179 88.2086 m
51.6566 89.1857 53.9261 88.9113 55.557 88.0905 c
55.6116 85.8766 54.6468 82.2404 52.3753 82.6686 c
50.5833 83.0075 49.7054 85.569 50.0179 88.2086 c
50.0179 88.2086 l
p
f
grestore
27.6263 87.7365 m
27.5218 87.4484 26.9691 87.609 27.0364 87.1476 c
27.2103 86.7316 28.179 87.111 28.2152 86.5582 c
28.1116 85.9152 27.1155 86.1647 26.6839 85.8512 c
26.6839 85.5763 26.6839 85.3009 26.6839 85.026 c
26.7132 84.7814 27.2015 84.9943 27.2718 84.7902 c
26.9593 84.0963 27.4818 83.9196 27.3909 83.1398 c
27.7523 83.8361 26.9593 84.4786 27.7445 84.9083 c
28.0609 84.6017 27.5999 84.5529 27.6263 84.2013 c
27.9495 83.9352 28.3577 83.7535 28.2152 83.0226 c
27.8851 82.8815 27.4027 82.8927 26.9193 82.9044 c
26.6585 82.8903 26.8695 82.4044 26.8011 82.1974 c
26.9847 81.7907 27.8636 82.0826 27.8616 81.4904 c
27.8411 81.1183 27.3958 81.1705 27.0364 81.1368 c
26.9847 80.7321 27.0833 80.4762 27.1546 80.1945 c
27.4886 80.0963 27.4603 80.3605 27.7445 80.3121 c
27.6859 79.8214 27.8831 79.5875 28.2152 79.4869 c
27.5404 78.8654 28.1292 78.0807 28.3333 77.3654 c
27.5452 78.07 27.2874 79.3048 26.8011 80.3121 c
25.805 79.7355 25.6234 78.3468 24.9158 77.4835 c
24.3338 78.0983 25.8304 78.8043 25.0335 79.2506 c
25.0931 79.6237 25.3802 79.7682 25.387 80.1945 c
25.7093 80.2799 25.6243 79.9596 25.8577 79.9586 c
26.0374 80.2506 26.3206 80.4381 26.3304 80.9015 c
26.303 81.2682 25.7425 81.1002 25.387 81.1368 c
25.4066 81.2736 25.3607 81.3463 25.2689 81.3722 c
25.2542 81.5841 25.4134 81.6212 25.387 81.8439 c
25.6234 81.8439 25.8577 81.8439 26.0941 81.8439 c
26.4847 81.8854 26.2786 82.5236 26.3304 82.9044 c
25.8284 83.1491 25.1771 82.4777 24.6795 83.0226 c
24.6795 83.298 24.6795 83.5719 24.6795 83.8473 c
24.9266 83.9152 25.0159 84.1393 25.387 84.0826 c
25.4984 84.5397 24.9276 84.569 25.2689 84.9083 c
25.7698 84.7633 25.9036 84.8644 26.4476 84.9083 c
26.9202 86.4806 25.0975 85.7579 24.6795 86.4401 c
24.7025 87.1241 25.6976 86.8375 25.9769 87.2653 c
25.8695 87.5905 25.3011 87.4547 25.2689 87.8546 c
25.8851 87.9567 26.93 87.9005 27.6263 87.7365 c
27.6263 87.7365 l
p
f
41.7679 63.694 m
41.9144 64.0861 40.971 63.9825 40.9437 63.8131 c
41.1702 63.6569 41.4183 63.8991 41.7679 63.694 c
41.7679 63.694 l
p
40.5902 65.2267 m
40.9476 65.2218 41.3655 65.1583 41.2972 65.5802 c
41.1253 65.9425 40.4212 65.8497 40.5902 65.2267 c
40.5902 65.2267 l
p
40.2366 65.9337 m
40.3616 66.2013 40.9769 65.9786 41.2972 66.0509 c
41.2884 66.7306 39.7747 66.5226 40.2366 65.9337 c
40.2366 65.9337 l
p
42.4759 67.9366 m
42.7288 67.5607 42.7347 66.9396 42.7113 66.2872 c
42.1663 66.4747 41.9017 66.2072 41.6507 65.8156 c
41.68 65.4064 42.1077 64.2784 41.2972 64.4025 c
42.5023 63.776 41.5687 65.59 42.7113 65.3439 c
42.8509 64.2218 42.262 63.8287 41.887 63.2233 c
41.4544 63.2233 41.0218 63.2233 40.5902 63.2233 c
39.596 63.9147 39.1702 66.1788 39.7659 67.7013 c
40.5062 67.9435 41.7132 67.7179 42.4759 67.9366 c
42.4759 67.9366 l
p
f
gsave
-26.82 138.7179 m
-26.82 42.337 l
49.7161 42.337 l
49.7161 138.7179 l
-26.82 138.7179 l
clp
42.3577 59.5695 m
43.0081 59.3546 43.1605 58.6437 43.6546 58.2726 c
43.5003 58.0656 42.9984 57.6007 43.6546 57.5656 c
43.5218 57.1476 43.1468 56.9718 43.3011 56.2687 c
42.3343 56.2452 42.598 57.4523 41.6507 57.4464 c
41.932 57.9093 42.1331 58.4406 41.6507 58.8624 c
41.7679 59.2159 42.0042 59.4503 42.3577 59.5695 c
42.3577 59.5695 l
p
f
9.5946 54.5011 m
11.3714 54.6476 12.285 55.6593 13.7196 56.1515 c
13.6107 56.6906 14.0145 56.7199 13.9549 57.212 c
12.2122 57.4679 9.5916 56.757 9.5946 54.5011 c
9.5946 54.5011 l
p
13.8377 57.4464 m
14.6741 57.2628 15.2196 56.7863 16.3118 56.8585 c
16.4608 59.7809 13.9793 60.4371 13.8377 57.4464 c
13.8377 57.4464 l
p
15.2518 73.8297 m
17.22 71.8849 19.1981 69.4025 18.7869 65.463 c
19.6068 66.5177 21.7005 63.3756 22.3231 65.5802 c
22.1898 65.879 21.7308 65.8517 21.6155 66.17 c
22.4139 67.0626 23.1527 66.049 23.0296 64.9904 c
24.2259 64.588 24.9686 65.5314 25.9769 65.6974 c
26.471 64.6769 26.3529 63.1451 26.2122 61.9254 c
25.97 61.9586 25.9769 62.2418 25.8577 62.3981 c
25.8597 62.9108 25.8968 63.4596 25.7405 63.8131 c
25.515 65.3331 25.8226 62.3825 25.387 62.2809 c
25.0677 62.7467 25.4163 63.8815 24.9158 64.1661 c
24.8665 63.6256 25.0672 62.8366 24.6795 62.6334 c
24.452 62.9948 24.6414 63.7741 24.3265 64.048 c
24.2191 63.7233 24.2894 63.2213 24.0906 62.9869 c
23.9041 63.194 23.9324 63.6158 23.8553 63.9303 c
23.3265 64.0265 23.8802 63.0397 23.3836 63.1061 c
23.3182 63.3151 23.3226 63.5944 23.1483 63.694 c
23.0135 63.4362 22.8436 63.2135 22.9119 62.7506 c
23.3538 62.3766 24.5086 61.9703 23.9725 61.3375 c
23.4158 61.4489 23.1424 61.8434 22.7943 62.1617 c
22.6048 61.0309 23.4075 60.8903 23.619 60.1578 c
22.9007 60.2262 22.9686 61.0797 22.3231 61.2184 c
21.9017 61.0504 21.8319 60.5328 21.3797 60.3942 c
21.5115 60.8903 22.0115 61.0192 21.8509 61.8082 c
21.3607 61.4742 20.7288 61.2809 20.0833 61.1012 c
19.8621 60.8766 20.1536 60.8883 20.0833 60.5114 c
19.5892 60.8903 19.18 60.3707 18.9051 60.1578 c
19.0682 60.7145 18.3753 60.4137 18.3153 60.7477 c
18.7542 60.6227 18.5467 61.1442 18.7869 61.2184 c
20.3953 60.6637 20.6229 62.4235 21.8509 62.6334 c
21.9779 63.1119 21.9779 63.4537 21.8509 63.9303 c
21.3587 63.9904 21.5281 63.3893 21.262 63.2233 c
20.9676 63.3229 21.3973 64.1447 20.9085 64.048 c
20.7249 63.6276 20.971 63.3014 20.6727 62.8698 c
20.1439 62.9303 20.6805 64.0558 20.3196 64.2833 c
19.8157 64.0411 20.45 62.6608 19.7298 62.6334 c
19.619 63.2682 19.9793 64.3761 19.4945 64.6368 c
19.1404 64.048 19.7244 62.5211 19.0223 62.2809 c
18.8538 63.0533 18.9969 64.1398 18.7869 64.8732 c
18.3719 64.8556 18.4515 64.3439 18.3153 64.048 c
19.0291 63.8287 18.6112 61.9352 18.1981 61.691 c
18.2044 62.4039 18.2313 63.1393 17.9622 63.5768 c
17.6829 62.8346 16.9085 62.5875 16.5477 61.9254 c
17.7327 58.0324 19.7264 53.8761 24.0906 52.9679 c
25.8265 52.6085 28.5696 52.8781 29.6292 54.1476 c
28.3675 53.882 27.9183 54.9894 26.8011 55.2081 c
26.7318 54.1945 27.3236 53.8449 27.7445 53.3214 c
26.848 53.2902 26.6468 53.9542 26.4476 54.6183 c
25.8734 54.421 25.6839 53.296 25.0335 53.5577 c
25.4573 54.0773 25.9241 54.5519 25.8577 55.5616 c
25.4905 54.9074 23.6444 54.88 24.2083 54.0284 c
23.4832 54.2433 23.7479 53.4679 23.2654 53.4406 c
23.4515 54.0831 22.7762 53.5656 22.7943 53.7941 c
22.8084 54.2589 23.3065 54.1534 23.0296 54.6183 c
24.1502 54.5324 24.8348 55.8683 25.6234 56.505 c
25.3099 56.6241 25.39 57.1359 25.1512 57.3292 c
24.9495 57.1378 25.1058 56.589 24.6795 56.6222 c
24.7059 57.0011 24.471 57.1202 24.5618 57.5656 c
24.0736 57.5421 24.3856 56.7199 23.8553 56.7394 c
23.7694 57.007 24.0672 57.6593 23.619 57.5656 c
23.4788 57.1163 23.6571 56.3488 23.2654 56.1515 c
23.076 56.7081 23.1068 57.4855 22.7943 57.9191 c
22.7039 57.2238 23.0408 56.1007 22.4407 55.9152 c
22.3651 56.6652 22.4564 57.5812 21.9691 57.9191 c
21.8978 57.046 22.1053 55.8976 21.4979 55.5616 c
21.5784 56.7023 21.3841 57.5695 21.3797 58.6261 c
22.6883 59.505 24.4588 57.4933 26.0941 58.3898 c
26.2796 59.1652 25.7542 59.2277 25.6234 59.6866 c
27.0648 60.441 26.68 58.9523 27.0364 58.0363 c
28.7279 57.7589 29.0726 58.8292 30.5726 58.7433 c
31.2933 57.8507 30.722 56.1378 30.8089 55.2081 c
30.2132 55.9523 30.5999 57.1339 30.3372 58.0363 c
30.0032 57.505 30.4398 56.2062 30.1019 55.6788 c
29.7152 56.0402 29.9134 56.9855 29.8655 57.6827 c
29.1702 57.632 29.8421 56.214 29.2767 56.0324 c
29.0052 56.3507 29.389 57.3253 28.9222 57.4464 c
28.6292 57.2687 28.9945 56.4327 28.6868 56.2687 c
28.1634 56.296 28.7386 57.421 28.2152 57.4464 c
27.9456 57.3253 28.2718 56.6046 27.9798 56.505 c
27.5374 56.4952 27.9495 57.339 27.5081 57.3292 c
27.6195 56.8488 27.4222 56.3683 27.0364 56.7394 c
26.6077 55.5538 28.1575 55.7784 28.3333 54.8546 c
28.8245 54.7296 28.8529 54.8234 29.3939 54.8546 c
29.1429 54.4074 29.6136 54.2921 29.9837 54.1476 c
32.4183 56.0324 34.2698 58.5031 34.9339 62.1617 c
34.1761 62.1246 34.6644 64.213 34.3441 64.9904 c
34.0804 64.3517 34.3558 63.1705 33.9905 62.6334 c
33.8275 63.1002 33.8196 63.7194 33.7542 64.2833 c
33.5208 64.3947 33.7113 63.0748 33.4007 62.8698 c
33.2347 63.2936 33.4085 64.0548 33.0472 64.2833 c
32.764 64.1349 33.1126 63.3541 32.8118 63.2233 c
32.4398 63.2838 32.6214 63.8971 32.3402 64.048 c
32.1761 63.858 32.2405 63.4401 31.9866 63.3405 c
31.9476 63.6158 31.8665 63.8483 31.6331 63.9303 c
31.4632 63.6686 31.3372 63.3619 31.3968 62.8698 c
32.6439 62.5836 32.6116 61.0192 34.2249 61.1012 c
33.9945 60.8805 34.1898 60.6696 34.2249 60.3942 c
33.7503 60.5563 33.8089 60.1832 33.637 60.0407 c
33.6253 60.4215 33.3099 60.4996 33.0472 60.6305 c
33.0589 60.816 33.348 60.7223 33.2835 60.984 c
32.6312 61.3922 31.9046 61.7262 31.2796 62.1617 c
31.178 60.9606 32.2152 60.2711 32.4573 59.8043 c
31.5355 59.6281 31.7698 60.609 31.1624 60.7477 c
30.5198 60.6403 30.2562 59.5343 29.512 59.9235 c
30.2445 60.3688 30.6566 61.1344 30.8089 62.1617 c
30.1234 62.1793 30.1614 61.4723 29.7484 61.2184 c
28.9515 61.8571 28.6116 60.1989 27.9798 60.5114 c
28.1361 61.0641 28.6937 61.2125 29.1585 61.4547 c
29.471 61.7282 28.845 61.7711 29.1585 62.0446 c
29.7083 62.2008 29.9905 62.6276 30.5726 62.7506 c
30.5804 63.3092 30.5921 63.8698 30.2191 64.048 c
30.2747 63.6783 30.0726 63.567 29.8655 63.4596 c
29.7738 63.7213 29.7972 64.0978 29.512 64.1661 c
29.5159 63.6901 29.4779 63.2565 29.1585 63.1061 c
29.1614 63.5807 29.1243 64.0138 28.805 64.1661 c
28.7913 63.6295 28.803 63.069 28.4515 62.8698 c
28.4671 63.5533 28.432 64.1857 28.098 64.5197 c
27.807 63.7428 28.305 62.903 27.7445 62.3981 c
27.6898 63.2076 27.6859 64.0685 27.3909 64.6368 c
27.1654 63.8424 27.472 62.5114 27.0364 61.9254 c
27.18 63.2057 26.7855 64.4533 27.0364 65.463 c
28.4085 65.8243 29.1468 64.713 30.5726 64.755 c
30.6702 65.0499 30.8948 65.2179 30.9261 65.5802 c
30.8753 66.0411 30.2523 65.9279 30.2191 66.4044 c
30.5247 66.5314 30.7972 66.6915 31.2796 66.6408 c
31.6761 66.172 31.4788 65.1124 31.9866 64.755 c
33.3177 64.6818 33.5023 65.7521 34.8148 65.6974 c
34.8148 65.5792 34.9105 65.5577 34.9339 65.463 c
34.9652 64.6681 34.4378 63.2096 35.1683 62.6334 c
35.4984 66.4376 35.4202 70.1871 34.9339 73.9479 c
28.4339 73.5905 21.7742 72.9366 15.2518 73.8297 c
15.2518 73.8297 l
p
21.0267 99.2863 m
21.1072 100.3844 19.5091 100.6627 18.5511 99.8756 c
18.4788 98.6657 18.4398 97.3995 19.2586 96.8116 c
19.0438 97.9552 20.9632 98.4332 21.0267 99.2863 c
21.0267 99.2863 l
p
14.3089 101.526 m
15.4139 101.088 17.0164 98.713 18.3153 100.3473 c
17.4661 101.3771 15.6927 103.0558 14.3089 101.526 c
14.3089 101.526 l
p
17.6082 56.6222 m
15.6419 60.695 14.158 65.1036 13.7196 70.5299 c
12.803 81.8502 16.6878 91.5006 21.3797 97.8722 c
20.3367 97.5797 19.9818 96.5992 19.7298 95.5153 c
18.93 96.09 18.4979 97.0328 18.1981 98.1075 c
16.5335 97.6344 15.4905 99.7467 13.8377 99.6398 c
13.8782 100.82 13.741 101.8224 13.6009 102.8219 c
14.8123 103.4186 16.1585 103.8795 17.4905 104.3541 c
17.5633 103.8497 17.1068 103.8737 17.137 103.4113 c
17.493 102.776 18.3797 102.7643 19.2586 102.9401 c
19.3021 102.4244 18.7454 102.5099 18.9051 101.8795 c
19.3416 101.338 19.9578 102.0753 20.4368 101.7614 c
21.8797 101.3717 20.9583 99.3307 21.7337 98.3434 c
23.6619 100.422 25.4378 102.6539 27.7445 104.3541 c
29.9603 105.9894 32.4886 107.9352 35.0511 108.8331 c
32.5511 107.0836 30.014 105.7374 27.7445 104.0006 c
25.5345 102.3102 23.5613 100.1256 21.8509 97.8722 c
17.3782 91.9786 14.3304 84.9254 13.9549 74.6549 c
21.0975 73.4645 28.4847 74.1808 35.4046 74.7731 c
37.1859 65.6954 35.4163 52.921 26.5648 52.2609 c
19.9139 51.7667 17.7249 57.2648 16.0765 62.2809 c
19.6307 64.9943 17.8992 72.3932 14.1907 73.5939 c
13.9188 68.0411 14.9573 62.5055 17.2547 58.1534 c
18.1273 56.5011 19.1063 54.8702 20.0833 53.3214 c
24.72 45.9796 31.9808 39.8937 40.9437 37.0579 c
41.7405 36.8059 42.7669 36.8839 43.3011 36.1139 c
31.1331 39.2687 23.0389 46.4952 17.7264 56.505 c
16.9407 56.1437 16.1404 56.7023 15.2518 56.6222 c
14.8104 56.5128 15.098 55.6769 15.0154 55.2081 c
13.8143 54.8781 12.5892 54.5695 12.0692 53.5577 c
10.7352 53.755 9.6824 54.2355 8.2982 54.382 c
8.4573 55.8741 9.1956 56.7863 9.2405 58.3898 c
9.64 58.3175 9.661 57.8663 9.9481 57.6827 c
10.6282 57.8273 11.0653 58.2159 11.1263 58.9796 c
11.6488 59.0304 11.3826 58.2921 11.8333 58.2726 c
13.0535 58.6495 12.7679 60.1149 14.1907 60.1578 c
15.2015 60.1891 16.1639 59.4718 16.5477 58.6261 c
16.8363 57.9894 16.5731 56.8116 17.6082 56.6222 c
17.6082 56.6222 l
p
f
49.6644 58.2726 m
50.1429 58.0968 50.1165 56.8409 49.6644 56.505 c
50.1273 56.6105 50.4007 56.6476 50.7249 56.3859 c
50.6702 55.421 50.4915 54.5773 50.3714 53.6749 c
49.8011 54.9523 49.1556 56.1515 48.4857 57.3292 c
49.3792 57.1437 49.6253 57.6046 49.6644 58.2726 c
49.6644 58.2726 l
p
f
grestore
87.258 104.4132 m
79.924 104.4132 l
79.924 100.5988 l
84.744 100.5988 l
84.922 100.0665 85.01 99.4157 85.01 98.7653 c
85.01 96.2521 83.385 94.5367 80.428 94.5367 c
77.381 94.5367 75.666 96.5182 75.666 99.2091 c
75.666 100.6876 75.963 102.0475 76.526 103.4078 c
73.243 104.1178 l
72.7093 102.4616 72.473 100.776 72.473 99.1202 c
72.473 93.6793 76.139 90.486 80.723 90.486 c
85.811 90.486 88.381 93.8864 88.381 98.4401 c
88.381 100.6281 87.967 102.5797 87.258 104.4132 c
87.258 104.4132 l
p
77.471 85.1281 m
78.743 85.1281 79.6 84.1818 79.6 82.7033 c
79.6 82.2892 79.6 81.816 79.541 81.4318 c
75.608 81.4318 l
75.578 81.7863 75.549 82.171 75.549 82.5846 c
75.549 84.152 76.258 85.1281 77.471 85.1281 c
77.471 85.1281 l
p
88.116 90.007 m
83.149 86.6066 l
82.498 86.1627 81.877 85.7487 81.463 85.4533 c
80.93 87.671 79.451 89.1788 77.086 89.1788 c
74.1 89.1788 72.6507 86.9318 72.6507 83.1466 c
72.6507 81.195 72.68 78.859 72.7405 77.6173 c
88.116 77.6173 l
88.116 81.4318 l
82.114 81.4318 l
82.114 81.5797 l
88.116 85.3644 l
88.116 90.007 l
88.116 90.007 l
p
82.172 74.4235 m
72.7405 74.4235 l
72.7405 70.6681 l
81.7 70.6681 l
83.916 70.6681 85.217 69.7516 85.217 67.4161 c
85.217 65.257 84.213 64.1329 81.846 64.1329 c
72.7405 64.1329 l
72.7405 60.318 l
82.705 60.318 l
86.194 60.318 88.381 62.5367 88.381 67.2091 c
88.381 72.2648 85.604 74.4235 82.172 74.4235 c
82.172 74.4235 l
p
83.326 53.7355 m
84.596 53.7355 85.455 52.8781 85.455 51.0148 c
85.455 50.4249 85.424 49.8331 85.366 49.3898 c
81.432 49.3898 l
81.405 49.7726 81.405 50.3644 81.405 50.6906 c
81.405 52.6124 81.965 53.7355 83.326 53.7355 c
83.326 53.7355 l
p
77.057 53.4991 m
78.387 53.4991 79.037 52.2863 79.037 50.4835 c
79.037 50.2765 79.037 49.8331 79.008 49.3898 c
75.342 49.3898 l
75.342 49.8917 75.313 50.5128 75.313 50.9855 c
75.313 52.9074 76.022 53.4991 77.057 53.4991 c
77.057 53.4991 l
p
83.326 57.757 m
81.67 57.757 80.369 56.8995 79.897 55.1847 c
79.866 55.1847 l
79.276 56.7218 77.973 57.5499 76.494 57.5499 c
74.071 57.5499 72.6507 55.8644 72.6507 51.7257 c
72.6507 49.6847 72.7405 47.171 72.7405 45.6046 c
88.116 45.6046 l
88.116 47.9699 88.174 49.9796 88.174 51.1046 c
88.174 56.1613 85.631 57.757 83.326 57.757 c
83.326 57.757 l
p
88.172 42.3527 m
72.682 42.3527 l
72.682 38.3679 l
88.172 38.3679 l
88.172 42.3527 l
p
88.116 35.6109 m
85.071 35.6109 l
85.071 29.9619 l
81.7 29.9619 l
81.7 35.3449 l
78.801 35.3449 l
78.801 29.9619 l
75.727 29.9619 l
75.727 35.6109 l
72.7405 35.6109 l
72.7405 26.1479 l
88.116 26.1479 l
88.116 35.6109 l
p
77.471 19.4559 m
78.743 19.4559 79.6 18.5109 79.6 17.0299 c
79.6 16.6159 79.6 16.1439 79.541 15.7609 c
75.608 15.7609 l
75.578 16.1139 75.549 16.4989 75.549 16.9129 c
75.549 18.4799 76.258 19.4559 77.471 19.4559 c
77.471 19.4559 l
p
88.116 24.3349 m
83.149 20.9349 l
82.498 20.4909 81.877 20.0769 81.463 19.7799 c
80.93 21.9989 79.451 23.5069 77.086 23.5069 c
74.1 23.5069 72.6507 21.2609 72.6507 17.4759 c
72.6507 15.5229 72.68 13.1869 72.7405 11.9449 c
88.116 11.9449 l
88.116 15.7609 l
82.114 15.7609 l
82.114 15.9069 l
88.116 19.6929 l
88.116 24.3349 l
88.116 24.3349 l
p
75.727 9.6929 m
72.7405 9.6929 l
72.7405 .3779 l
88.116 .3779 l
88.116 4.1929 l
81.994 4.1929 l
81.994 9.3959 l
79.069 9.3959 l
79.069 4.1929 l
75.727 4.1929 l
75.727 9.6929 l
p
1 .75 0 0 k
f
68.8929 42.3527 m
53.43 42.3527 l
53.4222 38.3699 l
68.8948 38.3699 l
68.8929 42.3527 l
p
68.887 33.4479 m
53.4124 33.4479 l
53.4124 29.7299 l
59.93 29.7589 l
61.5355 29.7589 62.8167 29.7879 63.7386 29.8489 c
63.7386 29.8199 l
62.6976 29.3429 61.7152 28.8079 60.7933 28.2119 c
53.4124 23.7179 l
53.4124 18.5699 l
68.887 18.5699 l
68.887 22.2589 l
61.2386 22.2589 l
60.0179 22.2589 59.2445 22.2299 58.5003 22.1709 c
58.5003 22.1999 l
59.3636 22.5869 60.4652 23.1219 61.3284 23.6569 c
68.887 28.3019 l
68.887 33.4479 l
68.887 33.4479 l
p
62.9046 14.2039 m
53.4124 14.2039 l
53.4124 10.4249 l
62.43 10.4249 l
64.6605 10.4249 65.971 9.5029 65.971 7.1519 c
65.971 4.9799 64.9593 3.8489 62.5784 3.8489 c
53.4124 3.8489 l
53.4124 .0089 l
63.4417 .0089 l
66.9534 .0089 69.1546 2.2409 69.1546 6.9429 c
69.1546 12.0319 66.3577 14.2039 62.9046 14.2039 c
62.9046 14.2039 l
p
f
107.424 38.3659 m
91.871 38.3659 l
91.871 42.337 l
107.424 42.337 l
107.424 38.3659 l
0 1 .8 .2 k
f
49.7161 38.3659 m
34.1644 38.3659 l
34.1644 42.337 l
49.7161 42.337 l
49.7161 38.3659 l
f
grestore
grestore
end
restore
showpage
%%EOF
