%!PS-Adobe-3.0 EPSF-3.0
%%BoundingBox: 0 0 141 165
%%HiResBoundingBox: 0 0 140.454 164.592
%%Title: ufcd-logo-e1-right-a4-color
%%CreationDate: 2009-12-08T12:58+0100
%%Creator: Project ufcd
%%LanguageLevel: 2
%%DocumentData: Clean7Bit
%%Pages: 1
%%EndComments
%%Page: 1 1
save
0 0 140.454 164.592 rectclip
9 dict begin
/k{setcmykcolor}bind def
/p{closepath}bind def
/c{curveto}bind def
/f{fill}bind def
/l{lineto}bind def
/m{moveto}bind def
/s{setoverprint}bind def
/np{newpath}bind def
/clp{clip np}bind def
gsave
np
gsave
0 172.172 m
0 0 l
159.317 0 l
159.317 172.172 l
p
clp
gsave
0 .002 m
159.318 .002 l
159.318 172.172 l
0 172.172 l
0 .002 l
clp
gsave
0 .002 m
159.318 .002 l
159.318 172.172 l
0 172.172 l
0 .002 l
clp
53.9688 12.577 m
50.0898 12.577 l
50.0898 .479 l
70.0615 .479 l
70.0615 5.434 l
62.1113 5.434 l
62.1113 12.193 l
58.3086 12.193 l
58.3086 5.434 l
53.9688 5.434 l
p
70.0615 31.597 m
63.6094 27.18 l
62.7646 26.604 61.958 26.067 61.4199 25.682 c
60.7285 28.563 58.8076 30.522 55.7354 30.522 c
51.8564 30.522 49.9746 27.603 49.9746 22.687 c
49.9746 20.151 50.0127 17.116 50.0898 15.503 c
70.0615 15.503 l
70.0615 20.458 l
62.2646 20.458 l
62.2646 20.651 l
70.0615 25.567 l
70.0615 31.597 l
p
56.2344 25.259 m
57.8867 25.259 59 24.03 59 22.109 c
59 21.572 59 20.957 58.9238 20.458 c
53.8145 20.458 l
53.7764 20.919 53.7393 21.418 53.7393 21.956 c
53.7393 23.991 54.6602 25.259 56.2344 25.259 c
70.0615 46.241 m
66.1055 46.241 l
66.1055 38.905 l
61.7266 38.905 l
61.7266 45.897 l
57.9629 45.897 l
57.9629 38.905 l
53.9688 38.905 l
53.9688 46.241 l
50.0898 46.241 l
50.0898 33.951 l
70.0615 33.951 l
p
70.1357 55 m
50.0146 55 l
50.0146 49.826 l
70.1357 49.826 l
p
63.8398 75.0099 m
61.6885 75.0099 59.999 73.8947 59.3848 71.667 c
59.3457 71.667 l
58.5781 73.6642 56.8877 74.7404 54.9678 74.7404 c
51.8174 74.7404 49.9746 72.5509 49.9746 67.174 c
49.9746 64.524 50.0898 61.26 50.0898 59.223 c
70.0615 59.223 l
70.0615 62.297 70.1387 64.907 70.1387 66.367 c
70.1387 72.9357 66.8359 75.0099 63.8398 75.0099 c
55.6973 69.479 m
57.4258 69.479 58.2705 67.903 58.2705 65.561 c
58.2705 65.291 58.2705 64.715 58.2314 64.139 c
53.4697 64.139 l
53.4697 64.792 53.4307 65.6 53.4307 66.213 c
53.4307 68.71 54.3525 69.479 55.6973 69.479 c
63.8398 69.785 m
65.4922 69.785 66.6045 68.672 66.6045 66.252 c
66.6045 65.484 66.5664 64.715 66.4902 64.139 c
61.3818 64.139 l
61.3428 64.639 61.3428 65.407 61.3428 65.829 c
61.3428 68.326 62.0732 69.785 63.8398 69.785 c
62.3418 96.6554 m
50.0898 96.6554 l
50.0898 91.7784 l
61.7266 91.7784 l
64.6074 91.7784 66.2979 90.5875 66.2979 87.5533 c
66.2979 84.7491 64.9922 83.2892 61.9199 83.2892 c
50.0898 83.2892 l
50.0898 78.3351 l
63.0332 78.3351 l
67.5654 78.3351 70.4082 81.215 70.4082 87.2843 c
70.4082 93.8522 66.7969 96.6554 62.3418 96.6554 c
70.0615 116.8971 m
63.6094 112.4801 l
62.7646 111.9034 61.958 111.3663 61.4199 110.9825 c
60.7285 113.8624 58.8076 115.8214 55.7354 115.8214 c
51.8564 115.8214 49.9746 112.9025 49.9746 107.9865 c
49.9746 105.4513 50.0127 102.4171 50.0898 100.8033 c
70.0615 100.8033 l
70.0615 105.7584 l
62.2646 105.7584 l
62.2646 105.9503 l
70.0615 110.8663 l
70.0615 116.8971 l
p
56.2344 110.5592 m
57.8867 110.5592 59 109.3302 59 107.4103 c
59 106.8722 59 106.2574 58.9238 105.7584 c
53.8145 105.7584 l
53.7764 106.2194 53.7393 106.7184 53.7393 107.2565 c
53.7393 109.2921 54.6602 110.5592 56.2344 110.5592 c
68.9482 135.6095 m
59.4229 135.6095 l
59.4229 130.6544 l
65.6836 130.6544 l
65.9141 129.9635 66.0283 129.1183 66.0283 128.2736 c
66.0283 125.0084 63.917 122.7814 60.0762 122.7814 c
56.1201 122.7814 53.8916 125.3541 53.8916 128.8492 c
53.8916 130.7701 54.2754 132.5363 55.0059 134.3033 c
50.7427 135.2252 l
50.0508 133.0743 49.7437 130.8854 49.7437 128.7345 c
49.7437 121.6671 54.5068 117.5192 60.46 117.5192 c
67.0654 117.5192 70.4082 121.9362 70.4082 127.8502 c
70.4082 130.6935 69.8701 133.2282 68.9482 135.6095 c
false s
1 .75 0 0 k
f
37.3159 18.44 m
24.9849 18.44 l
24.9849 13.53 l
36.6978 13.53 l
39.5967 13.53 41.2979 12.331 41.2979 9.278 c
41.2979 6.456 39.9829 4.987 36.8906 4.987 c
24.9849 4.987 l
24.9849 0 l
38.0117 0 l
42.5728 0 45.4336 2.9 45.4336 9.007 c
45.4336 15.617 41.7998 18.44 37.3159 18.44 c
45.0859 43.435 m
24.9849 43.435 l
24.9849 38.603 l
33.4497 38.642 l
35.5376 38.642 37.1997 38.681 38.3979 38.758 c
38.3979 38.719 l
37.0449 38.101 35.77 37.405 34.5708 36.632 c
24.9849 30.795 l
24.9849 24.108 l
45.0859 24.108 l
45.0859 28.901 l
35.1509 28.901 l
33.5659 28.901 32.561 28.862 31.5947 28.785 c
31.5947 28.823 l
32.7158 29.326 34.146 30.023 35.2666 30.718 c
45.0859 36.748 l
45.0859 43.435 l
p
45.0928 55 m
25.0078 55 l
24.999 49.827 l
45.0957 49.827 l
p
f
gsave
0 1 .8 .2 k
75.024 49.835 20.115 5.175 rectfill
grestore
gsave
0 1 .8 .2 k
0 49.826 20.124 5.175 rectfill
grestore
grestore
gsave
75.024 55.01 m
159.318 55.01 l
159.318 172.172 l
75.024 172.172 l
75.024 55.01 l
clp
69.2979 164.5665 m
90.6392 165.4957 107.709 157.0304 118.897 146.1964 c
130.334 135.1198 139.096 120.1627 140.329 99.5074 c
140.987 88.4694 138.635 78.7677 135.276 70.575 c
131.907 62.356 127.461 55.271 121.958 49.603 c
110.545 37.85 96.2095 29.021 74.9619 28.172 c
53.8848 27.328 36.8242 35.531 25.3638 46.54 c
19.4541 52.219 14.8032 58.523 10.8208 66.289 c
6.9492 73.8419 4.1231 82.879 3.7798 93.3834 c
3.064 115.2736 11.2168 131.4244 21.9961 143.1354 c
30.0771 151.9157 40.6509 158.4093 54.1426 162.4235 c
58.833 163.8185 63.9102 164.3317 69.2979 164.5665 c
22.3018 142.0646 m
17.0332 136.3698 12.2891 129.5597 9.1372 121.5514 c
8.3618 119.5797 7.8731 117.3336 7.147 115.1217 c
6.4439 112.9767 5.7988 110.6046 5.4639 108.3864 c
1.3618 81.2648 11.5259 60.443 26.1289 47 c
37.3311 36.691 53.8389 27.769 75.1152 28.937 c
96.4849 30.109 110.094 38.799 121.344 50.215 c
124.172 53.084 126.737 56.203 128.846 59.553 c
135.436 70.021 140.139 82.8771 139.411 99.5074 c
138.958 109.7667 136.333 118.2535 132.52 126.2965 c
130.674 130.1935 128.745 133.7135 126.245 136.8585 c
123.754 139.9923 121.301 143.2238 118.284 145.8907 c
106.579 156.2404 90.5825 165.0597 68.5322 163.6476 c
46.9658 162.2677 33.1108 153.7457 22.3018 142.0646 c
false s
0.7 .45 0 0 k
f
93.6372 159.0558 m
80.0903 158.3151 65.9492 159.192 51.2344 159.2091 c
63.5938 163.8468 81.4321 163.5348 93.6372 159.0558 c
f
54.2969 158.5973 m
65.9414 157.9332 80.8853 158.6749 91.0356 157.984 c
90.4146 156.8619 88.7192 157.3722 87.6665 157.3722 c
75.8701 157.3722 67.4297 157.026 56.1328 157.525 c
55.4648 157.5543 53.9453 157.3409 53.6836 158.2911 c
53.9102 158.3702 54.0693 158.5172 54.2969 158.5973 c
f
94.2505 158.1373 m
97.7798 158.0245 100.784 156.3195 103.588 154.9225 c
106.954 153.2467 110.112 150.7706 113.079 148.4933 c
126.77 137.9874 137.131 121.6866 138.491 99.8136 c
139.549 82.756 133.657 68.467 126.243 58.023 c
122.336 52.517 118.391 48.242 113.233 44.092 c
111.604 42.781 109.577 41.77 107.721 40.571 c
103.563 37.886 99.4224 35.597 94.2505 33.683 c
89.2388 31.827 84.106 30.719 78.0239 30.161 c
79.2427 31.125 80.9595 30.989 82.4614 31.234 c
86.9868 31.966 91.4106 33.36 95.3208 34.753 c
95.0298 35.687 94.854 36.734 94.4028 37.51 c
93.6138 37.666 93.0688 37.005 92.5669 37.357 c
92.2778 38.614 93.4731 38.39 93.6392 39.193 c
92.8013 41.573 92.6978 44.683 90.5767 45.776 c
90.5571 46.407 90.8423 46.734 90.729 47.459 c
91.3853 47.097 92.188 46.877 93.1782 46.848 c
93.7017 43.392 94.9028 40.611 96.3931 38.121 c
96.1255 37.113 95.5024 36.461 95.6274 35.061 c
102.198 37.272 108.239 40.94 113.538 45.163 c
119.528 49.938 125.377 56.434 129.459 63.533 c
134.481 72.2697 138.604 85.4474 138.032 98.4366 c
137.172 117.9318 128.499 133.9777 117.059 144.2067 c
116.622 144.1866 117.192 143.1564 116.752 143.1354 c
116.243 143.2897 115.088 142.7975 115.069 143.4406 c
114.75 144.9415 116.114 143.8175 116.6 144.5133 c
110.389 150.2926 103.571 155.4655 94.2505 158.1373 c
f
101.446 154.0045 m
100.504 153.3624 99.4263 152.8605 98.8442 151.8615 c
99.3032 150.7916 100.061 150.0187 100.526 148.9523 c
101.049 144.9093 97.5962 144.8424 95.3208 143.5944 c
94.522 144.0197 94.4556 145.1764 93.7915 145.7374 c
93.231 146.1466 93.1685 145.0016 92.7192 144.8195 c
91.4653 145.3634 90.1919 146.4913 90.8813 148.4933 c
92.0415 149.0465 93.3228 148.5426 94.0981 147.8815 c
94.2974 147.9342 94.3364 148.1505 94.5571 148.1866 c
93.8208 149.9576 90.8403 151.0407 92.2603 153.5446 c
93.3208 152.2594 94.4399 151.0294 95.7817 150.0245 c
97.1567 151.8434 91.3345 153.0724 93.6392 156.3004 c
96.8755 158.0485 99.3638 155.2755 101.446 154.0045 c
94.5571 156.1476 m
94.7622 154.4576 98.1255 151.1085 99.1489 153.0856 c
98.3989 154.7916 96.8599 156.5026 94.5571 156.1476 c
98.6899 145.7374 m
99.2329 147.6056 97.604 150.9166 96.2407 149.4113 c
97.1978 148.9816 97.9771 147.2213 97.0044 146.1964 c
96.1079 146.6266 96.0239 147.8693 94.8618 148.0333 c
94.8696 147.7706 94.7446 147.6412 94.5571 147.5743 c
95.2661 146.6012 95.8794 145.5294 96.6997 144.6657 c
97.4536 144.9313 98.1802 145.2277 98.6899 145.7374 c
91.3403 147.5743 m
90.5747 146.7413 91.6021 145.6447 92.4126 145.4313 c
92.6899 145.7687 93.0103 146.0592 93.1782 146.5035 c
92.6021 146.8966 92.2036 147.4674 91.3403 147.5743 c
f
72.9727 156.7599 m
72.7686 154.4113 76.8794 155.3341 77.106 152.9332 c
76.8188 152.4982 75.9102 152.0641 75.2686 152.4742 c
75.3467 153.2931 76.0625 152.881 76.4927 153.0861 c
74.7646 154.3019 70.3975 154.3312 68.6865 153.0861 c
68.5762 152.67 69.4072 153.1949 69.2979 152.7789 c
69.1699 152.026 68.332 152.8361 67.9199 152.7789 c
68.2402 154.653 70.2754 154.8131 71.9004 155.382 c
71.9414 155.9332 71.6172 156.1202 71.5938 156.6061 c
71.8486 156.8629 72.4932 156.7282 72.9727 156.7599 c
f
78.9419 156.7599 m
79.6392 153.7228 79.6763 148.421 79.2485 145.278 c
78.2251 146.2311 78.6821 148.0338 78.6353 149.4122 c
78.561 151.5919 78.4146 153.9782 78.4829 156.2999 c
78.4399 156.548 78.6274 156.5641 78.6353 156.7599 c
78.9419 156.7599 l
p
f
77.7173 156.6061 m
78.0005 153.3849 78.6294 148.3512 77.8716 145.5841 c
77.8442 149.4982 77.7915 152.9 77.7173 156.6061 c
f
79.8599 156.6061 m
80.5083 154.1129 80.0083 149.3619 80.1665 145.8912 c
79.5688 148.6032 79.9888 152.9879 79.8599 156.6061 c
f
88.5864 156.6061 m
89.0454 156.6061 l
89.3149 153.1393 89.5552 149.2521 89.1997 145.4323 c
88.0728 146.025 88.6548 148.318 88.5864 149.8702 c
88.4946 151.9484 88.3364 154.212 88.4321 156.1471 c
88.3892 156.3942 88.5786 156.4113 88.5864 156.6061 c
f
87.6665 156.4537 m
88.1216 153.8644 88.1313 149.0768 87.9731 145.5846 c
87.272 148.6075 87.8618 152.9235 87.6665 156.4537 c
f
89.811 156.3004 m
90.1548 153.3746 90.1743 148.3903 90.1177 145.5846 c
89.6196 148.8092 89.9067 152.1813 89.811 156.3004 c
f
105.424 152.4738 m
105.424 151.5548 l
104.922 151.3429 104.358 151.1949 103.588 151.2487 c
103.59 151.6095 103.325 151.6998 103.436 152.1676 c
104.161 152.2076 104.616 152.5177 105.424 152.4738 c
f
76.3403 150.0241 m
76.168 149.2257 75.082 149.3429 75.1152 148.34 c
75.584 147.881 75.7305 149.0431 76.3403 148.9518 c
77.2368 148.4738 77.2563 146.6417 76.9517 145.4318 c
76.4888 145.2618 75.4023 145.1417 74.9619 145.4318 c
75.042 146.1691 75.4893 146.5367 75.8809 146.963 c
75.2383 147.7389 74.7402 146.046 74.5029 145.4318 c
72.9941 145.2838 73.4326 147.7267 74.9619 147.7282 c
74.2217 148.1569 73.3105 147.444 73.125 146.8087 c
72.4873 146.8859 72.335 147.4479 72.207 148.0338 c
74.1602 147.9747 74.3799 151.088 76.3403 150.0241 c
f
104.2 150.0241 m
106.016 145.795 100.631 145.2687 101.292 141.299 c
100.567 141.361 100.239 141.025 99.4556 141.1461 c
99.6177 142.2257 99.145 142.672 98.9966 143.441 c
100.834 144.5358 103.112 146.7438 102.364 149.4117 c
102.667 149.9249 103.42 149.9869 104.2 150.0241 c
f
87.0552 149.7179 m
86.8442 148.194 84.811 148.4933 84.7603 146.8092 c
83.7505 146.441 83.1177 145.6949 82.1567 145.278 c
81.9556 146.1432 82.7642 145.9982 82.77 146.6564 c
82.438 147.754 81.0845 147.8302 80.7778 148.9523 c
81.9458 149.6862 82.7017 147.7013 83.229 146.8092 c
85.0806 147.1071 84.4907 150.6373 87.0552 149.7179 c
f
86.7485 148.34 m
87.4985 147.3693 85.7485 146.4332 85.6782 145.278 c
84.9321 145.3492 83.8853 145.1193 83.3813 145.4323 c
83.4771 146.0499 84.1978 146.0441 84.7603 146.1969 c
85.2407 147.0939 85.6392 148.0729 86.7485 148.34 c
f
80.9321 147.5748 m
82.4731 147.5826 82.3423 145.6447 81.2368 145.2775 c
80.6079 145.4606 80.6782 147.0016 80.9321 147.5748 c
f
87.0552 146.5031 m
86.8228 146.0621 87.061 146.0241 86.9028 145.4318 c
86.2896 145.4318 l
86.3188 146.0148 86.5063 146.4391 87.0552 146.5031 c
f
106.038 146.5031 m
107.346 146.1427 108.934 146.4718 110.323 146.5031 c
110.754 144.8419 110.774 142.7692 111.547 141.4518 c
111.225 140.943 111.104 141.9098 110.629 141.7579 c
110.057 141.2101 109.407 140.7369 109.559 139.462 c
109.127 140.0377 108.627 139.545 108.18 139.3087 c
108.008 138.6139 108.047 137.7072 107.874 137.0128 c
106.594 135.8351 104.116 136.1007 102.823 137.0128 c
101.713 137.7941 101.792 139.4088 100.68 139.7677 c
101.245 140.1217 102.463 139.8209 103.282 139.921 c
103.375 140.9318 103.014 141.4899 103.127 142.5241 c
104.12 143.8287 105.557 144.6871 106.038 146.5031 c
105.426 140.2267 m
108.04 140.3009 109.831 143.463 108.333 145.7379 c
107.278 144.1129 104.331 143.0128 105.426 140.2267 c
103.127 139.462 m
102.596 136.1407 107.458 135.9288 106.344 139.462 c
105.768 139.9708 103.721 139.8917 103.127 139.462 c
f
91.188 144.5133 m
91.0649 143.1212 89.0454 143.5944 87.8208 143.5944 c
83.6431 143.5944 78.0728 143.4713 74.1973 143.7472 c
74.29 144.1144 74.0039 144.8585 74.3496 144.9723 c
80.3267 144.7794 85.3892 145.1593 91.188 144.5133 c
f
92.7192 142.9821 m
92.1587 142.5573 90.3716 142.7521 89.811 142.8292 c
90.7642 143.1979 91.7661 143.1241 92.7192 142.9821 c
f
94.4028 141.7579 m
94.0435 140.9005 92.8013 141.3029 92.1079 141.299 c
86.4048 141.2677 79.1821 141.2946 74.3496 141.7579 c
74.374 141.9357 74.3154 142.0299 74.1973 142.0636 c
74.2646 142.1998 74.3301 142.3375 74.502 142.3698 c
79.5532 142.3258 83.9712 142.2179 89.6567 142.2179 c
91.2759 142.2179 93.0806 142.5939 94.4028 141.7579 c
f
115.221 142.2174 m
114.997 141.4215 115.081 140.3185 115.069 139.3082 c
113.147 138.0162 111.11 136.8385 110.477 134.2574 c
109.891 133.9445 109.305 134.2262 108.639 134.2574 c
108.639 136.5533 l
110.764 137.6271 112.946 139.3414 112.926 142.0641 c
113.858 141.9484 114.315 142.3082 115.221 142.2174 c
f
91.8013 140.839 m
93.188 140.9371 94.4966 139.3571 95.6274 138.3903 c
97.7778 136.5514 99.395 135.0411 101.446 133.338 c
102.42 132.5284 103.76 131.9664 104.2 130.735 c
101.672 131.8751 99.77 133.9293 97.772 135.6344 c
95.7563 137.3541 93.5103 138.817 91.8013 140.839 c
f
77.8696 134.8693 m
78.3345 138.1993 80.3657 140.5431 84.2993 139.921 c
84.9966 139.2614 85.7153 138.4142 85.3716 137.1652 c
84.6704 134.6183 79.1509 137.2179 77.8696 134.8693 c
83.5337 136.4 m
86.811 137.2169 82.8696 141.5372 82.1567 137.778 c
81.6313 137.9152 81.4907 138.4391 80.7778 138.3903 c
79.9829 138.0099 78.7485 137.2579 79.0962 136.2472 c
79.9966 137.4713 82.1899 136.0641 83.5337 136.4 c
f
118.284 139.7677 m
119.084 139.5475 119.95 139.3907 121.04 139.4616 c
118.694 137.1115 115.733 135.3785 113.692 132.7257 c
113.583 132.1583 113.954 132.0685 113.844 131.5016 c
113.161 131.2667 112.438 131.0695 111.549 131.0416 c
111.924 131.6725 111.213 132.9435 111.549 133.4913 c
113.895 135.4816 116.36 137.3546 118.284 139.7677 c
f
87.0552 138.5431 m
87.186 138.5714 87.1997 138.483 87.2075 138.3903 c
89.8091 136.7404 89.6548 128.8683 84.9126 130.276 c
82.0493 133.588 88.1313 134.6544 87.0552 138.5431 c
84.7603 132.879 m
83.6958 129.0182 89.8442 131.2072 86.7485 133.1852 c
87.2329 133.2604 87.2896 132.9093 87.8208 133.0324 c
88.7896 133.7692 88.4653 136.1481 87.5161 136.7062 c
87.938 135.0641 85.0903 134.087 84.7603 132.879 c
f
124.102 135.6344 m
121.973 133.0172 118.221 132.0255 116.141 129.3585 c
116.141 127.9806 l
115.555 128.1095 114.913 128.1803 114.151 128.1334 c
113.786 128.8483 114.29 129.4894 114.151 130.4293 c
116.563 132.3546 119.491 133.7633 121.499 136.0944 c
122.204 135.7784 123.163 135.7164 124.102 135.6344 c
f
83.9946 129.0519 m
81.0786 128.5651 77.7603 130.6759 78.4829 133.338 c
78.9282 134.9791 82.0337 134.9303 82.4634 133.1852 c
82.8599 131.567 82.606 129.9313 83.9946 129.0519 c
79.7056 131.6539 m
80.2524 131.4303 80.6235 132.1461 80.7778 131.8073 c
80.772 131.3043 80.52 131.045 80.6274 130.4293 c
81.1626 129.9449 81.7642 129.526 82.77 129.5114 c
81.9771 130.7614 82.1743 132.9982 81.0864 133.9503 c
79.0532 134.5392 78.6079 132.464 79.7056 131.6539 c
f
110.936 127.0621 m
107.616 127.048 104.778 126.6818 101.598 127.0621 c
101.465 127.5797 102.84 128.6788 103.588 129.358 c
104.459 130.15 105.493 130.8199 106.038 131.6539 c
108.03 130.4821 109.35 128.6388 110.936 127.0621 c
f
124.254 131.5011 m
124.223 130.5114 123.637 130.0782 123.795 128.8986 c
123.059 127.8175 118.172 126.9703 118.59 125.0714 c
119.026 123.0934 124.415 126.0363 124.866 127.5211 c
125.743 127.6315 126.233 127.3585 127.01 127.3683 c
126.831 126.5782 126.327 126.1115 126.245 125.2252 c
123.907 124.2462 121.067 123.7672 120.122 121.3986 c
119.434 121.3234 118.973 121.4752 118.436 121.5514 c
118.387 122.4684 118.922 122.8014 118.897 123.6935 c
118.579 124.3971 117.225 124.0646 116.6 124.4591 c
116.561 125.4664 117.016 125.9825 116.905 127.0621 c
118.561 128.5704 121.833 128.4645 121.958 131.5011 c
122.971 131.5953 123.198 131.5411 124.254 131.5011 c
f
72.3604 130.2765 m
74.5107 127.8864 78.0669 126.9025 80.4731 124.7653 c
80.5415 124.2726 80.7661 123.9366 80.7798 123.3883 c
83.1626 124.9523 87.811 123.1256 87.3618 120.0206 c
86.6196 122.9093 82.4399 124.7413 80.3208 122.0104 c
81.3462 127.0153 73.3848 126.3566 72.3604 130.2765 c
f
111.854 126.2965 m
109.19 125.7946 104.268 125.7887 101.446 126.2965 c
105.485 126.1217 108.067 126.6915 111.854 126.2965 c
f
106.038 125.5304 m
106.176 122.8966 106.182 121.0704 106.19 117.8776 c
105.17 117.8746 104.256 117.7897 102.975 117.7238 c
102.516 120.1837 102.577 123.2745 102.67 125.5304 c
106.038 125.5304 l
p
103.127 124.6134 m
103.262 122.2819 102.903 120.3336 103.436 118.3366 c
104.133 118.4025 105.12 118.1808 105.577 118.4894 c
105.481 120.5358 105.776 122.9728 105.426 124.7657 c
104.792 125.1266 103.743 124.7648 103.127 124.6134 c
f
110.784 125.3781 m
111.106 122.9401 110.846 120.2081 111.088 118.0299 c
109.975 117.7443 108.42 117.8712 107.415 117.8771 c
107.542 120.7731 107.192 123.3361 107.415 125.5309 c
108.502 125.4449 109.944 125.712 110.784 125.3781 c
107.874 124.6129 m
107.991 122.5363 107.561 119.9098 108.333 118.4889 c
108.62 120.0651 108.008 122.8468 108.487 124.6129 c
108.465 122.2311 108.715 120.8961 108.639 118.3361 c
110.477 118.3361 l
110.743 120.2682 110.471 122.9 110.323 124.9181 c
109.622 125.256 108.444 124.902 107.874 124.6129 c
f
101.905 125.3781 m
102.516 123.1412 102.131 120.1432 102.364 117.8771 c
101.479 119.2418 102.1 122.59 101.905 125.3781 c
f
106.649 125.3781 m
107.258 123.5363 106.959 119.9742 106.803 117.8771 c
106.192 119.7218 106.497 123.278 106.649 125.3781 c
f
111.702 118.0304 m
111.014 119.7936 111.579 122.8063 111.395 125.0714 c
f
128.999 123.3883 m
128.704 122.6642 128.09 122.2555 127.93 121.3986 c
128.284 120.4777 129.612 120.5294 130.53 120.1735 c
130.309 119.2203 129.547 118.8092 129.305 117.8776 c
129.696 117.0436 130.913 117.0343 131.602 116.4996 c
131.77 115.6344 130.766 114.7076 130.377 113.8976 c
127.961 113.5065 125.342 113.3185 124.561 111.2946 c
123.948 111.5485 123.358 111.8273 122.571 111.9074 c
123.12 115.2863 128.344 113.9923 129.612 116.6525 c
127.543 118.1075 124.03 116.2574 122.723 114.9684 c
121.993 114.9532 121.579 115.2545 121.04 115.4283 c
121.516 118.9313 127.114 117.3136 128.387 120.0206 c
127.588 121.4552 126.649 120.5724 125.02 120.0206 c
123.397 119.4703 121.969 119.6202 121.346 118.3366 c
120.631 118.2345 120.362 118.5773 119.815 118.6422 c
120.022 119.4054 120.245 120.1525 120.581 120.7853 c
122.731 121.1686 125.834 121.8326 126.856 123.8473 c
127.768 123.8912 128.374 123.6295 128.999 123.3883 c
f
81.0864 116.6525 m
80.3032 115.9542 78.8091 115.9694 77.5649 115.7345 c
76.7173 117.6954 75.7871 119.5695 73.4307 120.0201 c
73.3271 121.5021 73.8877 122.3195 74.3496 123.2345 c
78.2153 122.6603 79.9595 119.9645 81.0864 116.6525 c
f
103.588 123.2345 m
103.944 122.3668 103.641 120.8375 103.741 119.7145 c
103.803 119.1627 103.461 119.5045 103.588 119.8678 c
103.588 120.7858 l
103.596 122.1085 103.405 122.2296 103.588 123.2345 c
f
73.125 117.5709 m
72.168 117.6608 72.877 116.0846 71.8994 116.194 c
71.875 115.861 72.4424 116.1237 72.666 116.0397 c
72.2393 115.423 71.0166 115.8068 70.9814 116.4987 c
69.8418 115.3429 67.75 115.1398 66.6943 113.8976 c
66.9277 113.6759 67.4727 114.4401 67.7666 114.6627 c
68.043 113.924 66.7529 113.4347 66.8486 112.3658 c
66.2979 112.4279 66.6094 113.3517 66.083 113.4376 c
66.1709 114.525 66.8994 114.9679 67.6133 115.4279 c
67.0869 121.462 77.604 120.6266 76.7993 115.4279 c
77.5317 114.7828 78.4575 114.3307 78.3306 112.8258 c
77.8521 112.756 77.8403 113.152 77.8716 113.5909 c
77.0767 114.8878 75.0693 114.9738 73.8906 115.8868 c
73.8564 116.6549 73.835 117.1969 73.125 117.5709 c
75.8809 115.735 m
75.3486 115.9157 74.8574 116.1407 74.3496 116.3468 c
74.6465 115.6227 75.6436 115.5997 76.4927 115.4279 c
76.4966 115.942 76.2817 116.2379 76.0342 116.4987 c
75.9492 116.277 76.2129 115.7086 75.8809 115.735 c
f
86.1372 119.4078 m
87.2778 119.171 89.4067 119.923 89.811 118.9479 c
89.2192 118.3429 86.9829 118.6461 86.1372 118.796 c
86.1372 119.4078 l
p
f
89.811 117.7242 m
88.4224 117.7999 87.9185 117.3991 87.0552 117.8771 c
87.2505 118.6212 89.5728 118.3693 89.811 117.7242 c
f
113.233 117.1119 m
109.493 116.4059 104.401 117.0031 100.067 116.8058 c
100.067 117.2648 l
100.192 117.2941 100.219 117.4181 100.374 117.4181 c
104.444 117.2169 109.436 117.8199 113.233 117.1119 c
f
102.057 114.3566 m
101.534 114.2921 101.184 114.4025 101.292 114.9684 c
101.784 115.2174 102.18 115.1002 102.057 114.3566 c
f
102.67 115.1217 m
102.893 114.9874 103.155 114.8927 103.127 114.5094 c
102.993 114.3907 102.784 114.3449 102.518 114.3566 c
102.467 114.7106 102.542 114.9435 102.67 115.1217 c
f
104.354 115.1217 m
104.721 114.6886 105.28 115.3326 105.577 114.9684 c
105.577 114.3566 l
104.047 114.3566 l
104.024 114.7365 104.288 114.8307 104.354 115.1217 c
f
110.323 115.1217 m
110.854 115.2286 110.872 114.5846 110.629 114.3566 c
110.1 114.2496 110.081 114.8927 110.323 115.1217 c
f
112.772 114.5094 m
112.374 114.4664 112.116 114.5656 112.161 114.9684 c
112.372 115.1954 112.889 115.0485 112.772 114.5094 c
f
100.526 114.9684 m
100.93 115.0143 100.92 114.6486 100.987 114.3566 c
100.475 114.2028 100.483 114.5695 100.526 114.9684 c
f
107.262 114.9684 m
107.477 114.0695 106.245 114.3087 106.038 114.6627 c
106.071 115.1383 106.799 114.9205 107.262 114.9684 c
f
108.946 114.816 m
108.93 114.382 107.891 114.1891 107.874 114.6627 c
107.686 115.172 108.909 115.0367 108.946 114.816 c
f
111.088 114.9684 m
111.854 114.9684 l
111.854 114.3566 l
111.331 114.2926 110.981 114.4025 111.088 114.9684 c
f
76.4927 114.2032 m
78.0786 114.1539 77.8501 111.2042 76.1865 111.4469 c
76.2275 111.7159 75.7559 112.2111 76.1865 112.3663 c
76.5122 112.4371 76.4771 112.1481 76.4927 111.9074 c
77.5571 112.2633 76.9771 113.6891 76.4927 114.2032 c
f
103.129 113.8971 m
103.204 113.4142 102.426 113.7824 102.364 113.4371 c
102.409 112.9215 103.042 112.9943 103.129 112.5192 c
103.149 111.8351 102.391 111.9313 101.905 111.7545 c
101.809 111.3385 102.1 110.5392 101.752 110.3751 c
101.538 111.2072 101.243 112.0074 100.372 112.5192 c
100.266 113.0851 100.909 112.9015 101.139 113.1315 c
101.006 113.3551 100.909 113.6163 100.526 113.5914 c
101.243 114.0866 102.151 114.1603 103.129 113.8971 c
f
76.645 113.7443 m
76.5005 113.151 77.2427 113.1129 76.7993 112.672 c
76.4419 112.8751 76.3599 113.3561 76.1865 113.7443 c
76.645 113.7443 l
p
f
129.918 112.6725 m
131.2 112.9884 131.559 111.8976 131.143 110.9884 c
130.071 110.9884 l
129.588 111.5065 129.649 111.9884 129.918 112.6725 c
f
127.622 110.5294 m
127.442 110.5045 127.493 110.2506 127.469 110.0695 c
126.842 109.7365 126.243 109.7116 125.786 110.2238 c
125.301 111.8248 127.737 111.8004 127.622 110.5294 c
f
104.965 110.0699 m
105.165 110.4523 105.825 110.025 105.885 109.7638 c
105.823 109.0079 105.206 108.8092 105.118 108.0802 c
104.348 107.9728 104.11 108.3971 104.2 109.151 c
104.727 109.0841 105.059 109.212 105.426 109.3048 c
105.499 109.7848 105.235 109.9298 104.965 110.0699 c
f
107.569 110.2233 m
107.946 110.2433 108.305 110.2462 108.487 110.0704 c
108.272 109.8253 107.959 109.6793 107.569 109.6115 c
107.569 110.2233 l
p
f
76.4927 109.611 m
75.5977 108.3112 74.125 107.589 73.4307 106.089 c
74.3359 106.463 75.0332 108.3663 76.4927 108.692 c
76.9106 108.2941 77.5825 108.1491 77.8696 107.6202 c
76.1396 105.983 74.6738 104.0812 74.1973 101.192 c
72.7305 100.7682 71.8428 101.903 72.3604 103.1813 c
72.8154 103.1901 73.2559 103.441 74.0439 103.4879 c
74.2568 104.6193 73.248 104.5289 73.2783 105.4782 c
72.8457 105.4493 73.0879 104.7501 72.5127 104.8654 c
72.7559 106.776 74.2793 110.1691 76.4927 109.611 c
f
133.592 108.9982 m
132.997 105.6813 126.545 108.5763 125.327 105.6305 c
126.69 103.8644 130.803 104.7872 132.672 105.7833 c
133.375 105.6681 133.807 105.2853 134.356 105.0172 c
133.811 104.3903 133.129 103.8986 132.672 103.1803 c
131.004 103.5582 128.815 103.1735 127.163 103.0284 c
126.534 102.7394 126.504 101.8492 125.786 101.6505 c
125.311 101.9933 124.831 102.3282 124.254 102.5695 c
124.672 103.2213 125.366 103.5992 125.786 104.2521 c
125.559 105.3043 124.286 105.3043 123.795 106.0895 c
123.936 107.0201 124.778 107.2501 124.866 108.2325 c
127.167 108.2804 128.991 108.8043 131.143 108.9982 c
131.821 109.9103 132.833 109.7775 133.592 108.9982 c
f
107.874 109.1515 m
108.342 109.2623 108.325 108.8873 108.793 108.9987 c
108.917 108.3136 108.52 108.1486 108.028 108.0797 c
107.817 108.2775 107.875 108.7448 107.874 109.1515 c
f
79.5552 99.2008 m
78.938 99.7277 79.1587 100.3058 79.5552 100.8859 c
78.8286 100.8458 78.6919 100.2159 77.8696 100.2726 c
77.6196 101.067 77.7388 102.045 78.0239 102.7228 c
77.1509 102.5241 77.7661 100.837 76.7993 100.7321 c
75.8867 102.6266 77.1353 104.9796 77.8696 106.2428 c
76.2856 105.278 76.5767 102.4347 75.2686 101.192 c
74.4473 102.0568 75.2002 103.7506 75.7275 104.712 c
76.2935 105.7477 77.4321 106.7008 78.1782 107.1608 c
81.4341 105.2648 82.1489 100.8258 82.6157 96.1398 c
82.2583 95.6598 82.0415 96.5499 81.5435 96.7516 c
80.4771 97.1857 78.9868 96.8429 78.0239 96.9049 c
78.1021 98.0031 77.8247 98.7467 77.5649 99.507 c
78.1587 99.8698 79.0024 99.3688 79.5552 99.2008 c
f
134.817 100.8854 m
134.358 99.9655 133.299 99.6476 132.827 98.7423 c
133.301 97.8893 134.161 97.4225 134.969 96.9054 c
134.51 96.0382 133.586 95.6354 132.979 94.9142 c
131.424 95.3116 127.358 96.1027 126.549 94.4552 c
125.883 94.7062 125.364 95.1066 124.713 95.3746 c
124.961 96.0953 125.588 96.4376 126.092 96.9054 c
128.245 96.8414 131.913 96.1813 132.979 97.6705 c
131.311 100.3654 125.94 97.2194 124.559 99.2003 c
125.475 102.0856 131.643 98.6574 132.827 101.6505 c
133.684 101.5895 134.284 101.2697 134.817 100.8854 c
f
75.7275 94.9147 m
75.1143 96.2125 76.1387 100.1359 73.8906 100.2736 c
75.6787 101.3668 78.2954 99.6705 77.4126 96.5997 c
77.0591 95.8287 76.2178 95.5465 75.7275 94.9147 c
f
115.989 94.9147 m
116.167 94.8907 116.118 94.6359 116.141 94.4557 c
113.825 92.1788 112.127 89.2838 109.711 87.1085 c
111.618 89.8956 113.915 92.2936 115.989 94.9147 c
f
95.4751 94.7618 m
96.395 94.7618 l
98.0571 93.9728 96.5298 90.4449 95.0142 92.1588 c
97.2622 91.923 96.8677 94.3903 95.4751 94.7618 c
f
97.1587 94.608 m
97.5356 95.0231 98.0884 94.3234 98.0767 93.8434 c
97.4673 93.795 97.6626 94.5514 97.1587 94.608 c
f
114.303 93.5372 m
113.926 93.8243 113.51 94.0719 113.233 94.4562 c
113.473 95.0543 114.305 94.1422 114.303 93.5372 c
f
100.68 94.4557 m
101.444 94.7374 102.395 94.5997 102.67 93.8434 c
103.028 92.8546 102.34 91.7174 101.75 91.5465 c
100.133 91.0778 98.4634 93.6378 100.68 94.4557 c
102.209 93.9957 m
101.448 94.5587 100.338 94.1608 99.9146 93.5367 c
99.7661 92.4708 100.391 92.1788 100.833 91.6998 c
101.944 91.8326 102.622 92.8029 102.209 93.9957 c
f
113.385 93.9962 m
113.922 92.3732 112.961 91.4581 111.702 91.6998 c
109.262 92.17 111.217 96.2638 113.385 93.9962 c
112.467 92.006 m
113.633 92.3312 113.215 94.9908 111.549 94.15 c
110.211 93.4762 111.321 91.6881 112.467 92.006 c
f
102.823 94.3024 m
103.301 94.8683 103.475 93.8414 103.741 93.6906 c
103.391 93.2516 103.084 94.1456 102.823 94.3024 c
f
107.11 94.15 m
110.495 93.5988 105.872 89.5099 105.12 92.465 c
104.852 93.5157 105.469 93.9249 106.038 94.4557 c
106.481 93.9318 105.29 93.8248 105.424 92.7721 c
105.745 90.3029 109.604 92.733 107.11 94.15 c
f
107.874 90.6285 m
107.502 90.9406 107.143 89.9391 106.803 89.7091 c
107.409 88.8366 108.319 88.2672 108.793 87.2604 c
107.917 87.7633 107.344 88.5665 106.803 89.4034 c
105.778 88.9493 105.409 87.8385 104.661 87.1085 c
104.137 87.5382 105.27 88.6622 105.885 88.9454 c
107.28 90.9171 108.801 92.7653 110.477 94.4552 c
109.999 93.1984 108.885 92.5773 108.333 91.3942 c
110.836 92.6823 112.004 88.3282 109.405 88.1793 c
108.432 88.1232 107.229 89.0973 107.874 90.6285 c
109.25 88.4855 m
110.475 88.4503 111.196 90.1554 110.018 91.0885 c
107.395 91.5704 107.59 88.5314 109.25 88.4855 c
f
104.965 94.15 m
103.004 91.8761 101.252 89.3917 98.9946 87.4137 c
100.85 89.692 102.825 92.6671 104.965 94.15 c
f
108.639 94.15 m
108.87 94.609 109.327 94.0367 109.252 93.6901 c
108.762 93.5558 108.936 94.088 108.639 94.15 c
f
137.114 92.9249 m
137.184 92.4449 136.702 92.5201 136.653 92.1588 c
135.907 92.2799 135.729 92.9699 135.124 93.2311 c
135.385 94.8058 136.647 93.3741 137.114 92.9249 c
f
134.665 92.6188 m
133.518 89.9625 128.422 92.7955 126.397 90.7819 c
125.709 91.1144 125.186 91.6105 124.713 92.1588 c
124.887 92.8536 125.706 92.9025 126.092 93.3834 c
127.758 93.1036 129.885 92.7418 131.602 93.0787 c
132.088 93.1735 132.563 93.8258 132.827 93.8434 c
133.733 93.9025 133.805 92.7394 134.665 92.6188 c
f
98.6899 92.9249 m
99.5532 92.2081 100.206 91.278 100.833 90.3219 c
100.081 91.066 98.7563 92.0001 98.6899 92.9249 c
f
104.2 92.7716 m
105.124 92.1119 105.692 91.0988 106.497 90.3219 c
105.526 90.3229 104.774 91.8629 104.2 92.7716 c
f
109.711 92.7716 m
110.875 92.507 110.905 91.108 111.854 90.629 c
111.038 90.631 110.215 91.9459 109.711 92.7716 c
f
99.4556 91.2404 m
100.155 90.6115 99.9985 88.9806 99.3013 88.4845 c
98.3696 88.3698 97.7739 88.5895 97.311 88.9454 c
96.5923 90.5333 97.8169 92.0104 99.4556 91.2404 c
98.6899 88.7916 m
99.9204 89.0123 100.014 91.6993 98.0786 90.9347 c
96.5181 90.3185 97.7114 88.6154 98.6899 88.7916 c
f
102.516 90.7819 m
103.434 91.7096 105.157 91.1696 105.424 90.3214 c
106.356 87.3868 101.288 87.4044 102.516 90.7819 c
104.047 88.3326 m
105.381 88.4489 105.508 91.5035 103.588 90.9347 c
101.901 90.4366 102.842 88.2277 104.047 88.3326 c
f
95.0161 91.088 m
95.4185 91.1339 95.5181 90.8761 95.4751 90.4757 c
95.0161 90.4757 l
95.0161 91.088 l
p
f
89.5044 90.7819 m
89.4478 90.1744 89.645 89.3146 89.3521 88.9454 c
86.9653 89.0255 84.6118 88.8175 82.77 88.7916 c
81.9419 91.9215 87.0122 90.4616 89.5044 90.7819 c
f
134.051 88.6388 m
133.67 87.9489 132.819 87.7277 132.368 87.1075 c
132.625 86.2946 133.424 86.0216 133.899 85.424 c
133.43 84.7169 132.583 84.3927 132.061 83.7404 c
130.284 84.2423 128.512 84.545 126.397 84.3527 c
125.811 85.5016 124.819 86.2448 123.948 87.1075 c
124.606 87.9288 125.334 88.6818 126.092 89.4039 c
128.108 89.4225 131.155 88.4718 132.52 89.7096 c
133.309 89.632 133.668 89.1237 134.051 88.6388 c
125.325 86.1896 m
127.147 86.0035 130.524 85.1525 132.061 86.1896 c
132.022 88.3029 125.657 88.5846 125.325 86.1896 c
f
96.2407 89.5573 m
97.0688 89.0582 97.5649 88.2282 98.231 87.5665 c
97.3735 87.4283 96.5903 88.6803 96.2407 89.5573 c
f
101.446 89.2506 m
102.202 89.3419 102.797 87.9528 103.436 87.4137 c
102.629 87.275 102.124 88.754 101.446 89.2506 c
f
96.8521 87.4137 m
96.272 87.65 95.9946 88.1896 95.0161 88.027 c
95.4282 88.693 97.0278 88.3107 96.8521 87.4137 c
f
113.538 87.4137 m
112.7 87.5861 111.569 87.7726 110.629 87.108 c
110.948 88.4166 112.852 88.298 113.538 87.4137 c
f
82.9224 88.0265 m
83.4751 88.1705 83.1353 87.4235 83.229 87.1075 c
83.8306 87.0157 83.1899 88.1676 83.8403 88.0265 c
83.811 86.3727 84.0259 84.4327 83.9946 82.3615 c
83.3286 83.3302 83.77 85.4054 83.3813 86.6476 c
83.0962 85.8317 83.8403 83.1544 83.0747 82.3615 c
83.1099 84.6583 82.8774 85.7394 82.9224 88.0265 c
f
102.364 87.4137 m
102.09 87.1437 100.709 88.1456 99.9146 87.2609 c
100.247 88.2589 101.827 88.1046 102.364 87.4137 c
f
107.874 87.108 m
107.319 87.5123 106.094 88.17 105.731 87.108 c
104.901 87.9904 107.833 88.4449 107.874 87.108 c
f
89.5044 81.2911 m
90.4126 78.8771 86.8481 79.9074 85.6782 79.9142 c
77.1958 79.9493 64.249 79.6935 54.9082 80.0665 c
55.0029 80.4816 54.7148 81.2804 55.0615 81.4445 c
65.3066 81.6876 78.8872 81.8575 89.5044 81.2911 c
f
74.8096 79.3009 m
79.5532 79.3009 l
80.9868 79.3009 82.7524 79.6681 83.5356 78.8409 c
81.3052 79.1808 77.5688 78.3282 75.2686 78.8409 c
74.9961 78.9025 74.8154 78.7628 74.8096 79.3009 c
f
130.071 77.004 m
130.692 76.7062 130.975 76.0724 131.143 75.3214 c
130.53 75.1183 129.813 75.0177 129.305 74.7081 c
129.45 73.9337 130.045 73.6124 130.223 72.8712 c
129.432 72.8986 129.006 72.5587 128.387 72.4113 c
128.301 72.9376 127.942 73.1906 127.622 73.4845 c
127.778 74.1954 128.782 74.0587 128.999 74.7081 c
127.352 75.7765 124.877 77.7355 122.418 76.545 c
122.223 77.2189 121.553 77.4171 121.499 78.2286 c
122.28 78.4171 122.788 78.881 123.336 79.3009 c
124.989 78.1466 127.157 77.5099 128.999 76.545 c
129.592 76.463 129.629 76.9357 130.071 77.004 c
f
83.9946 79.1476 m
86.2134 78.1515 88.2622 76.9884 89.3521 74.8615 c
87.4829 76.2091 85.4458 77.3849 83.9946 79.1476 c
f
89.1978 76.545 m
88.1255 76.5138 87.186 77.8868 86.2896 78.5353 c
87.4243 80.2306 90.7017 78.4747 89.1978 76.545 c
f
115.528 78.8419 m
116.133 79.1857 116.756 78.2374 116.905 77.6173 c
116.311 77.8888 116.157 78.6017 115.528 78.8419 c
f
110.784 78.6886 m
111.141 78.9855 111.739 78.2208 111.854 77.7697 c
111.25 77.8282 111.151 78.3917 110.784 78.6886 c
f
97.313 78.6886 m
96.9966 78.2384 96.8501 77.6193 96.2407 77.463 c
96.3052 78.1642 96.5747 78.6622 97.313 78.6886 c
f
103.893 78.5353 m
105.581 78.8673 106.114 76.0607 104.661 75.6271 c
102.768 75.0636 101.606 78.0822 103.893 78.5353 c
102.975 77.004 m
103.055 75.7501 105.047 75.4806 105.424 77.004 c
105.061 78.6554 102.881 78.4816 102.975 77.004 c
f
110.018 75.6271 m
108.61 75.8439 107.92 76.2911 107.874 77.1583 c
107.702 80.4415 113.313 77.379 110.018 75.6271 c
110.629 77.3107 m
110.54 78.2716 109.737 78.3517 109.252 78.2286 c
106.292 77.4806 110.909 74.2911 110.629 77.3107 c
f
99.9146 78.5353 m
100.446 78.4034 100.604 77.8986 100.987 77.6163 c
100.573 77.2638 100 78.0529 99.9146 78.5353 c
f
105.579 78.3829 m
105.875 78.7189 106.438 78.0245 106.497 77.6173 c
106.094 77.7755 105.981 78.2247 105.579 78.3829 c
f
98.0767 78.2286 m
100.62 78.9806 100.379 75.2208 98.5356 75.1671 c
96.9067 75.1212 96.2954 77.7023 98.0767 78.2286 c
98.8423 75.6271 m
99.5024 75.8185 99.9399 76.9435 99.3032 77.7697 c
96.7114 78.9318 96.7876 75.0275 98.8423 75.6271 c
f
86.2896 76.6984 m
85.9907 75.9044 85.9517 75.295 86.2896 74.5548 c
85.313 74.5099 85.0122 73.7911 83.9946 73.7892 c
83.4673 74.1847 84.0083 74.5577 83.9946 75.0148 c
83.9888 75.1964 83.6431 75.2794 83.688 75.4738 c
83.8755 76.2814 84.9185 76.6837 84.7603 77.6173 c
85.4536 77.4943 85.9907 77.215 86.2896 76.6984 c
84.606 76.0861 m
85.2173 76.0861 l
85.3521 76.5763 84.9829 76.5646 84.7603 76.6984 c
84.7114 76.4913 84.5415 76.4064 84.606 76.0861 c
f
75.1152 77.004 m
78.2993 77.1779 80.8892 76.756 83.8403 76.6984 c
83.2212 75.9083 83.4126 75.1906 83.0747 74.2482 c
81.8325 74.2306 80.5923 74.215 79.7075 74.5548 c
79.1919 74.1525 79.4849 72.9396 78.7896 72.7189 c
78.0396 72.9376 77.4907 73.3595 77.2583 74.0958 c
78.0845 74.1075 78.0688 74.1652 78.6353 74.2482 c
78.9966 74.4484 78.9321 75.0763 79.0942 75.4728 c
79.6392 75.7111 79.186 74.9542 79.5532 75.0138 c
79.8931 75.0782 79.7017 75.8536 79.4028 75.7804 c
78.7271 75.84 78.8735 75.0831 78.6353 74.7081 c
77.3501 74.6447 75.3848 73.9464 74.5029 74.8615 c
74.6904 75.5919 75.0088 76.1915 75.1152 77.004 c
f
101.598 76.6984 m
102.473 76.0431 103.227 75.2657 103.741 74.2482 c
102.793 74.8322 102.065 75.6349 101.598 76.6984 c
f
107.11 76.6984 m
108.028 76.1866 108.473 75.2052 109.252 74.5548 c
108.463 74.5861 107.62 75.879 107.11 76.6984 c
f
112.62 76.6984 m
113.458 76.2091 113.934 75.3595 114.61 74.7091 c
113.909 74.7238 113.065 75.9181 112.62 76.6984 c
f
88.2798 74.8615 m
87.6353 74.4064 86.9146 74.963 86.2896 75.0138 c
85.7407 77.0411 88.1548 76.2355 88.2798 74.8615 c
f
106.803 75.3204 m
108.932 75.5587 108.506 72.076 106.649 72.2589 c
105.231 72.3986 104.821 75.0997 106.803 75.3204 c
105.885 73.1779 m
106.389 72.6915 107.504 72.8419 107.874 73.3302 c
108.375 75.7931 104.961 75.1486 105.885 73.1779 c
f
102.975 73.9435 m
102.723 73.2775 102.446 72.6368 101.905 72.2589 c
97.3247 72.1827 101.331 77.504 102.975 73.9435 c
100.067 73.7902 m
100.002 72.5968 101.811 72 102.518 73.3302 c
102.555 75.2531 100.145 75.2404 100.067 73.7902 c
f
129.918 71.494 m
130.293 70.594 130.834 69.859 131.295 69.043 c
130.899 68.113 130.821 66.865 129.918 66.442 c
129.034 67.586 130.459 68.373 130.223 69.81 c
129.7 69.723 129.288 69.522 128.999 69.197 c
126.504 70.529 124.567 72.4181 121.04 72.7179 c
120.815 73.3615 120.245 73.6583 120.122 74.4025 c
120.614 74.6749 121.223 74.8302 121.651 75.1681 c
124.045 73.5802 126.399 71.953 129.918 71.494 c
f
75.4209 74.0958 m
76.1865 74.0958 l
76.1465 73.4728 75.8984 73.0568 75.7275 72.5646 c
75.3711 72.9064 75.2158 73.6173 75.4209 74.0958 c
f
83.3813 73.9435 m
83.6274 73.9865 83.645 73.798 83.8403 73.7902 c
83.9126 73.1671 83.2017 72.8224 82.9224 73.0236 c
83.0591 73.3458 83.1606 73.7052 83.3813 73.9435 c
f
74.6563 73.4845 m
75.7637 73.1212 75.4951 71.399 75.5742 69.656 c
75.6406 68.18 76.1035 66.675 75.7275 65.983 c
74.6084 66.685 74.6113 69.733 74.5029 71.494 c
74.4717 71.999 74.5264 72.5275 74.5029 73.0236 c
74.46 73.2716 74.6475 73.2872 74.6563 73.4845 c
f
86.7485 73.1779 m
87.8306 71.498 86.9673 68.023 86.5962 66.289 c
86.2153 66.159 85.7759 66.088 85.2173 66.135 c
85.3091 68.139 86.4399 71.014 85.9829 73.1779 c
86.3638 72.9786 86.6196 73.6271 86.7485 73.1779 c
f
87.5142 73.1779 m
87.8208 73.1779 l
89.1997 72.7872 89.6841 66.287 87.5142 66.135 c
87.4028 68.221 88.0396 70.889 87.5142 73.1779 c
f
104.354 73.0245 m
105.112 73.0656 105.889 71.805 106.344 71.034 c
105.493 71.51 105.125 72.4689 104.354 73.0245 c
f
98.6899 73.0245 m
99.6841 72.6407 100.061 71.641 100.833 71.034 c
99.9399 70.909 99.1587 72.215 98.6899 73.0245 c
f
88.8931 72.8712 m
89.2485 72.7169 89.3853 72.3439 89.3521 71.799 c
88.9224 71.88 89.0688 72.5372 88.8931 72.8712 c
f
126.704 69.044 m
126.698 68.172 127.407 68.012 127.469 67.207 c
126.881 66.929 126.202 66.74 125.631 66.442 c
123.514 67.562 121.819 69.845 118.897 69.656 c
118.975 70.451 118.34 70.529 118.436 71.341 c
119.145 71.449 119.565 71.845 120.274 71.953 c
121.737 70.609 123.463 69.529 125.477 68.738 c
126.118 68.609 126.202 69.035 126.704 69.044 c
f
82.9224 68.278 m
83.0083 66.219 80.4595 65.168 79.5552 67.055 c
79.0806 66.776 79.4731 66.586 79.4009 65.984 c
78.7954 66.039 77.9341 65.842 77.5649 66.135 c
77.6626 67.315 78.0903 68.162 78.4829 69.043 c
80.3052 69.133 81.7798 68.871 82.9224 68.278 c
f
125.327 64.453 m
125.485 62.926 126.575 62.334 127.01 61.084 c
126.196 61.291 125.809 61.924 125.02 62.155 c
124.256 62 124.215 61.123 123.795 60.625 c
123.084 61.014 123.083 62.086 123.641 62.614 c
122 64.172 120.127 66.838 117.059 65.984 c
116.797 66.588 116.5 67.158 116.295 67.818 c
117.174 67.967 118.032 68.524 118.743 68.432 c
119.596 68.322 120.032 67.422 120.733 66.901 c
122.174 65.83 123.819 64.974 125.327 64.453 c
f
76.3403 67.207 m
76.7681 67.125 76.6235 66.47 76.7993 66.136 c
76.2778 66.125 76.3462 66.703 76.3403 67.207 c
f
89.3521 65.371 m
89.3599 64.615 89.4712 62.518 89.1997 61.543 c
88.2583 63.046 87.7739 64.828 85.6782 64.452 c
83.7993 64.115 84.5396 61.827 82.6177 61.391 c
81.9673 63.339 79.7446 65.541 77.7173 63.533 c
77.1353 62.957 76.8579 61.484 76.1865 61.391 c
75.0205 61.229 75.4082 62.197 74.6563 63.229 c
74.2168 63.83 72.9951 64.671 71.7471 64.452 c
70.0371 64.151 70.1064 61.342 68.0732 61.695 c
67.2119 65.361 63.0029 65.151 61.9502 61.695 c
61.3379 61.695 l
60.5137 63.175 59.7305 65.02 57.9697 64.911 c
56.2979 64.809 56.2461 62.838 55.0605 61.85 c
54.8516 62.764 54.7744 64.621 55.0605 65.524 c
55.0371 65.701 55.0947 65.796 55.2139 65.829 c
66.376 65.654 79.104 65.46 89.3521 65.371 c
f
128.999 63.839 m
128.713 63.717 128.44 63.583 128.081 63.534 c
127.891 64.262 127.364 64.654 127.315 65.524 c
128.495 66.452 128.452 64.455 128.999 63.839 c
f
118.438 63.839 m
118.438 62.309 l
121.483 63.581 122.393 59.44 121.344 56.951 c
120.352 57.079 119.299 57.151 118.131 57.104 c
116.364 58.373 115.221 60.82 112.62 60.777 c
112.52 61.309 112.118 62.115 112.315 62.462 c
113.106 62.213 114.106 62.311 114.61 62.768 c
114.504 63.768 114.618 64.078 114.458 65.065 c
116.434 65.77 116.895 64.035 118.438 63.839 c
117.979 59.553 m
118.333 61.335 117.483 63.481 115.221 63.534 c
113.959 61.608 116.805 60.501 117.979 59.553 c
118.59 58.635 m
119.362 58.637 120.838 58.418 121.499 58.94 c
121.944 62.006 117.172 62.053 118.59 58.635 c
f
50.3154 61.084 m
65.1055 60.942 79.5806 60.881 94.0981 60.777 c
94.022 59.936 94.2661 58.772 93.9438 58.175 c
86.6411 58.303 78.5122 57.994 71.7471 58.175 c
64.5547 58.368 57.623 58.369 50.1631 58.635 c
49.8613 59.048 50.0713 59.973 50.0093 60.624 c
50.0034 60.887 50.1235 61.022 50.3154 61.084 c
f
94.8618 60.777 m
102.209 60.777 l
102.532 60.182 102.288 59.018 102.364 58.175 c
99.7114 58.055 96.9751 57.958 94.8618 58.175 c
94.7681 59.207 94.8813 59.589 94.8618 60.777 c
f
112.772 58.329 m
115.303 57.236 116.444 54.754 118.897 53.583 c
118.586 52.557 119.252 51.611 119.049 50.827 c
118.247 51.096 118.086 52.008 117.213 52.205 c
116.209 52.238 116.401 51.077 115.528 50.981 c
115.377 51.34 115.26 51.733 115.221 52.205 c
115.243 52.796 115.842 52.809 115.989 53.277 c
115.073 55.167 113.19 56.092 112.008 57.716 c
111.165 57.92 110.84 57.693 109.864 57.716 c
109.883 58.348 109.598 58.675 109.711 59.401 c
111.102 59.674 112.883 60.377 112.772 58.329 c
f
76.0332 57.104 m
76.1553 56.318 75.7109 56.1 75.7275 55.42 c
72.8184 55.42 l
72.7598 55.993 72.3652 56.807 72.665 57.258 c
73.4199 57.268 75.1094 57.379 76.0332 57.104 c
f
80.0142 57.104 m
80.1235 56.331 79.8052 55.986 79.7075 55.42 c
78.7192 55.502 77.3872 55.242 76.645 55.573 c
76.1162 57.676 78.6431 57.397 80.0142 57.104 c
f
83.9946 57.257 m
84.0649 56.369 83.6313 55.988 83.3813 55.42 c
82.8169 55.174 81.3442 55.174 80.7778 55.42 c
80.2114 57.674 82.2856 57.279 83.9946 57.257 c
f
95.7817 56.951 m
93.2622 56.051 91.2563 54.637 89.0454 53.43 c
88.2192 52.524 87.188 51.811 86.2896 50.981 c
85.4067 50.165 84.6685 49.246 83.688 48.531 c
84.9868 52.234 87.3892 54.832 90.1157 57.104 c
92.0024 57.05 94.1313 57.24 95.7817 56.951 c
f
106.497 56.645 m
109.252 56.645 l
110.338 54.568 111.221 52.287 113.844 51.746 c
114.139 51.275 114.25 50.621 114.305 49.908 c
113.422 49.922 112.536 49.942 111.854 49.756 c
110.549 51.526 109.745 54.568 106.956 54.349 c
106.993 55.304 106.524 55.752 106.497 56.645 c
f
105.424 55.727 m
106.083 54.598 105.915 52.643 106.344 51.287 c
107.069 51.174 107.397 51.459 108.028 51.44 c
108.584 50.618 109.086 49.744 109.864 49.145 c
109.653 48.133 109.399 47.048 109.711 45.929 c
108.233 45.825 107.18 45.296 106.956 43.94 c
106.403 44.661 106.639 46.173 106.344 47.154 c
105.776 47.734 104.592 47.331 103.741 47.307 c
103.245 48.494 102.573 49.507 101.905 50.522 c
102.106 51.443 102.446 52.225 102.364 53.43 c
103.985 53.594 104.979 54.387 105.424 55.727 c
102.823 51.44 m
103.825 50.574 104.004 48.173 106.19 48.99 c
105.954 50.693 106.295 52.975 105.272 53.889 c
105.084 52.443 103.754 52.143 102.823 51.44 c
106.803 45.929 m
107.584 46.218 107.629 47.245 108.793 47.154 c
108.749 48.282 108.11 48.818 107.569 49.449 c
105.571 49.676 106.864 46.974 106.803 45.929 c
f
74.3496 139.9205 m
74.8398 140.2736 74.0234 140.6027 74.1963 141.1456 c
77.7427 140.6378 85.0864 141.5109 89.811 140.5328 c
89.6157 139.8615 88.2095 140.3995 87.5142 140.2267 c
88.1294 139.2594 89.5669 137.7897 89.9634 136.0939 c
90.1704 137.0949 90.2114 139.2477 90.1157 140.6866 c
92.0493 139.6144 94.0845 137.9786 96.0884 136.4005 c
98.0532 134.8497 99.9087 133.0416 101.905 131.6534 c
100.067 132.0455 94.8403 133.4547 93.9438 131.1954 c
93.5474 130.1945 93.8501 128.6447 93.7915 127.0616 c
93.6353 122.8527 93.5884 116.0714 93.6372 112.2125 c
92.5024 112.7628 91.647 113.5905 90.5767 114.2028 c
93.4243 111.6925 96.6274 109.5387 99.6079 107.1617 c
99.8384 108.7848 99.3403 112.5348 99.7622 115.1217 c
100.59 112.4166 99.6704 108.6608 100.374 106.3956 c
100.434 106.9977 101.481 106.6144 101.446 107.3136 c
101.651 108.2867 100.293 107.6935 100.374 108.5387 c
100.266 109.1056 100.616 109.2155 101.139 109.1515 c
101.395 109.7277 100.426 109.8488 100.834 110.0695 c
102.67 110.0695 l
102.225 109.4318 102.391 109.1417 103.129 108.9987 c
103.278 107.9825 102.297 108.0958 101.905 107.6207 c
101.78 106.7819 102.739 107.0265 102.975 106.5485 c
103.11 105.7516 102.122 106.0768 101.905 105.6305 c
102.055 104.6598 103.448 104.9298 103.129 103.4874 c
98.7192 106.7306 94.2778 109.9454 90.1157 113.4376 c
90.147 114.0284 90.1235 114.5656 89.9634 114.9689 c
89.0493 114.7228 87.7622 113.5856 86.9028 114.6627 c
86.188 113.9987 85.4185 113.3907 84.7603 112.6725 c
85.5298 112.5675 86.1255 113.9576 87.0552 114.2028 c
86.6606 111.9948 85.2271 110.8268 84.2993 109.1515 c
83.0747 109.1515 l
85.313 107.5587 86.3677 112.4015 87.5142 113.7448 c
87.7544 108.3615 85.4419 101.6896 85.0649 96.1398 c
86.6528 100.1427 87.3423 105.8405 88.1274 110.9884 c
88.2974 112.1085 87.9204 114.0348 89.3521 114.3566 c
89.1958 107.2164 89.0493 99.5924 88.8931 92.9244 c
88.4028 92.2408 87.5474 91.9225 87.0552 91.2408 c
86.2251 91.8907 84.6685 91.8126 83.5337 92.1588 c
83.4575 95.6168 83.0962 99.9396 81.6978 102.5695 c
82.1548 104.6217 80.395 105.7487 79.7075 107.1617 c
80.606 108.2535 81.3833 109.4655 82.0044 110.8356 c
82.6099 110.6598 83.7876 109.1847 84.2993 110.3756 c
83.4731 110.2418 82.3325 111.0167 82.3091 111.7535 c
82.2603 113.4435 86.2915 113.9244 86.7485 115.4279 c
85.2974 114.7355 84.3013 113.5885 82.6157 113.1315 c
82.5415 115.4508 86.0649 114.1725 86.1372 116.3468 c
85.0728 116.9054 83.8091 116.3458 82.3091 116.4987 c
82.5532 112.8546 81.4087 108.5494 78.9419 107.6207 c
79.4966 109.4137 81.2349 110.0226 81.2368 112.3658 c
80.3677 110.7877 79.9771 108.7277 78.0239 108.2325 c
77.2036 108.8414 77.2935 110.3605 76.0332 110.5294 c
77.2778 111.2745 78.8423 111.7008 78.9419 113.5905 c
79.8403 113.3668 81.0513 113.4557 81.2368 112.5197 c
83.1255 119.8907 76.2603 126.0485 68.0723 123.3888 c
64.833 121.7106 62.0332 118.0968 62.7148 113.4376 c
63.0889 110.8868 64.4355 109.5148 65.624 107.6207 c
63.0908 108.7677 61.8193 112.2057 61.9492 115.7345 c
62.165 121.5084 68.4238 125.8175 74.5029 124.6134 c
78.1528 123.8898 80.9302 120.8048 82.1567 117.2648 c
89.5044 117.2648 l
89.6567 116.7594 88.522 116.6798 89.5044 116.6525 c
89.2974 115.7365 88.3364 115.5768 87.5142 115.2745 c
88.4595 114.7936 88.9634 116.0685 89.9634 116.0407 c
89.7271 118.4786 90.5493 121.0685 89.9634 123.2345 c
89.4692 125.0675 87.6724 125.8278 86.2896 126.9098 c
88.2017 127.9547 90.686 129.7189 89.9634 132.4196 c
89.0767 129.3268 86.4888 127.9347 82.9224 127.5206 c
85.9399 125.7926 89.145 124.2535 89.6567 120.0206 c
88.4341 120.0206 l
86.3931 126.9098 76.5454 125.9918 72.9727 131.3478 c
71.5332 127.8366 67.1162 127.3048 64.7061 124.7657 c
64.542 124.1647 64.6729 123.2677 64.3984 122.7765 c
63.5293 122.4279 63.1631 123.3859 62.5625 123.5407 c
59.7754 124.2638 58.2529 121.3375 56.8984 119.7145 c
57.2549 122.6368 60.751 125.4108 63.6348 123.3888 c
64.918 128.1925 72.6035 127.3566 72.5127 133.0314 c
73.1992 133.1075 73.6592 132.9547 74.1963 132.8785 c
75.1953 131.0206 76.5825 129.5504 78.7896 128.8986 c
78.147 129.8595 76.5024 131.8907 76.4927 133.4918 c
74.5762 133.6115 71.0029 133.2736 68.8389 133.6447 c
71.166 134.5968 74.0352 133.7784 76.3403 133.9508 c
76.2778 134.9816 76.4751 135.7535 76.645 136.5529 c
76.6899 136.6578 74.6826 135.5685 74.6553 136.7057 c
74.1123 136.6886 74.0996 136.1407 73.4307 136.2477 c
73.8623 136.2008 74.0889 135.5436 73.7363 135.1754 c
73.1279 135.0758 72.8018 135.2584 72.8184 135.7877 c
72.4648 134.7565 71.998 135.6827 71.2891 135.1754 c
70.5879 135.1896 70.6992 136.0148 70.2168 136.2477 c
69.4277 136.2745 68.3926 136.0558 68.2266 136.7057 c
69.2295 133.8038 67.9854 130.9718 66.543 129.2047 c
68.4434 129.9064 69.5918 131.3605 70.5225 133.0314 c
71.8994 133.0314 l
69.4834 125.6515 57.9639 127.3746 55.8262 119.7145 c
54.7559 119.7145 l
54.6104 123.9948 58.3223 125.7384 61.4902 127.2145 c
57.9414 127.9015 55.7686 129.9625 54.6025 133.0314 c
53.4453 130.0304 55.8262 128.2125 57.5107 127.0616 c
55.334 125.4674 53.6895 123.0338 54.2969 119.1017 c
54.9033 118.9825 57.2754 119.8048 57.9697 119.1017 c
57.2734 118.1735 56 118.7438 54.6025 118.4894 c
54.2598 117.3527 54.541 115.5914 54.4482 114.2028 c
53.293 113.5739 52.5186 112.5616 51.2344 112.0607 c
50.8115 115.6266 51.2598 120.5074 51.082 124.9186 c
50.9746 127.5675 51.2979 131.4918 49.8564 132.5724 c
47.1987 134.5685 43.1724 132.8624 40.6714 131.5016 c
44.7437 134.8795 49.0635 138.0109 53.3779 141.1456 c
57.7334 140.9718 63.2598 141.6368 67.9199 141.1456 c
68.0029 140.0436 66.6006 140.4235 65.7773 140.2267 c
66.1699 139.3927 67.6084 138.2838 68.0723 137.0128 c
67.8418 138.2804 69.6396 138.5255 70.2168 139.4616 c
71.7129 139.2926 72.5049 138.4366 73.8906 139.3087 c
71.2783 139.3575 69.959 140.1066 68.0723 140.2267 c
67.9629 140.6945 68.2295 140.7848 68.2266 141.1456 c
69.415 141.4078 69.5781 140.5665 70.0635 140.5328 c
70.373 140.1847 70.5723 141.2408 71.1348 141.1456 c
72.1846 140.0997 74.2783 141.9445 74.3496 139.9205 c
54.6025 135.1754 m
54.8594 137.7238 56.5469 138.8439 57.8174 140.3805 c
54.4482 140.3805 l
54.291 138.9567 54.0293 136.3517 54.6025 135.1754 c
74.8096 139.3087 m
75.3262 138.3986 76.9028 138.5446 76.7993 137.0128 c
77.2251 138.5245 78.3794 139.3107 79.2485 140.3805 c
77.1216 140.4298 75.9063 140.3878 74.8096 139.3087 c
79.8599 135.7877 m
81.186 136.1368 82.6646 135.2814 83.688 135.4816 c
86.8325 136.0949 85.8442 140.2628 83.0747 140.3805 c
80.0845 140.5065 77.0337 137.0226 77.5649 133.9508 c
78.645 134.7687 78.6509 135.4689 79.8599 135.7877 c
61.3389 139.9205 m
60.3643 139.6617 59.583 138.3815 59.6543 137.4718 c
59.8564 134.8678 62.7725 136.1407 64.8584 135.1754 c
66.4395 134.4425 66.0264 133.3136 66.8486 131.8068 c
68.5332 135.3966 65.5771 141.0485 61.3389 139.9205 c
55.5205 134.2565 m
55.541 132.3395 57.5186 129.4938 59.502 131.1954 c
62.2021 133.5138 56.5762 136.9738 59.1943 139.7677 c
57.6709 139.1056 55.4912 137.0148 55.5205 134.2565 c
83.688 132.8785 m
83.6177 131.0187 84.8208 129.2526 86.7485 129.8165 c
90.2856 130.8527 89.6021 138.8815 86.1372 139.1554 c
87.9614 136.5065 85.063 134.2609 83.688 132.8785 c
83.5337 130.1237 m
82.356 131.5939 83.1216 134.4034 81.2368 134.8688 c
79.4146 135.3195 78.1392 134.1818 78.0239 132.7257 c
77.811 130.0485 81.3481 128.1217 84.9106 128.8986 c
84.3462 129.6075 84.0552 129.4738 83.5337 130.1237 c
64.5527 134.2565 m
60.4482 134.5846 61.5596 129.6974 57.8174 129.6647 c
60.9766 126.4318 68.9365 130.1808 64.5527 134.2565 c
85.0649 102.5695 m
85.1216 104.8107 85.6118 107.4288 85.9829 108.8449 c
85.0181 107.5958 84.1626 104.6725 85.0649 102.5695 c
84.2993 95.9865 m
83.3892 100.0245 84.6938 106.2794 81.6978 108.2325 c
83.8228 105.4088 83.0278 99.6627 84.2993 95.9865 c
85.2192 95.5265 m
86.4302 94.9518 85.8462 92.5817 86.9028 91.8536 c
87.2114 92.5607 85.9595 93.7374 86.4419 94.6085 c
87.3872 94.3785 87.5396 93.3575 88.1274 92.7716 c
88.7974 94.0836 86.3267 96.0304 85.2192 95.5265 c
f
93.4849 61.695 m
92.7446 61.246 90.9087 61.304 89.9634 61.543 c
89.9751 78.9406 90.0278 94.7867 90.27 112.2125 c
94.1235 109.7897 97.4985 106.8888 101.292 104.4064 c
101.897 103.2765 102.79 102.4337 103.127 101.0377 c
103.774 104.9728 103.159 111.1915 103.436 114.8156 c
104.145 110.9327 103.54 105.7365 103.741 101.3449 c
105.079 101.9386 104.204 104.0875 105.272 104.7116 c
105.915 104.7677 105.381 104.2135 105.426 103.9464 c
106.157 104.0826 106.272 104.8346 106.344 105.6305 c
106.061 106.3468 104.899 105.2814 104.813 106.2428 c
104.737 107.1359 106.364 106.3248 106.344 107.1617 c
106.559 107.9894 105.827 107.8698 105.577 108.2325 c
105.885 109.2535 106.834 110.9166 106.038 112.0607 c
105.293 111.8336 104.282 111.8258 104.2 112.6725 c
104.262 113.3766 105.143 113.2594 105.885 113.2848 c
105.991 113.6954 105.569 113.5807 105.426 113.7448 c
106.059 114.2609 107.059 113.9166 107.721 113.8976 c
107.868 113.3424 107.061 113.7418 106.956 113.4376 c
107.075 112.7408 108.663 113.5118 108.793 112.8258 c
108.776 111.9757 107.952 111.9327 107.11 111.9078 c
106.989 111.5675 106.788 111.3107 106.803 110.8356 c
107.559 109.8497 106.985 109.2384 107.721 108.2325 c
107.489 107.9557 106.672 108.2628 106.803 107.6207 c
106.659 106.2325 108.249 107.3668 108.18 106.2428 c
108.274 105.6388 107.34 106.0626 106.956 105.9366 c
106.938 104.8986 107.364 104.3048 107.721 103.6407 c
108.11 103.9366 106.997 104.5856 107.721 104.8644 c
108.854 104.0636 108.461 102.2438 109.1 100.7316 c
109.583 105.7365 109.075 110.8156 109.405 114.9684 c
110.393 110.8536 109.303 106.1847 109.864 100.7316 c
110.196 102.0446 111.01 103.6198 111.088 105.6305 c
110.932 105.9835 110.065 105.6266 110.17 106.2428 c
110.192 107.0387 111.602 106.4435 111.395 107.4674 c
111.381 108.1188 110.42 107.8195 110.17 108.2325 c
110.098 109.4684 111.409 109.0768 110.477 110.0695 c
111.092 110.2208 111.583 110.4957 111.395 111.4474 c
111.362 112.1276 110.43 111.9127 110.17 112.3658 c
110.286 113.2628 111.137 113.1808 110.323 113.8976 c
111.26 113.8014 112.002 114.2848 112.774 113.8976 c
111.614 113.3326 112.917 113.2067 112.774 112.0607 c
112.59 111.8834 112.233 111.8868 111.854 111.9078 c
111.735 111.3698 111.696 110.0255 112.62 110.0695 c
111.803 109.4015 112.952 109.2887 112.926 108.5387 c
112.686 108.0138 111.877 108.0568 111.702 107.4674 c
111.682 106.6305 112.811 106.9435 113.079 106.3956 c
112.991 105.8737 112.579 105.6725 111.854 105.7838 c
111.827 103.9684 112.229 102.5866 113.079 101.6505 c
113.42 106.0548 113.196 111.6705 113.079 115.2745 c
108.278 115.2965 103.024 115.2418 98.6899 115.2745 c
98.6899 116.1935 l
103.643 116.3488 110.065 116.6495 114.764 116.0407 c
114.909 115.1818 113.963 115.4108 113.538 115.1217 c
114.043 110.2116 113.756 104.4244 113.844 99.5074 c
112.424 99.9747 112.284 101.7238 111.854 103.1808 c
110.112 102.7804 110.694 100.0568 109.252 99.3546 c
109.749 98.0035 111.618 97.2448 111.702 95.9865 c
109.266 97.3766 108.53 100.4684 106.497 102.2628 c
104.641 100.5968 104.157 97.5616 102.057 96.1398 c
103.499 98.5255 104.838 101.0118 106.497 103.1808 c
107.586 102.5885 107.651 100.9674 108.639 100.2736 c
108.235 101.7037 107.483 102.7907 106.803 103.9464 c
105.293 102.9034 104.78 100.8678 103.588 99.5074 c
102.76 100.4655 102.417 101.9078 101.598 102.8746 c
100.831 101.9596 100.829 100.2765 99.9146 99.5074 c
99.2114 101.0446 99.9419 102.3468 99.6079 104.2526 c
100.18 103.6007 99.8521 102.0485 100.067 101.0377 c
100.815 101.6686 100.917 102.9445 101.446 103.7936 c
100.024 104.6466 94.9458 106.0866 93.9438 103.9464 c
93.3228 102.6207 93.563 99.3278 93.4849 97.6705 c
93.1743 91.0055 93.6079 85.7574 93.6392 80.5245 c
93.6724 74.4738 93.3032 67.386 93.4849 61.695 c
f
60.2656 100.1193 m
61.292 99.6212 60.8945 97.0324 61.0322 96.1393 c
64.8867 98.3932 67.3477 93.7443 71.5938 94.1505 c
72.126 94.2003 72.665 94.7213 73.2783 94.4552 c
72.6064 93.8004 71.5283 93.5514 70.2168 93.5372 c
70.5195 92.5543 72.4307 93.2965 73.2783 93.2316 c
71.9541 91.7975 69.4844 92.1744 68.0732 93.2316 c
68.4316 92.5372 69.7676 91.2423 70.9814 91.2404 c
74.7188 91.2374 77.9556 99.5743 82.6157 95.2213 c
84.6665 90.9435 78.8403 85.5172 81.2388 82.5157 c
81.0767 82.1681 80.2759 82.4572 79.8618 82.3615 c
79.3481 83.1271 79.1567 84.2091 78.9419 85.2716 c
78.4321 84.4689 79.1372 82.8595 78.7896 82.2091 c
78.0239 82.2091 l
77.7017 82.8068 77.9478 83.9689 77.8716 84.8126 c
77.0493 84.5099 77.6821 82.754 76.9517 82.3615 c
76.3579 85.1163 79.0845 87.8483 79.5552 90.7814 c
78.1782 88.0743 76.4458 85.7277 75.7275 82.3615 c
75.083 82.213 74.4043 82.4415 73.4307 82.3615 c
75.1641 85.5275 77.1255 88.4655 78.4829 92.0065 c
76.5708 88.7135 74.7451 85.3356 72.5127 82.3615 c
71.3711 82.1095 70.6689 82.2853 69.6035 82.3615 c
68.1064 85.5592 66.4795 88.6276 64.7051 91.5465 c
65.4805 88.6984 67.748 86.0162 68.2256 82.3615 c
66.9473 82.1036 67.2852 83.4611 67.002 84.1984 c
66.6533 83.5704 67.043 83.1466 66.8486 82.3615 c
66.4199 82.1866 66.0537 82.1866 65.624 82.3615 c
65.6016 83.3966 66.3145 84.4747 65.624 85.2716 c
65.3682 84.1486 65.2881 82.8517 64.5518 82.2091 c
62.8682 82.2091 l
63.2373 83.4884 64.7227 84.4181 64.0928 86.1896 c
63.6777 86.2985 64.2031 85.4674 63.7871 85.5763 c
62.9648 85.7892 63.1592 86.6315 62.8682 87.4132 c
61.9551 89.8805 59.4756 93.2086 61.0322 95.9865 c
60.2021 96.7032 59.9863 98.7985 60.2656 100.1193 c
71.4404 86.1896 m
70.7754 86.3395 70.5508 86.9313 69.9102 87.1085 c
72.0146 82.213 76.2817 91.5407 76.645 92.9254 c
75.042 90.5485 73.8486 87.7623 71.4404 86.1896 c
71.5938 87.8746 m
72.791 88.0724 73.7393 90.1422 74.1973 90.9342 c
73.1074 90.2384 72.4121 89.1476 71.2881 88.4855 c
69.2959 89.4523 68.0566 91.1744 66.3887 92.4655 c
67.6289 91.1105 69.3721 87.5035 71.5938 87.8746 c
71.1348 83.4337 m
72.2422 83.8575 72.875 84.756 73.2783 85.8834 c
72.4541 85.5333 72.1484 84.6661 71.2881 84.3527 c
68.9775 86.2775 67.8066 89.3414 65.7783 91.5465 c
67.4404 88.7213 68.6416 85.4303 71.1348 83.4337 c
79.8618 84.6583 m
80.3071 84.6056 80.3774 86.2643 80.0142 86.0353 c
80.0962 85.4445 79.7407 85.2892 79.8618 84.6583 c
f
126.397 80.5245 m
125.706 80.465 126.567 79.8029 126.092 79.6075 c
125.542 79.5177 125.625 80.0597 125.631 80.5245 c
127.209 81.6798 128.418 80.0294 129.305 79.1476 c
129.956 79.5187 130.961 79.5314 131.143 80.3712 c
129.065 80.6935 125.549 82.8927 123.948 80.8322 c
123.395 81.0939 123.112 81.629 122.723 82.0568 c
123.012 82.9406 124.094 83.0314 124.559 83.7404 c
126.569 83.2501 128.125 82.3048 130.682 82.3615 c
131.053 81.1495 131.815 80.3302 132.674 79.6075 c
131.834 78.7599 130.61 78.3009 129.305 77.922 c
128.901 79.3556 128.272 80.5636 126.397 80.5245 c
f
83.688 47.153 m
91.0024 49.635 97.8716 52.563 103.434 56.797 c
108.426 61.605 113.491 66.334 116.6 73.0245 c
114.118 70.148 110.444 67.418 105.885 67.514 c
93.6685 67.767 92.6079 84.1046 94.7095 96.5988 c
100.002 96.1388 105.34 95.2618 110.477 95.5265 c
111.008 95.5548 111.493 95.9537 112.008 95.9865 c
113.245 96.0626 114.688 95.7228 115.987 95.8326 c
118.118 96.0148 120.215 96.5885 122.264 96.9044 c
122.715 102.1027 121.217 107.2008 119.815 111.6007 c
115.512 125.1036 106.842 134.9537 95.1685 140.9918 c
95.0435 141.0216 95.0161 141.1456 94.8618 141.1456 c
94.9302 141.2814 94.9966 141.4196 95.1685 141.4518 c
95.2993 141.4796 95.313 141.3917 95.3208 141.2985 c
104.292 136.9528 111.129 130.2076 116.141 121.5514 c
121.184 112.8395 124.168 101.9064 122.417 89.0978 c
120.889 77.9308 115.747 68.611 109.25 61.695 c
102.606 54.621 94.2505 49.145 83.688 47.153 c
112.008 70.269 m
113.68 70.265 113.374 72.9327 114.917 72.5656 c
115.209 72.9406 115.538 73.3732 115.223 73.9425 c
116.219 73.6075 116.334 75.2072 116.752 75.9327 c
114.868 74.3488 113.456 72.2911 112.008 70.269 c
117.979 79.7599 m
111.022 79.0704 102.747 78.922 95.4751 79.4532 c
95.022 78.2726 95.8091 76.9855 96.2407 75.9327 c
96.6782 74.8654 97.022 73.3175 98.0767 73.3302 c
98.645 73.9738 96.811 74.1486 97.313 74.7091 c
97.8677 74.6017 97.9517 74.0216 98.5356 73.9425 c
99.9458 75.4415 100.891 77.4064 102.67 78.5353 c
101.292 76.4943 99.6313 74.7365 98.0767 72.8712 c
98.52 71.578 99.5513 70.875 100.68 70.269 c
103.36 72.8439 105.309 76.1505 108.028 78.6886 c
106 75.5109 103.299 73.0079 101.139 69.963 c
101.975 70.101 102.004 69.151 102.975 69.043 c
103.063 69.472 102.323 69.793 102.364 70.422 c
102.577 73.6534 107.817 70.229 104.2 68.737 c
105.469 68.478 106.18 69.953 106.803 70.729 c
109.084 73.5724 111.163 76.6798 113.692 78.9943 c
112.563 77.0099 110.774 75.6866 109.711 73.6368 c
110.518 72.8605 111.553 72.3136 112.008 71.188 c
114.274 74.045 117.338 75.547 117.979 79.7599 c
121.038 95.5265 m
121.022 95.7135 120.995 95.8898 120.733 95.8326 c
112.977 94.2716 103.278 94.4215 95.4751 95.5265 c
94.645 94.0109 95.0063 91.3029 94.7095 89.2506 c
96.4126 90.7638 97.8013 93.4034 99.4556 94.4557 c
98.7837 93.4366 98.0376 92.4674 97.1587 91.3947 c
96.188 90.2076 94.6196 89.1588 94.7095 87.4137 c
98.2817 86.7794 102.655 86.4874 106.803 86.4957 c
109.442 86.5006 112.043 86.6627 114.458 86.9557 c
114.112 87.9884 112.604 88.6715 112.62 89.5577 c
113.348 88.9586 113.756 88.0397 114.61 87.5665 c
114.778 87.8185 115.44 88.3556 115.069 88.6388 c
111.424 88.0109 114.35 93.6168 116.141 90.4757 c
116.471 91.3824 115.084 91.5807 115.069 92.6188 c
115.776 92.3556 115.778 91.3878 116.6 91.2408 c
116.575 91.6735 117.059 91.5978 117.059 92.0065 c
114.198 92.0958 117.2 96.2897 118.743 93.6906 c
118.997 94.4117 117.924 94.5949 118.284 94.9147 c
118.766 94.9366 118.811 94.5226 118.897 94.1495 c
119.735 94.4845 120.151 95.2408 121.038 95.5265 c
122.264 95.5265 m
117.172 93.3224 111.641 83.2365 119.663 80.0665 c
121.01 84.6368 122.467 89.9157 122.264 95.5265 c
117.366 92.1588 m
117.489 92.8029 118.186 92.8707 118.284 93.5367 c
117.016 95.6818 114.586 92.3678 117.366 92.1588 c
115.528 89.0978 m
115.688 89.5006 115.711 90.0367 115.682 90.6285 c
113.303 92.6124 112.565 87.5128 115.528 89.0978 c
94.8618 86.3414 m
94.6685 86.2794 94.5493 86.1447 94.5571 85.8824 c
94.4575 83.59 94.7427 81.6808 95.1685 79.9122 c
102.178 79.4181 110.428 79.3956 117.366 80.2199 c
116.604 81.754 114.35 83.1232 114.61 86.1896 c
108.245 85.9645 101.03 86.0265 94.8618 86.3414 c
109.405 73.4835 m
108.133 71.849 106.657 70.414 105.577 68.584 c
106.329 68.696 107.006 68.822 107.721 68.584 c
108.202 69.142 106.723 69.672 107.11 70.115 c
107.678 69.818 108.032 69.304 108.333 68.737 c
109.067 68.668 109.551 68.849 109.864 69.196 c
107.364 68.885 107.45 71.764 108.946 72.106 c
110.729 72.5128 111.436 70.283 110.323 69.196 c
111.241 69.453 111.706 70.162 112.008 71.033 c
111.034 71.744 110.561 72.9552 109.405 73.4835 c
108.18 70.422 m
108.559 69.496 109.778 69.32 110.477 70.115 c
110.588 70.891 110.309 71.274 110.018 71.647 c
108.836 71.807 108.385 71.239 108.18 70.422 c
102.67 70.269 m
102.731 69.393 104.12 68.885 104.965 69.656 c
105.817 71.926 102.553 71.933 102.67 70.269 c
f
115.989 78.0763 m
116.12 77.4806 116.258 76.6505 115.989 76.0861 c
112.842 73.8107 112.721 80.3927 115.989 78.0763 c
114.917 78.2286 m
114.286 78.3048 114.614 77.9083 113.844 77.923 c
112.799 73.4972 117.948 77.8615 114.917 78.2286 c
f
112.772 75.1671 m
114.086 74.5363 113.842 72.5509 112.467 72.4113 c
110.336 72.1954 110.415 76.3009 112.772 75.1671 c
111.088 73.6368 m
111.727 71.231 114.659 74.5138 112.772 75.1671 c
111.797 75.505 110.838 74.5851 111.088 73.6368 c
f
88.5864 73.6368 m
87.3364 73.9376 85.5513 73.8068 84.7603 73.1779 c
84.8677 73.0324 85.4771 73.2765 85.6782 72.8712 c
85.6099 70.235 85.0981 68.041 84.2993 66.135 c
83.7935 65.885 83.1313 65.982 82.77 66.289 c
83.5884 68.021 84.3091 69.851 84.4536 72.2599 c
83.854 72.4689 84.0981 71.344 83.9946 70.729 c
82.4517 68.42 79.5806 70.236 78.7896 72.106 c
79.0415 72.7355 79.5806 73.4982 80.3208 73.1779 c
80.7056 72.7482 79.8755 72.6036 79.8618 72.106 c
80.2036 72.4552 81.6294 72.3361 82.0044 71.493 c
84.0845 72.3712 84.7446 74.67 87.9731 74.4025 c
88.0767 74.047 88.7778 74.2872 88.5864 73.6368 c
f
86.1372 54.808 m
86.0356 55.42 85.1528 55.252 84.4517 55.268 c
84.356 57.694 86.3853 57.086 88.5864 57.105 c
87.7563 55.74 86.3638 54.938 85.6782 53.431 c
85.3755 53.744 86.0845 54.345 86.1372 54.808 c
f
69.7568 152.0143 m
70.5781 151.754 69.9912 152.903 70.3691 153.0861 c
71.3594 153.3502 74.1719 154.2682 74.3496 152.6261 c
74.9072 152.4772 74.4209 153.3722 75.1152 153.0861 c
75.3486 152.1881 74.5889 152.2843 74.3496 151.861 c
74.5254 150.3082 73.9658 149.4894 73.4307 148.6461 c
70.8525 148.4152 70.582 150.4913 69.7568 152.0143 c
70.9824 152.4742 m
70.7617 151.9962 72.1201 151.9962 71.9004 152.4742 c
71.8359 152.8141 71.0879 152.5929 70.9824 152.4742 c
72.5127 150.3302 m
73.5029 150.3991 73.46 151.5861 72.9717 152.0143 c
73.21 152.236 73.6855 152.2179 73.8906 152.4742 c
73.71 152.6491 73.3486 152.6471 72.9717 152.6261 c
72.5889 152.0909 73.1406 150.6202 72.5127 150.3302 c
73.125 149.8712 m
72.6396 149.6603 72.6133 149.838 72.0537 149.8712 c
71.8574 149.3883 73.3223 149.3883 73.125 149.8712 c
f
80.7778 152.6261 m
81.2856 156.0001 86.9829 155.6925 86.7485 152.3204 c
86.0083 153.5446 82.688 153.4874 81.3911 152.7794 c
82.313 152.6681 83.7993 153.0743 84.9126 152.7794 c
85.5044 152.6232 85.6646 152.0094 86.1372 152.1671 c
85.3638 150.5592 85.0103 147.8834 83.0747 148.1871 c
81.3286 148.4625 81.8208 151.2814 80.7778 152.6261 c
83.229 151.7072 m
83.8716 151.9025 84.5083 151.3082 84.606 151.8615 c
84.1938 152.2394 83.6079 152.1012 83.229 151.7072 c
82.6177 151.8615 m
82.2251 151.9425 82.0806 152.0646 81.8501 151.7072 c
82.5903 151.6735 81.8071 151.2233 81.6978 151.0953 c
82.1802 151.0675 82.2153 150.5924 82.1567 150.0245 c
f
68.6855 114.816 m
70.8135 116.0851 73.7598 115.7291 75.8809 114.6627 c
75.9512 111.7867 74.6973 107.0641 71.7471 107.6198 c
69.4199 108.0597 68.2773 111.3878 68.6855 114.816 c
69.6035 113.8971 m
70.0889 114.11 70.957 114.11 71.4404 113.8971 c
71.6299 114.3917 70.9453 114.0138 71.1348 114.5099 c
70.3184 114.611 69.7949 114.42 69.6035 113.8971 c
73.125 113.4381 m
73.4355 114.108 74.5313 113.6808 74.9619 113.8971 c
74.7041 114.736 72.5225 114.2877 73.125 113.4381 c
69.7568 112.8258 m
70.2813 112.9401 69.9512 112.2028 70.5225 112.3658 c
70.9121 112.3849 71.1172 112.589 71.1348 112.9791 c
70.4912 112.7828 69.8545 113.3781 69.7568 112.8258 c
73.4307 112.673 m
73.7021 112.5348 73.8779 112.3029 74.1973 112.213 c
74.2451 112.5729 74.6709 112.5558 74.8086 112.8258 c
74.4922 113.0988 73.7617 112.8551 73.4307 112.673 c
71.8994 110.3761 m
72.9717 110.3761 l
72.8809 110.693 73.1621 111.382 72.8184 111.4479 c
73.0039 110.5997 72.0654 110.8732 71.8994 110.3761 c
73.2773 109.3048 m
73.2275 109.8717 71.582 109.6417 71.2881 109.4572 c
71.6758 109.2072 72.7119 109.691 73.2773 109.3048 c
f
89.5044 88.0265 m
89.7485 85.1056 89.4673 81.2052 85.6782 82.3615 c
84.5708 83.4493 84.7134 85.7867 84.7603 88.0265 c
86.0161 88.6378 87.6021 88.1046 89.5044 88.0265 c
85.8306 85.8834 m
85.6372 85.6696 85.0806 85.8165 85.0649 85.4235 c
86.2622 85.7247 85.7153 82.92 86.7485 84.045 c
85.5884 84.1925 86.4341 85.4054 86.1372 86.3414 c
85.9399 86.5538 85.4731 86.4938 85.0649 86.4957 c
84.9165 85.8868 85.9204 86.4327 85.8306 85.8834 c
87.0552 85.8834 m
87.436 86.0118 87.8755 86.0836 88.4341 86.0358 c
88.3247 86.6896 87.0142 86.6046 87.0552 85.8834 c
87.2075 85.4235 m
87.2017 85.213 87.2817 85.088 87.3618 84.965 c
87.8599 84.924 88.0981 85.1466 88.1274 85.5768 c
87.7485 85.5968 87.3892 85.6007 87.2075 85.4235 c
86.1372 83.1271 m
86.7466 83.2111 86.5981 83.2111 87.2075 83.1271 c
87.4048 83.6115 85.9399 83.6115 86.1372 83.1271 c
f
grestore
grestore
grestore
grestore
end
restore
showpage
%%EOF
