%!PS-Adobe-3.0 EPSF-3.0
%%Title: singlet-triplet10.eps
%%Creator: matplotlib version 1.3.1, http://matplotlib.org/
%%CreationDate: Mon Mar 13 14:30:47 2017
%%Orientation: portrait
%%BoundingBox: 18 180 594 612
%%EndComments
%%BeginProlog
/mpldict 10 dict def
mpldict begin
/m { moveto } bind def
/l { lineto } bind def
/r { rlineto } bind def
/c { curveto } bind def
/cl { closepath } bind def
/box {
m
1 index 0 r
0 exch r
neg 0 r
cl
} bind def
/clipbox {
box
clip
newpath
} bind def
%!PS-Adobe-3.0 Resource-Font
%%Title: DejaVu Sans
%%Copyright: Copyright (c) 2003 by Bitstream, Inc. All Rights Reserved. Copyright (c) 2006 by Tavmjong Bah. All Rights Reserved. DejaVu changes are in public domain 
%%Creator: Converted from TrueType to type 3 by PPR
25 dict begin
/_d{bind def}bind def
/_m{moveto}_d
/_l{lineto}_d
/_cl{closepath eofill}_d
/_c{curveto}_d
/_sc{7 -1 roll{setcachedevice}{pop pop pop pop pop pop}ifelse}_d
/_e{exec}_d
/FontName /DejaVuSans def
/PaintType 0 def
/FontMatrix[.001 0 0 .001 0 0]def
/FontBBox[-1021 -415 1681 1167]def
/FontType 3 def
/Encoding [ /space /percent /parenleft /parenright /zero /one /two /four /five /six /seven /eight /nine /A /C /I /P /T /c /e /f /g /i /l /n /o /p /q /r /s /t /u /y ] def
/FontInfo 10 dict dup begin
/FamilyName (DejaVu Sans) def
/FullName (DejaVu Sans) def
/Notice (Copyright (c) 2003 by Bitstream, Inc. All Rights Reserved. Copyright (c) 2006 by Tavmjong Bah. All Rights Reserved. DejaVu changes are in public domain ) def
/Weight (Book) def
/Version (Version 2.34) def
/ItalicAngle 0.0 def
/isFixedPitch false def
/UnderlinePosition -130 def
/UnderlineThickness 90 def
end readonly def
/CharStrings 33 dict dup begin
/space{318 0 0 0 0 0 _sc
}_d
/percent{{950 0 55 -13 895 742 _sc
727 321 _m
699 321 676 309 660 285 _c
644 261 636 227 636 184 _c
636 142 644 108 660 84 _c
676 60 699 48 727 48 _c
755 48 777 60 793 84 _c
809 108 817 142 817 184 _c
817 226 809 260 793 284 _c
777 308 755 321 727 321 _c
727 383 _m
778 383 819 365 849 329 _c
879 293 895 244 895 184 _c
895 123 879 75 849 40 _c
819 4 778 -13 727 -13 _c
}_e{675 -13 633 4 603 40 _c
573 75 558 123 558 184 _c
558 245 573 293 603 329 _c
633 365 675 383 727 383 _c
223 680 _m
195 680 173 667 157 643 _c
141 619 133 586 133 544 _c
133 500 141 467 157 443 _c
173 419 195 407 223 407 _c
251 407 274 419 290 443 _c
306 467 314 500 314 544 _c
314 586 305 619 289 643 _c
273 667 251 680 223 680 _c
664 742 _m
742 742 _l
286 -13 _l
}_e{208 -13 _l
664 742 _l
223 742 _m
274 742 315 724 346 688 _c
376 652 392 604 392 544 _c
392 482 376 434 346 398 _c
316 362 275 345 223 345 _c
171 345 130 362 100 398 _c
70 434 55 482 55 544 _c
55 604 70 652 100 688 _c
130 724 171 742 223 742 _c
_cl}_e}_d
/parenleft{390 0 86 -131 310 759 _sc
310 759 _m
266 683 234 609 213 536 _c
191 463 181 389 181 314 _c
181 238 191 164 213 91 _c
234 17 266 -56 310 -131 _c
232 -131 _l
183 -54 146 20 122 94 _c
98 168 86 241 86 314 _c
86 386 98 459 122 533 _c
146 607 182 682 232 759 _c
310 759 _l
_cl}_d
/parenright{390 0 80 -131 304 759 _sc
80 759 _m
158 759 _l
206 682 243 607 267 533 _c
291 459 304 386 304 314 _c
304 241 291 168 267 94 _c
243 20 206 -54 158 -131 _c
80 -131 _l
123 -56 155 17 177 91 _c
198 164 209 238 209 314 _c
209 389 198 463 177 536 _c
155 609 123 683 80 759 _c
_cl}_d
/zero{636 0 66 -13 570 742 _sc
318 664 _m
267 664 229 639 203 589 _c
177 539 165 464 165 364 _c
165 264 177 189 203 139 _c
229 89 267 64 318 64 _c
369 64 407 89 433 139 _c
458 189 471 264 471 364 _c
471 464 458 539 433 589 _c
407 639 369 664 318 664 _c
318 742 _m
399 742 461 709 505 645 _c
548 580 570 486 570 364 _c
570 241 548 147 505 83 _c
461 19 399 -13 318 -13 _c
236 -13 173 19 130 83 _c
87 147 66 241 66 364 _c
66 486 87 580 130 645 _c
173 709 236 742 318 742 _c
_cl}_d
/one{636 0 110 0 544 729 _sc
124 83 _m
285 83 _l
285 639 _l
110 604 _l
110 694 _l
284 729 _l
383 729 _l
383 83 _l
544 83 _l
544 0 _l
124 0 _l
124 83 _l
_cl}_d
/two{{636 0 73 0 536 742 _sc
192 83 _m
536 83 _l
536 0 _l
73 0 _l
73 83 _l
110 121 161 173 226 239 _c
290 304 331 346 348 365 _c
380 400 402 430 414 455 _c
426 479 433 504 433 528 _c
433 566 419 598 392 622 _c
365 646 330 659 286 659 _c
255 659 222 653 188 643 _c
154 632 117 616 78 594 _c
78 694 _l
118 710 155 722 189 730 _c
223 738 255 742 284 742 _c
}_e{359 742 419 723 464 685 _c
509 647 532 597 532 534 _c
532 504 526 475 515 449 _c
504 422 484 390 454 354 _c
446 344 420 317 376 272 _c
332 227 271 164 192 83 _c
_cl}_e}_d
/four{636 0 49 0 580 729 _sc
378 643 _m
129 254 _l
378 254 _l
378 643 _l
352 729 _m
476 729 _l
476 254 _l
580 254 _l
580 172 _l
476 172 _l
476 0 _l
378 0 _l
378 172 _l
49 172 _l
49 267 _l
352 729 _l
_cl}_d
/five{{636 0 77 -13 549 729 _sc
108 729 _m
495 729 _l
495 646 _l
198 646 _l
198 467 _l
212 472 227 476 241 478 _c
255 480 270 482 284 482 _c
365 482 429 459 477 415 _c
525 370 549 310 549 234 _c
549 155 524 94 475 51 _c
426 8 357 -13 269 -13 _c
238 -13 207 -10 175 -6 _c
143 -1 111 6 77 17 _c
77 116 _l
106 100 136 88 168 80 _c
199 72 232 69 267 69 _c
}_e{323 69 368 83 401 113 _c
433 143 450 183 450 234 _c
450 284 433 324 401 354 _c
368 384 323 399 267 399 _c
241 399 214 396 188 390 _c
162 384 135 375 108 363 _c
108 729 _l
_cl}_e}_d
/six{{636 0 70 -13 573 742 _sc
330 404 _m
286 404 251 388 225 358 _c
199 328 186 286 186 234 _c
186 181 199 139 225 109 _c
251 79 286 64 330 64 _c
374 64 409 79 435 109 _c
461 139 474 181 474 234 _c
474 286 461 328 435 358 _c
409 388 374 404 330 404 _c
526 713 _m
526 623 _l
501 635 476 644 451 650 _c
425 656 400 659 376 659 _c
310 659 260 637 226 593 _c
}_e{192 549 172 482 168 394 _c
187 422 211 444 240 459 _c
269 474 301 482 336 482 _c
409 482 467 459 509 415 _c
551 371 573 310 573 234 _c
573 159 550 99 506 54 _c
462 9 403 -13 330 -13 _c
246 -13 181 19 137 83 _c
92 147 70 241 70 364 _c
70 479 97 571 152 639 _c
206 707 280 742 372 742 _c
396 742 421 739 447 735 _c
472 730 498 723 526 713 _c
_cl}_e}_d
/seven{636 0 82 0 551 729 _sc
82 729 _m
551 729 _l
551 687 _l
286 0 _l
183 0 _l
432 646 _l
82 646 _l
82 729 _l
_cl}_d
/eight{{636 0 68 -13 568 742 _sc
318 346 _m
271 346 234 333 207 308 _c
180 283 167 249 167 205 _c
167 161 180 126 207 101 _c
234 76 271 64 318 64 _c
364 64 401 76 428 102 _c
455 127 469 161 469 205 _c
469 249 455 283 429 308 _c
402 333 365 346 318 346 _c
219 388 _m
177 398 144 418 120 447 _c
96 476 85 511 85 553 _c
85 611 105 657 147 691 _c
188 725 245 742 318 742 _c
}_e{390 742 447 725 489 691 _c
530 657 551 611 551 553 _c
551 511 539 476 515 447 _c
491 418 459 398 417 388 _c
464 377 501 355 528 323 _c
554 291 568 251 568 205 _c
568 134 546 80 503 43 _c
459 5 398 -13 318 -13 _c
237 -13 175 5 132 43 _c
89 80 68 134 68 205 _c
68 251 81 291 108 323 _c
134 355 171 377 219 388 _c
183 544 _m
183 506 194 476 218 455 _c
}_e{242 434 275 424 318 424 _c
360 424 393 434 417 455 _c
441 476 453 506 453 544 _c
453 582 441 611 417 632 _c
393 653 360 664 318 664 _c
275 664 242 653 218 632 _c
194 611 183 582 183 544 _c
_cl}_e}_d
/nine{{636 0 63 -13 566 742 _sc
110 15 _m
110 105 _l
134 93 159 84 185 78 _c
210 72 235 69 260 69 _c
324 69 374 90 408 134 _c
442 178 462 244 468 334 _c
448 306 424 284 396 269 _c
367 254 335 247 300 247 _c
226 247 168 269 126 313 _c
84 357 63 417 63 494 _c
63 568 85 628 129 674 _c
173 719 232 742 306 742 _c
390 742 455 709 499 645 _c
543 580 566 486 566 364 _c
}_e{566 248 538 157 484 89 _c
429 21 356 -13 264 -13 _c
239 -13 214 -10 189 -6 _c
163 -2 137 5 110 15 _c
306 324 _m
350 324 385 339 411 369 _c
437 399 450 441 450 494 _c
450 546 437 588 411 618 _c
385 648 350 664 306 664 _c
262 664 227 648 201 618 _c
175 588 162 546 162 494 _c
162 441 175 399 201 369 _c
227 339 262 324 306 324 _c
_cl}_e}_d
/A{684 0 8 0 676 729 _sc
342 632 _m
208 269 _l
476 269 _l
342 632 _l
286 729 _m
398 729 _l
676 0 _l
573 0 _l
507 187 _l
178 187 _l
112 0 _l
8 0 _l
286 729 _l
_cl}_d
/C{{698 0 56 -13 644 742 _sc
644 673 _m
644 569 _l
610 599 575 622 537 638 _c
499 653 460 661 418 661 _c
334 661 270 635 226 584 _c
182 533 160 460 160 364 _c
160 268 182 194 226 143 _c
270 92 334 67 418 67 _c
460 67 499 74 537 90 _c
575 105 610 128 644 159 _c
644 56 _l
609 32 572 15 534 4 _c
496 -7 455 -13 412 -13 _c
302 -13 215 20 151 87 _c
}_e{87 154 56 246 56 364 _c
56 481 87 573 151 641 _c
215 708 302 742 412 742 _c
456 742 497 736 535 725 _c
573 713 610 696 644 673 _c
_cl}_e}_d
/I{295 0 98 0 197 729 _sc
98 729 _m
197 729 _l
197 0 _l
98 0 _l
98 729 _l
_cl}_d
/P{603 0 98 0 569 729 _sc
197 648 _m
197 374 _l
321 374 _l
367 374 402 385 427 409 _c
452 433 465 467 465 511 _c
465 555 452 588 427 612 _c
402 636 367 648 321 648 _c
197 648 _l
98 729 _m
321 729 _l
402 729 464 710 506 673 _c
548 636 569 582 569 511 _c
569 439 548 384 506 348 _c
464 311 402 293 321 293 _c
197 293 _l
197 0 _l
98 0 _l
98 729 _l
_cl}_d
/T{611 0 -2 0 614 729 _sc
-2 729 _m
614 729 _l
614 646 _l
355 646 _l
355 0 _l
256 0 _l
256 646 _l
-2 646 _l
-2 729 _l
_cl}_d
/c{{550 0 55 -13 488 560 _sc
488 526 _m
488 442 _l
462 456 437 466 411 473 _c
385 480 360 484 334 484 _c
276 484 230 465 198 428 _c
166 391 150 339 150 273 _c
150 206 166 154 198 117 _c
230 80 276 62 334 62 _c
360 62 385 65 411 72 _c
437 79 462 90 488 104 _c
488 21 _l
462 9 436 0 410 -5 _c
383 -10 354 -13 324 -13 _c
242 -13 176 12 128 64 _c
}_e{79 115 55 185 55 273 _c
55 362 79 432 128 483 _c
177 534 244 560 330 560 _c
358 560 385 557 411 551 _c
437 545 463 537 488 526 _c
_cl}_e}_d
/e{{615 0 55 -13 562 560 _sc
562 296 _m
562 252 _l
149 252 _l
153 190 171 142 205 110 _c
238 78 284 62 344 62 _c
378 62 412 66 444 74 _c
476 82 509 95 541 113 _c
541 28 _l
509 14 476 3 442 -3 _c
408 -9 373 -13 339 -13 _c
251 -13 182 12 131 62 _c
80 112 55 181 55 268 _c
55 357 79 428 127 481 _c
175 533 241 560 323 560 _c
397 560 455 536 498 489 _c
}_e{540 441 562 377 562 296 _c
472 322 _m
471 371 457 410 431 440 _c
404 469 368 484 324 484 _c
274 484 234 469 204 441 _c
174 413 156 373 152 322 _c
472 322 _l
_cl}_e}_d
/f{352 0 23 0 371 760 _sc
371 760 _m
371 685 _l
285 685 _l
253 685 230 678 218 665 _c
205 652 199 629 199 595 _c
199 547 _l
347 547 _l
347 477 _l
199 477 _l
199 0 _l
109 0 _l
109 477 _l
23 477 _l
23 547 _l
109 547 _l
109 585 _l
109 645 123 690 151 718 _c
179 746 224 760 286 760 _c
371 760 _l
_cl}_d
/g{{635 0 55 -207 544 560 _sc
454 280 _m
454 344 440 395 414 431 _c
387 467 349 485 301 485 _c
253 485 215 467 188 431 _c
161 395 148 344 148 280 _c
148 215 161 165 188 129 _c
215 93 253 75 301 75 _c
349 75 387 93 414 129 _c
440 165 454 215 454 280 _c
544 68 _m
544 -24 523 -93 482 -139 _c
440 -184 377 -207 292 -207 _c
260 -207 231 -204 203 -200 _c
175 -195 147 -188 121 -178 _c
}_e{121 -91 _l
147 -105 173 -115 199 -122 _c
225 -129 251 -133 278 -133 _c
336 -133 380 -117 410 -87 _c
439 -56 454 -10 454 52 _c
454 96 _l
435 64 411 40 382 24 _c
353 8 319 0 279 0 _c
211 0 157 25 116 76 _c
75 127 55 195 55 280 _c
55 364 75 432 116 483 _c
157 534 211 560 279 560 _c
319 560 353 552 382 536 _c
411 520 435 496 454 464 _c
454 547 _l
544 547 _l
}_e{544 68 _l
_cl}_e}_d
/i{278 0 94 0 184 760 _sc
94 547 _m
184 547 _l
184 0 _l
94 0 _l
94 547 _l
94 760 _m
184 760 _l
184 646 _l
94 646 _l
94 760 _l
_cl}_d
/l{278 0 94 0 184 760 _sc
94 760 _m
184 760 _l
184 0 _l
94 0 _l
94 760 _l
_cl}_d
/n{634 0 91 0 549 560 _sc
549 330 _m
549 0 _l
459 0 _l
459 327 _l
459 379 448 417 428 443 _c
408 469 378 482 338 482 _c
289 482 251 466 223 435 _c
195 404 181 362 181 309 _c
181 0 _l
91 0 _l
91 547 _l
181 547 _l
181 462 _l
202 494 227 519 257 535 _c
286 551 320 560 358 560 _c
420 560 468 540 500 501 _c
532 462 549 405 549 330 _c
_cl}_d
/o{612 0 55 -13 557 560 _sc
306 484 _m
258 484 220 465 192 427 _c
164 389 150 338 150 273 _c
150 207 163 156 191 118 _c
219 80 257 62 306 62 _c
354 62 392 80 420 118 _c
448 156 462 207 462 273 _c
462 337 448 389 420 427 _c
392 465 354 484 306 484 _c
306 560 _m
384 560 445 534 490 484 _c
534 433 557 363 557 273 _c
557 183 534 113 490 63 _c
445 12 384 -13 306 -13 _c
227 -13 165 12 121 63 _c
77 113 55 183 55 273 _c
55 363 77 433 121 484 _c
165 534 227 560 306 560 _c
_cl}_d
/p{{635 0 91 -207 580 560 _sc
181 82 _m
181 -207 _l
91 -207 _l
91 547 _l
181 547 _l
181 464 _l
199 496 223 520 252 536 _c
281 552 316 560 356 560 _c
422 560 476 533 518 481 _c
559 428 580 359 580 273 _c
580 187 559 117 518 65 _c
476 13 422 -13 356 -13 _c
316 -13 281 -5 252 10 _c
223 25 199 49 181 82 _c
487 273 _m
487 339 473 390 446 428 _c
418 466 381 485 334 485 _c
}_e{286 485 249 466 222 428 _c
194 390 181 339 181 273 _c
181 207 194 155 222 117 _c
249 79 286 61 334 61 _c
381 61 418 79 446 117 _c
473 155 487 207 487 273 _c
_cl}_e}_d
/q{{635 0 55 -207 544 560 _sc
148 273 _m
148 207 161 155 188 117 _c
215 79 253 61 301 61 _c
348 61 385 79 413 117 _c
440 155 454 207 454 273 _c
454 339 440 390 413 428 _c
385 466 348 485 301 485 _c
253 485 215 466 188 428 _c
161 390 148 339 148 273 _c
454 82 _m
435 49 411 25 382 10 _c
353 -5 319 -13 279 -13 _c
213 -13 159 13 117 65 _c
75 117 55 187 55 273 _c
}_e{55 359 75 428 117 481 _c
159 533 213 560 279 560 _c
319 560 353 552 382 536 _c
411 520 435 496 454 464 _c
454 547 _l
544 547 _l
544 -207 _l
454 -207 _l
454 82 _l
_cl}_e}_d
/r{411 0 91 0 411 560 _sc
411 463 _m
401 469 390 473 378 476 _c
366 478 353 480 339 480 _c
288 480 249 463 222 430 _c
194 397 181 350 181 288 _c
181 0 _l
91 0 _l
91 547 _l
181 547 _l
181 462 _l
199 495 224 520 254 536 _c
284 552 321 560 365 560 _c
371 560 378 559 386 559 _c
393 558 401 557 411 555 _c
411 463 _l
_cl}_d
/s{{521 0 54 -13 472 560 _sc
443 531 _m
443 446 _l
417 458 391 468 364 475 _c
336 481 308 485 279 485 _c
234 485 200 478 178 464 _c
156 450 145 430 145 403 _c
145 382 153 366 169 354 _c
185 342 217 330 265 320 _c
296 313 _l
360 299 405 279 432 255 _c
458 230 472 195 472 151 _c
472 100 452 60 412 31 _c
372 1 316 -13 246 -13 _c
216 -13 186 -10 154 -5 _c
}_e{122 0 89 8 54 20 _c
54 113 _l
87 95 120 82 152 74 _c
184 65 216 61 248 61 _c
290 61 323 68 346 82 _c
368 96 380 117 380 144 _c
380 168 371 187 355 200 _c
339 213 303 226 247 238 _c
216 245 _l
160 257 119 275 95 299 _c
70 323 58 356 58 399 _c
58 450 76 490 112 518 _c
148 546 200 560 268 560 _c
301 560 332 557 362 552 _c
391 547 418 540 443 531 _c
}_e{_cl}_e}_d
/t{392 0 27 0 368 702 _sc
183 702 _m
183 547 _l
368 547 _l
368 477 _l
183 477 _l
183 180 _l
183 135 189 106 201 94 _c
213 81 238 75 276 75 _c
368 75 _l
368 0 _l
276 0 _l
206 0 158 13 132 39 _c
106 65 93 112 93 180 _c
93 477 _l
27 477 _l
27 547 _l
93 547 _l
93 702 _l
183 702 _l
_cl}_d
/u{634 0 85 -13 543 560 _sc
85 216 _m
85 547 _l
175 547 _l
175 219 _l
175 167 185 129 205 103 _c
225 77 255 64 296 64 _c
344 64 383 79 411 110 _c
439 141 453 183 453 237 _c
453 547 _l
543 547 _l
543 0 _l
453 0 _l
453 84 _l
431 50 405 26 377 10 _c
348 -5 315 -13 277 -13 _c
214 -13 166 6 134 45 _c
101 83 85 140 85 216 _c
311 560 _m
311 560 _l
_cl}_d
/y{592 0 30 -207 562 547 _sc
322 -50 _m
296 -114 271 -157 247 -177 _c
223 -197 191 -207 151 -207 _c
79 -207 _l
79 -132 _l
132 -132 _l
156 -132 175 -126 189 -114 _c
203 -102 218 -75 235 -31 _c
251 9 _l
30 547 _l
125 547 _l
296 119 _l
467 547 _l
562 547 _l
322 -50 _l
_cl}_d
end readonly def

/BuildGlyph
 {exch begin
 CharStrings exch
 2 copy known not{pop /.notdef}if
 true 3 1 roll get exec
 end}_d

/BuildChar {
 1 index /Encoding get exch get
 1 index /BuildGlyph get exec
}_d

FontName currentdict end definefont pop
%!PS-Adobe-3.0 Resource-Font
%%Title: cmr10
%%Copyright: Copyright (C) 1994, Basil K. Malyshev. All Rights Reserved.012BaKoMa Fonts Collection, Level-B.
%%Creator: Converted from TrueType to type 3 by PPR
25 dict begin
/_d{bind def}bind def
/_m{moveto}_d
/_l{lineto}_d
/_cl{closepath eofill}_d
/_c{curveto}_d
/_sc{7 -1 roll{setcachedevice}{pop pop pop pop pop pop}ifelse}_d
/_e{exec}_d
/FontName /Cmr10 def
/PaintType 0 def
/FontMatrix[.001 0 0 .001 0 0]def
/FontBBox[-44 -250 1009 750]def
/FontType 3 def
/Encoding [ /one ] def
/FontInfo 10 dict dup begin
/FamilyName (cmr10) def
/FullName (cmr10) def
/Notice (Copyright (C) 1994, Basil K. Malyshev. All Rights Reserved.012BaKoMa Fonts Collection, Level-B. ) def
/Weight (Regular) def
/Version (1.1/12-Nov-94) def
/ItalicAngle 0.0 def
/isFixedPitch false def
/UnderlinePosition -133 def
/UnderlineThickness 20 def
end readonly def
/CharStrings 1 dict dup begin
/one{500 0 87 0 421 666 _sc
93 0 _m
93 35 _l
176 35 218 45 218 67 _c
218 592 _l
183 575 139 567 87 567 _c
87 602 _l
168 602 230 623 272 666 _c
286 666 _l
288 666 291 665 293 663 _c
295 661 296 659 296 657 _c
296 67 _l
296 45 337 35 421 35 _c
421 0 _l
93 0 _l
_cl}_d
end readonly def

/BuildGlyph
 {exch begin
 CharStrings exch
 2 copy known not{pop /.notdef}if
 true 3 1 roll get exec
 end}_d

/BuildChar {
 1 index /Encoding get exch get
 1 index /BuildGlyph get exec
}_d

FontName currentdict end definefont pop
%!PS-Adobe-3.0 Resource-Font
%%Title: cmmi10
%%Copyright: Copyright (C) 1994, Basil K. Malyshev. All Rights Reserved.012BaKoMa Fonts Collection, Level-B.
%%Creator: Converted from TrueType to type 3 by PPR
25 dict begin
/_d{bind def}bind def
/_m{moveto}_d
/_l{lineto}_d
/_cl{closepath eofill}_d
/_c{curveto}_d
/_sc{7 -1 roll{setcachedevice}{pop pop pop pop pop pop}ifelse}_d
/_e{exec}_d
/FontName /Cmmi10 def
/PaintType 0 def
/FontMatrix[.001 0 0 .001 0 0]def
/FontBBox[-34 -250 1048 750]def
/FontType 3 def
/Encoding [ /k /m /o /slash /l /c ] def
/FontInfo 10 dict dup begin
/FamilyName (cmmi10) def
/FullName (cmmi10) def
/Notice (Copyright (C) 1994, Basil K. Malyshev. All Rights Reserved.012BaKoMa Fonts Collection, Level-B. ) def
/Weight (Regular) def
/Version (1.1/12-Nov-94) def
/ItalicAngle 0.0 def
/isFixedPitch false def
/UnderlinePosition -133 def
/UnderlineThickness 20 def
end readonly def
/CharStrings 6 dict dup begin
/k{{520 0 53 -10 507 694 _sc
53 18 _m
53 22 53 25 54 27 _c
199 605 _l
201 616 203 625 204 632 _c
204 642 182 648 139 648 _c
132 648 129 652 129 661 _c
129 663 129 666 131 670 _c
132 674 133 677 135 679 _c
137 681 139 683 143 683 _c
278 694 _l
281 694 _l
281 693 282 692 284 691 _c
286 689 288 689 288 689 _c
289 685 290 683 290 681 _c
185 263 _l
209 273 239 297 276 335 _c
}_e{312 373 341 400 362 417 _c
382 433 408 442 440 442 _c
458 442 474 435 487 423 _c
500 410 507 394 507 376 _c
507 364 504 353 499 343 _c
494 333 487 325 479 319 _c
470 313 460 310 448 310 _c
437 310 428 313 421 320 _c
413 326 410 335 410 346 _c
410 362 415 375 427 386 _c
438 397 452 403 468 403 _c
461 411 451 416 438 416 _c
418 416 398 410 380 399 _c
}_e{362 387 342 371 321 350 _c
299 328 280 309 262 291 _c
244 273 228 260 214 251 _c
253 246 287 236 316 220 _c
345 204 360 179 360 146 _c
360 139 358 130 356 120 _c
350 95 347 75 347 60 _c
347 30 357 15 378 15 _c
402 15 420 28 433 54 _c
445 80 456 111 464 147 _c
465 151 468 153 472 153 _c
484 153 _l
486 153 488 152 490 150 _c
492 148 493 146 493 144 _c
}_e{493 143 492 142 492 141 _c
467 40 428 -10 376 -10 _c
357 -10 340 -6 326 2 _c
311 10 300 22 292 38 _c
284 53 281 70 281 89 _c
281 99 282 110 285 122 _c
287 130 288 137 288 144 _c
288 170 276 189 254 203 _c
231 216 205 224 176 227 _c
125 23 _l
122 13 117 5 110 -1 _c
102 -7 94 -10 84 -10 _c
75 -10 68 -7 62 -2 _c
56 3 53 10 53 18 _c
_cl}_e}_d
/m{{878 0 27 -10 851 442 _sc
77 17 _m
77 21 77 24 78 26 _c
153 324 _l
157 342 160 359 160 373 _c
160 401 150 416 131 416 _c
110 416 94 403 84 378 _c
74 353 64 322 55 284 _c
55 282 54 280 52 279 _c
50 278 48 278 47 278 _c
35 278 _l
33 278 31 279 29 281 _c
27 283 27 286 27 288 _c
34 317 41 342 48 362 _c
54 382 65 400 79 417 _c
}_e{93 433 110 442 132 442 _c
156 442 178 434 198 418 _c
217 402 227 382 227 358 _c
247 384 270 404 297 419 _c
323 434 352 442 382 442 _c
413 442 440 434 463 418 _c
486 402 498 379 498 349 _c
518 378 542 401 570 417 _c
597 433 627 442 660 442 _c
694 442 722 432 743 414 _c
764 395 775 368 775 334 _c
775 306 768 273 756 235 _c
744 196 729 153 711 105 _c
}_e{701 81 697 61 697 45 _c
697 25 704 15 720 15 _c
746 15 767 29 785 57 _c
802 85 814 115 822 147 _c
824 151 826 153 830 153 _c
842 153 _l
844 153 846 152 848 150 _c
850 148 851 146 851 144 _c
851 143 850 142 850 141 _c
840 103 824 68 802 37 _c
780 5 752 -10 718 -10 _c
694 -10 674 -2 658 13 _c
641 29 633 48 633 72 _c
633 83 635 96 641 111 _c
}_e{659 161 675 205 688 245 _c
700 284 707 319 707 349 _c
707 367 703 383 696 396 _c
688 409 676 416 658 416 _c
622 416 590 404 563 382 _c
536 360 513 330 494 294 _c
492 287 491 282 491 279 _c
427 22 _l
424 12 419 5 411 -1 _c
403 -7 394 -10 385 -10 _c
377 -10 370 -7 364 -3 _c
358 1 355 8 355 17 _c
355 21 355 24 356 26 _c
420 281 _l
426 308 430 331 430 349 _c
}_e{430 367 426 383 418 396 _c
410 409 398 416 380 416 _c
355 416 332 410 312 400 _c
292 389 274 375 259 357 _c
243 339 229 318 217 294 _c
149 22 _l
147 12 142 5 134 -1 _c
126 -7 117 -10 107 -10 _c
99 -10 92 -7 86 -3 _c
80 1 77 8 77 17 _c
_cl}_e}_d
/o{{484 0 40 -10 471 442 _sc
201 -10 _m
169 -10 141 -2 117 12 _c
92 26 73 46 60 72 _c
46 97 40 126 40 158 _c
40 203 52 248 78 292 _c
103 336 136 372 178 400 _c
220 428 264 442 310 442 _c
334 442 356 437 376 429 _c
395 421 412 409 426 394 _c
440 378 451 360 459 340 _c
467 319 471 297 471 273 _c
471 238 463 204 449 170 _c
434 136 414 106 389 78 _c
}_e{363 50 334 29 301 13 _c
268 -2 235 -10 201 -10 _c
203 15 _m
233 15 260 25 284 45 _c
308 65 329 91 345 122 _c
361 152 373 185 381 219 _c
389 253 394 284 394 312 _c
394 340 386 365 372 385 _c
358 405 336 416 308 416 _c
269 416 235 399 206 366 _c
176 332 154 292 139 246 _c
124 200 117 157 117 119 _c
117 90 124 65 139 45 _c
154 25 175 15 203 15 _c
_cl}_e}_d
/slash{500 0 56 -249 443 750 _sc
56 -229 _m
56 -227 56 -225 57 -225 _c
405 738 _l
406 742 408 745 412 747 _c
415 749 419 750 423 750 _c
429 750 433 748 437 744 _c
441 740 443 736 443 730 _c
443 726 _l
95 -237 _l
91 -245 84 -249 76 -249 _c
70 -249 66 -247 62 -243 _c
58 -239 56 -234 56 -229 _c
_cl}_d
/l{{298 0 44 -10 262 694 _sc
44 81 _m
44 83 44 86 44 90 _c
44 94 45 97 46 101 _c
46 105 47 108 47 110 _c
171 605 _l
173 616 175 625 176 632 _c
176 642 154 648 111 648 _c
104 648 101 652 101 661 _c
101 663 102 666 103 670 _c
104 674 105 677 107 679 _c
109 681 111 683 115 683 _c
250 694 _l
258 694 262 689 262 681 _c
118 106 _l
113 95 111 79 111 58 _c
}_e{111 29 120 15 140 15 _c
160 15 176 27 186 53 _c
196 79 206 110 214 147 _c
215 151 218 153 222 153 _c
234 153 _l
236 153 238 151 240 149 _c
242 147 243 145 243 143 _c
235 111 227 85 221 67 _c
215 48 205 30 191 14 _c
177 -2 159 -10 138 -10 _c
111 -10 89 -1 71 15 _c
53 32 44 54 44 81 _c
_cl}_e}_d
/c{{432 0 40 -10 430 442 _sc
117 119 _m
117 90 124 65 139 45 _c
154 25 175 15 203 15 _c
243 15 281 24 318 42 _c
354 60 384 86 407 118 _c
409 120 411 121 415 121 _c
418 121 421 119 425 115 _c
428 111 430 108 430 105 _c
430 102 429 100 428 99 _c
404 65 371 38 330 19 _c
288 0 245 -10 201 -10 _c
169 -10 140 -2 116 12 _c
92 26 73 46 60 72 _c
}_e{46 97 40 126 40 158 _c
40 203 52 248 77 292 _c
102 336 135 372 177 400 _c
219 428 263 442 309 442 _c
339 442 366 434 390 420 _c
414 405 426 384 426 356 _c
426 338 420 322 410 309 _c
399 296 385 290 367 290 _c
356 290 347 293 340 300 _c
332 306 329 315 329 326 _c
329 342 334 355 346 366 _c
357 377 370 383 386 383 _c
388 383 _l
380 394 368 402 354 408 _c
}_e{339 413 324 416 308 416 _c
269 416 235 399 206 366 _c
176 332 154 292 139 246 _c
124 200 117 157 117 119 _c
_cl}_e}_d
end readonly def

/BuildGlyph
 {exch begin
 CharStrings exch
 2 copy known not{pop /.notdef}if
 true 3 1 roll get exec
 end}_d

/BuildChar {
 1 index /Encoding get exch get
 1 index /BuildGlyph get exec
}_d

FontName currentdict end definefont pop
end
%%EndProlog
mpldict begin
18 180 translate
576 432 0 0 clipbox
gsave
0 0 m
576 0 l
576 432 l
0 432 l
cl
1.000 setgray
fill
grestore
gsave
72 275.489 m
518.4 275.489 l
518.4 388.8 l
72 388.8 l
cl
1.000 setgray
fill
grestore
1.000 setlinewidth
1 setlinejoin
0 setlinecap
[] 0 setdash
0.000 setgray
gsave
446.4 113.3 72 275.5 clipbox
267.514 284.193 m
256.287 292.163 l
261.635 294.373 l
250.729 313.259 l
250.73 313.259 l
261.636 294.374 l
266.983 296.585 l
cl
gsave
fill
grestore
stroke
grestore
2.200 setlinewidth
2 setlinecap
0.392 0.584 0.929 setrgbcolor
gsave
446.4 113.3 72 275.5 clipbox
70.512 275.786 m
77.952 275.538 l
88.368 275.489 l
138.96 275.54 l
141.936 275.777 l
143.424 276.117 l
144.912 276.785 l
146.4 278.019 l
147.888 280.16 l
149.376 283.647 l
150.864 288.969 l
152.352 296.562 l
153.84 306.653 l
155.328 319.092 l
159.792 361.11 l
161.28 371.452 l
162.768 377.242 l
164.256 377.561 l
165.744 372.357 l
167.232 362.461 l
168.72 349.362 l
171.696 320.619 l
173.184 307.947 l
174.672 297.574 l
176.16 289.706 l
177.648 284.147 l
179.136 280.477 l
180.624 278.208 l
182.112 276.891 l
183.6 276.173 l
185.088 275.804 l
188.064 275.546 l
194.016 275.495 l
268.416 275.489 l
293.712 275.599 l
305.616 275.849 l
324.96 275.49 l
369.6 275.529 l
372.576 275.711 l
374.064 275.97 l
375.552 276.475 l
377.04 277.399 l
378.528 278.992 l
380.016 281.566 l
381.504 285.462 l
382.992 290.973 l
384.48 298.231 l
385.968 307.091 l
390.432 336.28 l
391.92 343.158 l
393.408 346.75 l
394.896 346.485 l
396.384 342.405 l
397.872 335.157 l
399.36 325.825 l
402.336 305.82 l
403.824 297.155 l
405.312 290.13 l
406.8 284.85 l
408.288 281.152 l
409.776 278.731 l
411.264 277.248 l
412.752 276.398 l
414.24 275.946 l
415.728 275.731 l
418.704 275.658 l
421.68 275.839 l
426.144 276.436 l
430.608 277.072 l
433.584 277.179 l
436.56 276.934 l
445.488 275.728 l
449.952 275.535 l
460.368 275.489 l
488.64 275.559 l
491.616 275.744 l
493.104 275.945 l
494.592 276.267 l
496.08 276.753 l
497.568 277.444 l
499.056 278.36 l
500.544 279.491 l
505.008 283.354 l
506.496 284.328 l
507.984 284.893 l
509.472 284.959 l
510.96 284.516 l
512.448 283.631 l
513.936 282.438 l
516.912 279.777 l
518.4 278.589 l
519.888 277.609 l
519.888 277.609 l
stroke
grestore
2.700 setlinewidth
0 setlinecap
[6 6] 0 setdash
1.000 0.000 0.000 setrgbcolor
gsave
446.4 113.3 72 275.5 clipbox
70.512 275.851 m
77.952 275.865 l
83.904 275.832 l
98.784 275.496 l
128.544 275.521 l
131.52 275.631 l
134.496 275.991 l
135.984 276.356 l
137.472 276.909 l
138.96 277.697 l
140.448 278.755 l
141.936 280.1 l
143.424 281.737 l
144.912 283.677 l
146.4 285.978 l
147.888 288.786 l
149.376 292.368 l
150.864 297.105 l
152.352 303.407 l
153.84 311.578 l
155.328 321.627 l
159.792 356.075 l
161.28 364.581 l
162.768 369.179 l
164.256 369.007 l
165.744 363.979 l
167.232 354.801 l
168.72 342.79 l
171.696 316.573 l
173.184 305.036 l
174.672 295.596 l
176.16 288.435 l
177.648 283.375 l
179.136 280.035 l
180.624 277.968 l
182.112 276.768 l
183.6 276.113 l
185.088 275.777 l
188.064 275.542 l
194.016 275.495 l
244.608 275.597 l
247.584 275.847 l
249.072 276.1 l
250.56 276.479 l
252.048 277.009 l
253.536 277.696 l
256.512 279.431 l
259.488 281.13 l
260.976 281.699 l
262.464 281.956 l
263.952 281.86 l
265.44 281.427 l
266.928 280.725 l
272.88 277.307 l
274.368 276.704 l
275.856 276.257 l
278.832 275.749 l
281.808 275.56 l
287.76 275.512 l
293.712 275.686 l
296.688 275.952 l
299.664 276.395 l
305.616 277.463 l
308.592 277.659 l
311.568 277.433 l
316.032 276.601 l
319.008 276.076 l
321.984 275.738 l
326.448 275.535 l
336.864 275.49 l
371.088 275.577 l
372.576 275.691 l
374.064 275.926 l
375.552 276.385 l
377.04 277.226 l
378.528 278.674 l
380.016 281.014 l
381.504 284.555 l
382.992 289.565 l
384.48 296.164 l
385.968 304.218 l
390.432 330.754 l
391.92 337.006 l
393.408 340.272 l
394.896 340.031 l
396.384 336.324 l
397.872 329.737 l
399.36 321.258 l
402.336 303.098 l
403.824 295.249 l
405.312 288.907 l
406.8 284.172 l
408.288 280.902 l
409.776 278.822 l
411.264 277.619 l
412.752 277.009 l
414.24 276.764 l
417.216 276.759 l
424.656 276.989 l
432.096 277.183 l
435.072 277.008 l
439.536 276.397 l
444 275.826 l
448.464 275.565 l
455.904 275.491 l
488.64 275.553 l
491.616 275.721 l
494.592 276.197 l
496.08 276.639 l
497.568 277.267 l
499.056 278.1 l
500.544 279.128 l
505.008 282.639 l
506.496 283.524 l
507.984 284.038 l
509.472 284.099 l
510.96 283.695 l
512.448 282.89 l
515.424 280.59 l
518.4 278.307 l
519.888 277.416 l
519.888 277.416 l
stroke
grestore
0.500 setlinewidth
[1 3] 0 setdash
0.000 setgray
gsave
446.4 113.3 72 275.5 clipbox
72 275.489 m
72 388.8 l
stroke
grestore
[] 0 setdash
gsave
/o {
gsave
newpath
translate
0.5 setlinewidth
1 setlinejoin
0 setlinecap
0 0 m
0 4 l
gsave
0.000 setgray
fill
grestore
stroke
grestore
} bind def
72 275.489 o
grestore
gsave
/o {
gsave
newpath
translate
0.5 setlinewidth
1 setlinejoin
0 setlinecap
0 0 m
0 -4 l
gsave
0.000 setgray
fill
grestore
stroke
grestore
} bind def
72 388.8 o
grestore
[1 3] 0 setdash
gsave
446.4 113.3 72 275.5 clipbox
146.4 275.489 m
146.4 388.8 l
stroke
grestore
[] 0 setdash
gsave
/o {
gsave
newpath
translate
0.5 setlinewidth
1 setlinejoin
0 setlinecap
0 0 m
0 4 l
gsave
0.000 setgray
fill
grestore
stroke
grestore
} bind def
146.4 275.489 o
grestore
gsave
/o {
gsave
newpath
translate
0.5 setlinewidth
1 setlinejoin
0 setlinecap
0 0 m
0 -4 l
gsave
0.000 setgray
fill
grestore
stroke
grestore
} bind def
146.4 388.8 o
grestore
[1 3] 0 setdash
gsave
446.4 113.3 72 275.5 clipbox
220.8 275.489 m
220.8 388.8 l
stroke
grestore
[] 0 setdash
gsave
/o {
gsave
newpath
translate
0.5 setlinewidth
1 setlinejoin
0 setlinecap
0 0 m
0 4 l
gsave
0.000 setgray
fill
grestore
stroke
grestore
} bind def
220.8 275.489 o
grestore
gsave
/o {
gsave
newpath
translate
0.5 setlinewidth
1 setlinejoin
0 setlinecap
0 0 m
0 -4 l
gsave
0.000 setgray
fill
grestore
stroke
grestore
} bind def
220.8 388.8 o
grestore
[1 3] 0 setdash
gsave
446.4 113.3 72 275.5 clipbox
295.2 275.489 m
295.2 388.8 l
stroke
grestore
[] 0 setdash
gsave
/o {
gsave
newpath
translate
0.5 setlinewidth
1 setlinejoin
0 setlinecap
0 0 m
0 4 l
gsave
0.000 setgray
fill
grestore
stroke
grestore
} bind def
295.2 275.489 o
grestore
gsave
/o {
gsave
newpath
translate
0.5 setlinewidth
1 setlinejoin
0 setlinecap
0 0 m
0 -4 l
gsave
0.000 setgray
fill
grestore
stroke
grestore
} bind def
295.2 388.8 o
grestore
[1 3] 0 setdash
gsave
446.4 113.3 72 275.5 clipbox
369.6 275.489 m
369.6 388.8 l
stroke
grestore
[] 0 setdash
gsave
/o {
gsave
newpath
translate
0.5 setlinewidth
1 setlinejoin
0 setlinecap
0 0 m
0 4 l
gsave
0.000 setgray
fill
grestore
stroke
grestore
} bind def
369.6 275.489 o
grestore
gsave
/o {
gsave
newpath
translate
0.5 setlinewidth
1 setlinejoin
0 setlinecap
0 0 m
0 -4 l
gsave
0.000 setgray
fill
grestore
stroke
grestore
} bind def
369.6 388.8 o
grestore
[1 3] 0 setdash
gsave
446.4 113.3 72 275.5 clipbox
444 275.489 m
444 388.8 l
stroke
grestore
[] 0 setdash
gsave
/o {
gsave
newpath
translate
0.5 setlinewidth
1 setlinejoin
0 setlinecap
0 0 m
0 4 l
gsave
0.000 setgray
fill
grestore
stroke
grestore
} bind def
444 275.489 o
grestore
gsave
/o {
gsave
newpath
translate
0.5 setlinewidth
1 setlinejoin
0 setlinecap
0 0 m
0 -4 l
gsave
0.000 setgray
fill
grestore
stroke
grestore
} bind def
444 388.8 o
grestore
[1 3] 0 setdash
gsave
446.4 113.3 72 275.5 clipbox
518.4 275.489 m
518.4 388.8 l
stroke
grestore
[] 0 setdash
gsave
/o {
gsave
newpath
translate
0.5 setlinewidth
1 setlinejoin
0 setlinecap
0 0 m
0 4 l
gsave
0.000 setgray
fill
grestore
stroke
grestore
} bind def
518.4 275.489 o
grestore
gsave
/o {
gsave
newpath
translate
0.5 setlinewidth
1 setlinejoin
0 setlinecap
0 0 m
0 -4 l
gsave
0.000 setgray
fill
grestore
stroke
grestore
} bind def
518.4 388.8 o
grestore
[1 3] 0 setdash
gsave
446.4 113.3 72 275.5 clipbox
72 275.489 m
518.4 275.489 l
stroke
grestore
[] 0 setdash
gsave
/o {
gsave
newpath
translate
0.5 setlinewidth
1 setlinejoin
0 setlinecap
0 0 m
4 0 l
gsave
0.000 setgray
fill
grestore
stroke
grestore
} bind def
72 275.489 o
grestore
gsave
/o {
gsave
newpath
translate
0.5 setlinewidth
1 setlinejoin
0 setlinecap
0 0 m
-4 0 l
gsave
0.000 setgray
fill
grestore
stroke
grestore
} bind def
518.4 275.489 o
grestore
/DejaVuSans findfont
12.000 scalefont
setfont
gsave
61.953125 272.176025 translate
0.000000 rotate
0.000000 0.000000 m /zero glyphshow
grestore
[1 3] 0 setdash
gsave
446.4 113.3 72 275.5 clipbox
72 300.669 m
518.4 300.669 l
stroke
grestore
[] 0 setdash
gsave
/o {
gsave
newpath
translate
0.5 setlinewidth
1 setlinejoin
0 setlinecap
0 0 m
4 0 l
gsave
0.000 setgray
fill
grestore
stroke
grestore
} bind def
72 300.669 o
grestore
gsave
/o {
gsave
newpath
translate
0.5 setlinewidth
1 setlinejoin
0 setlinecap
0 0 m
-4 0 l
gsave
0.000 setgray
fill
grestore
stroke
grestore
} bind def
518.4 300.669 o
grestore
gsave
54.390625 297.356352 translate
0.000000 rotate
0.000000 0.000000 m /two glyphshow
7.634766 0.000000 m /zero glyphshow
grestore
[1 3] 0 setdash
gsave
446.4 113.3 72 275.5 clipbox
72 325.849 m
518.4 325.849 l
stroke
grestore
[] 0 setdash
gsave
/o {
gsave
newpath
translate
0.5 setlinewidth
1 setlinejoin
0 setlinecap
0 0 m
4 0 l
gsave
0.000 setgray
fill
grestore
stroke
grestore
} bind def
72 325.849 o
grestore
gsave
/o {
gsave
newpath
translate
0.5 setlinewidth
1 setlinejoin
0 setlinecap
0 0 m
-4 0 l
gsave
0.000 setgray
fill
grestore
stroke
grestore
} bind def
518.4 325.849 o
grestore
gsave
54.109375 322.536680 translate
0.000000 rotate
0.000000 0.000000 m /four glyphshow
7.634766 0.000000 m /zero glyphshow
grestore
[1 3] 0 setdash
gsave
446.4 113.3 72 275.5 clipbox
72 351.03 m
518.4 351.03 l
stroke
grestore
[] 0 setdash
gsave
/o {
gsave
newpath
translate
0.5 setlinewidth
1 setlinejoin
0 setlinecap
0 0 m
4 0 l
gsave
0.000 setgray
fill
grestore
stroke
grestore
} bind def
72 351.03 o
grestore
gsave
/o {
gsave
newpath
translate
0.5 setlinewidth
1 setlinejoin
0 setlinecap
0 0 m
-4 0 l
gsave
0.000 setgray
fill
grestore
stroke
grestore
} bind def
518.4 351.03 o
grestore
gsave
54.359375 347.717008 translate
0.000000 rotate
0.000000 0.000000 m /six glyphshow
7.634766 0.000000 m /zero glyphshow
grestore
[1 3] 0 setdash
gsave
446.4 113.3 72 275.5 clipbox
72 376.21 m
518.4 376.21 l
stroke
grestore
[] 0 setdash
gsave
/o {
gsave
newpath
translate
0.5 setlinewidth
1 setlinejoin
0 setlinecap
0 0 m
4 0 l
gsave
0.000 setgray
fill
grestore
stroke
grestore
} bind def
72 376.21 o
grestore
gsave
/o {
gsave
newpath
translate
0.5 setlinewidth
1 setlinejoin
0 setlinecap
0 0 m
-4 0 l
gsave
0.000 setgray
fill
grestore
stroke
grestore
} bind def
518.4 376.21 o
grestore
gsave
54.328125 372.897336 translate
0.000000 rotate
0.000000 0.000000 m /eight glyphshow
7.634766 0.000000 m /zero glyphshow
grestore
1.000 setlinewidth
gsave
72 388.8 m
518.4 388.8 l
stroke
grestore
gsave
518.4 275.489 m
518.4 388.8 l
stroke
grestore
gsave
72 275.489 m
518.4 275.489 l
stroke
grestore
gsave
72 275.489 m
72 388.8 l
stroke
grestore
/DejaVuSans findfont
14.400 scalefont
setfont
gsave
86.880000 351.029508 translate
0.000000 rotate
0.000000 0.000000 m /A glyphshow
9.594360 0.000000 m /C glyphshow
grestore
0.300 setgray
gsave
371.376 333.786 m
513.2 333.786 l
513.2 379.6 l
371.376 379.6 l
371.376 333.786 l
cl
gsave
fill
grestore
stroke
grestore
0.000 setgray
gsave
369.376 335.786 m
511.2 335.786 l
511.2 381.6 l
369.376 381.6 l
369.376 335.786 l
cl
gsave
1.000 setgray
fill
grestore
stroke
grestore
2.200 setlinewidth
2 setlinecap
0.392 0.584 0.929 setrgbcolor
gsave
379.456 370.239 m
399.616 370.239 l
stroke
grestore
0.000 setgray
gsave
415.455625 365.199375 translate
0.000000 rotate
0.000000 0.000000 m /o glyphshow
8.804413 0.000000 m /n glyphshow
17.925034 0.000000 m /l glyphshow
21.923203 0.000000 m /y glyphshow
30.439529 0.000000 m /space glyphshow
35.013885 0.000000 m /s glyphshow
42.511337 0.000000 m /i glyphshow
46.509506 0.000000 m /n glyphshow
55.630127 0.000000 m /g glyphshow
64.764801 0.000000 m /l glyphshow
68.762970 0.000000 m /e glyphshow
77.616577 0.000000 m /t glyphshow
83.258987 0.000000 m /s glyphshow
90.756439 0.000000 m /space glyphshow
grestore
2.700 setlinewidth
0 setlinecap
[6 6] 0 setdash
1.000 0.000 0.000 setrgbcolor
gsave
379.456 349.493 m
399.616 349.493 l
stroke
grestore
0.000 setgray
gsave
415.455625 344.452500 translate
0.000000 rotate
0.000000 0.000000 m /one glyphshow
9.155746 0.000000 m /zero glyphshow
18.311493 0.000000 m /percent glyphshow
31.985397 0.000000 m /space glyphshow
36.559753 0.000000 m /t glyphshow
42.202164 0.000000 m /r glyphshow
48.118622 0.000000 m /i glyphshow
52.116791 0.000000 m /p glyphshow
61.251465 0.000000 m /l glyphshow
65.249634 0.000000 m /e glyphshow
74.103241 0.000000 m /t glyphshow
79.745651 0.000000 m /s glyphshow
87.243103 0.000000 m /space glyphshow
grestore
gsave
72 159.344 m
518.4 159.344 l
518.4 272.656 l
72 272.656 l
cl
1.000 setgray
fill
grestore
1.000 setlinewidth
[] 0 setdash
gsave
446.4 113.3 72 159.3 clipbox
344.024 167.425 m
332.32 174.141 l
337.523 176.341 l
325.129 193.337 l
325.13 193.338 l
337.524 176.341 l
342.727 178.541 l
cl
gsave
fill
grestore
stroke
grestore
2.200 setlinewidth
2 setlinecap
0.392 0.584 0.929 setrgbcolor
gsave
446.4 113.3 72 159.3 clipbox
70.512 159.344 m
162.768 159.448 l
171.696 159.799 l
173.184 159.942 l
174.672 160.218 l
176.16 160.76 l
177.648 161.787 l
179.136 163.623 l
180.624 166.688 l
182.112 171.472 l
183.6 178.437 l
185.088 187.876 l
186.576 199.744 l
191.04 241.795 l
192.528 252.974 l
194.016 259.936 l
195.504 261.59 l
196.992 257.67 l
198.48 248.809 l
199.968 236.369 l
202.944 207.762 l
204.432 194.737 l
205.92 183.897 l
207.408 175.56 l
208.896 169.602 l
210.384 165.631 l
211.872 163.151 l
213.36 161.688 l
214.848 160.86 l
216.336 160.393 l
219.312 159.929 l
223.776 159.588 l
229.728 159.412 l
247.584 159.346 l
341.328 159.401 l
354.72 159.403 l
372.576 159.347 l
402.336 159.431 l
405.312 159.743 l
406.8 160.142 l
408.288 160.862 l
409.776 162.095 l
411.264 164.094 l
412.752 167.158 l
414.24 171.593 l
415.728 177.644 l
417.216 185.398 l
418.704 194.691 l
423.168 225.261 l
424.656 232.865 l
426.144 237.346 l
427.632 238.024 l
429.12 234.764 l
430.608 228.014 l
432.096 218.705 l
436.56 187.316 l
438.048 178.915 l
439.536 172.322 l
441.024 167.498 l
442.512 164.197 l
444 162.08 l
445.488 160.805 l
446.976 160.084 l
448.464 159.701 l
451.44 159.429 l
455.904 159.458 l
458.88 159.643 l
461.856 159.995 l
469.296 161.079 l
472.272 161.086 l
475.248 160.745 l
481.2 159.811 l
484.176 159.544 l
487.152 159.444 l
490.128 159.512 l
493.104 159.862 l
494.592 160.22 l
496.08 160.752 l
497.568 161.489 l
499.056 162.438 l
502.032 164.813 l
503.52 166.042 l
505.008 167.11 l
506.496 167.867 l
507.984 168.199 l
509.472 168.052 l
510.96 167.449 l
512.448 166.484 l
518.4 161.823 l
519.888 161.002 l
519.888 161.002 l
stroke
grestore
2.700 setlinewidth
0 setlinecap
[6 6] 0 setdash
1.000 0.000 0.000 setrgbcolor
gsave
446.4 113.3 72 159.3 clipbox
70.512 159.344 m
146.4 159.421 l
149.376 159.606 l
152.352 160.079 l
153.84 160.492 l
155.328 161.058 l
156.816 161.791 l
158.304 162.69 l
161.28 164.868 l
164.256 167.085 l
165.744 167.96 l
167.232 168.541 l
168.72 168.751 l
170.208 168.564 l
171.696 168.012 l
176.16 165.59 l
177.648 165.352 l
179.136 165.979 l
180.624 167.91 l
182.112 171.604 l
183.6 177.465 l
185.088 185.731 l
186.576 196.321 l
191.04 234.331 l
192.528 244.476 l
194.016 250.798 l
195.504 252.298 l
196.992 248.733 l
198.48 240.676 l
199.968 229.367 l
202.944 203.362 l
204.432 191.521 l
205.92 181.668 l
207.408 174.092 l
208.896 168.683 l
210.384 165.085 l
211.872 162.852 l
213.36 161.558 l
214.848 160.859 l
216.336 160.512 l
219.312 160.325 l
229.728 160.452 l
234.192 160.034 l
238.656 159.612 l
243.12 159.409 l
252.048 159.347 l
329.424 159.4 l
332.4 159.522 l
335.376 159.881 l
336.864 160.223 l
338.352 160.715 l
339.84 161.377 l
342.816 163.148 l
345.792 165.063 l
347.28 165.799 l
348.768 166.237 l
350.256 166.309 l
351.744 166.003 l
353.232 165.366 l
356.208 163.517 l
359.184 161.662 l
360.672 160.935 l
362.16 160.378 l
363.648 159.981 l
366.624 159.552 l
369.6 159.402 l
377.04 159.355 l
402.336 159.424 l
405.312 159.707 l
406.8 160.069 l
408.288 160.724 l
409.776 161.845 l
411.264 163.663 l
412.752 166.448 l
414.24 170.48 l
415.728 175.98 l
417.216 183.029 l
418.704 191.478 l
423.168 219.269 l
424.656 226.181 l
426.144 230.255 l
427.632 230.871 l
429.12 227.908 l
430.608 221.771 l
432.096 213.309 l
436.56 184.779 l
438.048 177.149 l
439.536 171.167 l
441.024 166.803 l
442.512 163.837 l
444 161.966 l
445.488 160.883 l
446.976 160.332 l
448.464 160.114 l
451.44 160.179 l
458.88 160.738 l
470.784 161.109 l
473.76 160.856 l
482.688 159.628 l
485.664 159.463 l
488.64 159.444 l
491.616 159.612 l
493.104 159.815 l
494.592 160.14 l
496.08 160.624 l
497.568 161.294 l
499.056 162.157 l
502.032 164.316 l
503.52 165.433 l
505.008 166.404 l
506.496 167.093 l
507.984 167.394 l
509.472 167.261 l
510.96 166.713 l
512.448 165.836 l
518.4 161.598 l
519.888 160.852 l
519.888 160.852 l
stroke
grestore
0.500 setlinewidth
[1 3] 0 setdash
0.000 setgray
gsave
446.4 113.3 72 159.3 clipbox
72 159.344 m
72 272.656 l
stroke
grestore
[] 0 setdash
gsave
/o {
gsave
newpath
translate
0.5 setlinewidth
1 setlinejoin
0 setlinecap
0 0 m
0 4 l
gsave
0.000 setgray
fill
grestore
stroke
grestore
} bind def
72 159.344 o
grestore
gsave
/o {
gsave
newpath
translate
0.5 setlinewidth
1 setlinejoin
0 setlinecap
0 0 m
0 -4 l
gsave
0.000 setgray
fill
grestore
stroke
grestore
} bind def
72 272.656 o
grestore
[1 3] 0 setdash
gsave
446.4 113.3 72 159.3 clipbox
146.4 159.344 m
146.4 272.656 l
stroke
grestore
[] 0 setdash
gsave
/o {
gsave
newpath
translate
0.5 setlinewidth
1 setlinejoin
0 setlinecap
0 0 m
0 4 l
gsave
0.000 setgray
fill
grestore
stroke
grestore
} bind def
146.4 159.344 o
grestore
gsave
/o {
gsave
newpath
translate
0.5 setlinewidth
1 setlinejoin
0 setlinecap
0 0 m
0 -4 l
gsave
0.000 setgray
fill
grestore
stroke
grestore
} bind def
146.4 272.656 o
grestore
[1 3] 0 setdash
gsave
446.4 113.3 72 159.3 clipbox
220.8 159.344 m
220.8 272.656 l
stroke
grestore
[] 0 setdash
gsave
/o {
gsave
newpath
translate
0.5 setlinewidth
1 setlinejoin
0 setlinecap
0 0 m
0 4 l
gsave
0.000 setgray
fill
grestore
stroke
grestore
} bind def
220.8 159.344 o
grestore
gsave
/o {
gsave
newpath
translate
0.5 setlinewidth
1 setlinejoin
0 setlinecap
0 0 m
0 -4 l
gsave
0.000 setgray
fill
grestore
stroke
grestore
} bind def
220.8 272.656 o
grestore
[1 3] 0 setdash
gsave
446.4 113.3 72 159.3 clipbox
295.2 159.344 m
295.2 272.656 l
stroke
grestore
[] 0 setdash
gsave
/o {
gsave
newpath
translate
0.5 setlinewidth
1 setlinejoin
0 setlinecap
0 0 m
0 4 l
gsave
0.000 setgray
fill
grestore
stroke
grestore
} bind def
295.2 159.344 o
grestore
gsave
/o {
gsave
newpath
translate
0.5 setlinewidth
1 setlinejoin
0 setlinecap
0 0 m
0 -4 l
gsave
0.000 setgray
fill
grestore
stroke
grestore
} bind def
295.2 272.656 o
grestore
[1 3] 0 setdash
gsave
446.4 113.3 72 159.3 clipbox
369.6 159.344 m
369.6 272.656 l
stroke
grestore
[] 0 setdash
gsave
/o {
gsave
newpath
translate
0.5 setlinewidth
1 setlinejoin
0 setlinecap
0 0 m
0 4 l
gsave
0.000 setgray
fill
grestore
stroke
grestore
} bind def
369.6 159.344 o
grestore
gsave
/o {
gsave
newpath
translate
0.5 setlinewidth
1 setlinejoin
0 setlinecap
0 0 m
0 -4 l
gsave
0.000 setgray
fill
grestore
stroke
grestore
} bind def
369.6 272.656 o
grestore
[1 3] 0 setdash
gsave
446.4 113.3 72 159.3 clipbox
444 159.344 m
444 272.656 l
stroke
grestore
[] 0 setdash
gsave
/o {
gsave
newpath
translate
0.5 setlinewidth
1 setlinejoin
0 setlinecap
0 0 m
0 4 l
gsave
0.000 setgray
fill
grestore
stroke
grestore
} bind def
444 159.344 o
grestore
gsave
/o {
gsave
newpath
translate
0.5 setlinewidth
1 setlinejoin
0 setlinecap
0 0 m
0 -4 l
gsave
0.000 setgray
fill
grestore
stroke
grestore
} bind def
444 272.656 o
grestore
[1 3] 0 setdash
gsave
446.4 113.3 72 159.3 clipbox
518.4 159.344 m
518.4 272.656 l
stroke
grestore
[] 0 setdash
gsave
/o {
gsave
newpath
translate
0.5 setlinewidth
1 setlinejoin
0 setlinecap
0 0 m
0 4 l
gsave
0.000 setgray
fill
grestore
stroke
grestore
} bind def
518.4 159.344 o
grestore
gsave
/o {
gsave
newpath
translate
0.5 setlinewidth
1 setlinejoin
0 setlinecap
0 0 m
0 -4 l
gsave
0.000 setgray
fill
grestore
stroke
grestore
} bind def
518.4 272.656 o
grestore
[1 3] 0 setdash
gsave
446.4 113.3 72 159.3 clipbox
72 159.344 m
518.4 159.344 l
stroke
grestore
[] 0 setdash
gsave
/o {
gsave
newpath
translate
0.5 setlinewidth
1 setlinejoin
0 setlinecap
0 0 m
4 0 l
gsave
0.000 setgray
fill
grestore
stroke
grestore
} bind def
72 159.344 o
grestore
gsave
/o {
gsave
newpath
translate
0.5 setlinewidth
1 setlinejoin
0 setlinecap
0 0 m
-4 0 l
gsave
0.000 setgray
fill
grestore
stroke
grestore
} bind def
518.4 159.344 o
grestore
/DejaVuSans findfont
12.000 scalefont
setfont
gsave
61.953125 156.031762 translate
0.000000 rotate
0.000000 0.000000 m /zero glyphshow
grestore
[1 3] 0 setdash
gsave
446.4 113.3 72 159.3 clipbox
72 182.007 m
518.4 182.007 l
stroke
grestore
[] 0 setdash
gsave
/o {
gsave
newpath
translate
0.5 setlinewidth
1 setlinejoin
0 setlinecap
0 0 m
4 0 l
gsave
0.000 setgray
fill
grestore
stroke
grestore
} bind def
72 182.007 o
grestore
gsave
/o {
gsave
newpath
translate
0.5 setlinewidth
1 setlinejoin
0 setlinecap
0 0 m
-4 0 l
gsave
0.000 setgray
fill
grestore
stroke
grestore
} bind def
518.4 182.007 o
grestore
gsave
54.390625 178.694057 translate
0.000000 rotate
0.000000 0.000000 m /two glyphshow
7.634766 0.000000 m /zero glyphshow
grestore
[1 3] 0 setdash
gsave
446.4 113.3 72 159.3 clipbox
72 204.669 m
518.4 204.669 l
stroke
grestore
[] 0 setdash
gsave
/o {
gsave
newpath
translate
0.5 setlinewidth
1 setlinejoin
0 setlinecap
0 0 m
4 0 l
gsave
0.000 setgray
fill
grestore
stroke
grestore
} bind def
72 204.669 o
grestore
gsave
/o {
gsave
newpath
translate
0.5 setlinewidth
1 setlinejoin
0 setlinecap
0 0 m
-4 0 l
gsave
0.000 setgray
fill
grestore
stroke
grestore
} bind def
518.4 204.669 o
grestore
gsave
54.109375 201.356352 translate
0.000000 rotate
0.000000 0.000000 m /four glyphshow
7.634766 0.000000 m /zero glyphshow
grestore
[1 3] 0 setdash
gsave
446.4 113.3 72 159.3 clipbox
72 227.331 m
518.4 227.331 l
stroke
grestore
[] 0 setdash
gsave
/o {
gsave
newpath
translate
0.5 setlinewidth
1 setlinejoin
0 setlinecap
0 0 m
4 0 l
gsave
0.000 setgray
fill
grestore
stroke
grestore
} bind def
72 227.331 o
grestore
gsave
/o {
gsave
newpath
translate
0.5 setlinewidth
1 setlinejoin
0 setlinecap
0 0 m
-4 0 l
gsave
0.000 setgray
fill
grestore
stroke
grestore
} bind def
518.4 227.331 o
grestore
gsave
54.359375 224.018648 translate
0.000000 rotate
0.000000 0.000000 m /six glyphshow
7.634766 0.000000 m /zero glyphshow
grestore
[1 3] 0 setdash
gsave
446.4 113.3 72 159.3 clipbox
72 249.993 m
518.4 249.993 l
stroke
grestore
[] 0 setdash
gsave
/o {
gsave
newpath
translate
0.5 setlinewidth
1 setlinejoin
0 setlinecap
0 0 m
4 0 l
gsave
0.000 setgray
fill
grestore
stroke
grestore
} bind def
72 249.993 o
grestore
gsave
/o {
gsave
newpath
translate
0.5 setlinewidth
1 setlinejoin
0 setlinecap
0 0 m
-4 0 l
gsave
0.000 setgray
fill
grestore
stroke
grestore
} bind def
518.4 249.993 o
grestore
gsave
54.328125 246.680943 translate
0.000000 rotate
0.000000 0.000000 m /eight glyphshow
7.634766 0.000000 m /zero glyphshow
grestore
gsave
46.109375 161.500000 translate
90.000000 rotate
/DejaVuSans findfont
12.0 scalefont
setfont
0.000000 0.875000 moveto
/I glyphshow

3.539062 0.875000 moveto
/n glyphshow

11.144531 0.875000 moveto
/t glyphshow

15.849609 0.875000 moveto
/e glyphshow

23.232422 0.875000 moveto
/n glyphshow

30.837891 0.875000 moveto
/s glyphshow

37.089844 0.875000 moveto
/i glyphshow

40.423828 0.875000 moveto
/t glyphshow

45.128906 0.875000 moveto
/y glyphshow

52.230469 0.875000 moveto
/space glyphshow

56.044922 0.875000 moveto
/parenleft glyphshow

/Cmmi10 findfont
12.0 scalefont
setfont
60.726562 0.875000 moveto
/k glyphshow

66.966797 0.875000 moveto
/m glyphshow

77.501953 0.875000 moveto
/slash glyphshow

83.501953 0.875000 moveto
/m glyphshow

94.037109 0.875000 moveto
/o glyphshow

99.843750 0.875000 moveto
/l glyphshow

/DejaVuSans findfont
12.0 scalefont
setfont
103.417969 0.875000 moveto
/parenright glyphshow


grestore
1.000 setlinewidth
gsave
72 272.656 m
518.4 272.656 l
stroke
grestore
gsave
518.4 159.344 m
518.4 272.656 l
stroke
grestore
gsave
72 159.344 m
518.4 159.344 l
stroke
grestore
gsave
72 159.344 m
72 272.656 l
stroke
grestore
/DejaVuSans findfont
14.400 scalefont
setfont
gsave
86.880000 227.331148 translate
0.000000 rotate
0.000000 0.000000 m /T glyphshow
7.915359 0.000000 m /C glyphshow
grestore
gsave
72 43.2 m
518.4 43.2 l
518.4 156.511 l
72 156.511 l
cl
1.000 setgray
fill
grestore
gsave
446.4 113.3 72 43.2 clipbox
378.248 52.1788 m
366.544 59.6405 l
371.747 62.0849 l
359.353 80.9702 l
359.354 80.9708 l
371.748 62.0856 l
376.951 64.53 l
cl
gsave
fill
grestore
stroke
grestore
2.200 setlinewidth
2 setlinecap
0.392 0.584 0.929 setrgbcolor
gsave
446.4 113.3 72 43.2 clipbox
70.512 43.2 m
146.4 43.2723 l
149.376 43.5204 l
150.864 43.8736 l
152.352 44.5611 l
153.84 45.8204 l
155.328 47.9896 l
156.816 51.4974 l
158.304 56.8127 l
159.792 64.341 l
161.28 74.2724 l
162.768 86.4147 l
167.232 126.6 l
168.72 136.144 l
170.208 141.198 l
171.696 140.959 l
173.184 135.467 l
174.672 125.597 l
176.16 112.834 l
179.136 85.4084 l
180.624 73.5436 l
182.112 63.9764 l
183.6 56.8746 l
185.088 52.035 l
186.576 49.0452 l
188.064 47.4252 l
189.552 46.7223 l
191.04 46.5588 l
195.504 46.8195 l
196.992 46.7123 l
198.48 46.4423 l
201.456 45.5543 l
204.432 44.5781 l
207.408 43.8612 l
210.384 43.4848 l
213.36 43.3489 l
225.264 43.2967 l
249.072 43.2001 l
289.248 43.2767 l
292.224 43.4512 l
295.2 43.8877 l
296.688 44.2733 l
298.176 44.82 l
299.664 45.5752 l
301.152 46.5942 l
302.64 47.9379 l
304.128 49.6619 l
305.616 51.7977 l
307.104 54.3258 l
311.568 62.829 l
313.056 65.0812 l
314.544 66.5194 l
316.032 66.916 l
317.52 66.1866 l
319.008 64.4149 l
320.496 61.8336 l
324.96 52.5572 l
326.448 49.9291 l
327.936 47.8031 l
329.424 46.1952 l
330.912 45.054 l
332.4 44.2916 l
333.888 43.8114 l
335.376 43.5257 l
338.352 43.2796 l
344.304 43.2066 l
357.696 43.3287 l
366.624 43.3066 l
377.04 43.243 l
382.992 43.42 l
391.92 43.8763 l
396.384 43.7989 l
406.8 43.3889 l
409.776 43.5208 l
412.752 43.9803 l
414.24 44.3988 l
415.728 44.9818 l
417.216 45.763 l
418.704 46.7936 l
420.192 48.1666 l
421.68 50.051 l
423.168 52.7249 l
424.656 56.5879 l
426.144 62.1263 l
427.632 69.8139 l
429.12 79.9461 l
430.608 92.4423 l
435.072 135.021 l
436.56 145.553 l
438.048 151.397 l
439.536 151.561 l
441.024 145.96 l
442.512 135.439 l
444 121.554 l
446.976 91.0994 l
448.464 77.6669 l
449.952 66.6649 l
451.44 58.3141 l
452.928 52.4109 l
454.416 48.5114 l
455.904 46.0984 l
457.392 44.6972 l
458.88 43.9325 l
460.368 43.5398 l
463.344 43.2631 l
469.296 43.2017 l
482.688 43.252 l
485.664 43.4166 l
487.152 43.6069 l
488.64 43.9231 l
490.128 44.4156 l
491.616 45.1336 l
493.104 46.1099 l
494.592 47.3431 l
500.544 52.9828 l
502.032 53.7582 l
503.52 53.9808 l
505.008 53.6147 l
506.496 52.7187 l
507.984 51.4307 l
512.448 47.0162 l
513.936 45.8439 l
515.424 44.9331 l
516.912 44.2751 l
518.4 43.8314 l
519.888 43.5515 l
519.888 43.5515 l
stroke
grestore
2.700 setlinewidth
0 setlinecap
[6 6] 0 setdash
1.000 0.000 0.000 setrgbcolor
gsave
446.4 113.3 72 43.2 clipbox
70.512 43.2 m
146.4 43.2661 l
149.376 43.493 l
150.864 43.8165 l
152.352 44.4472 l
153.84 45.6046 l
155.328 47.6029 l
156.816 50.8441 l
158.304 55.7747 l
159.792 62.7931 l
161.28 72.1125 l
162.768 83.6063 l
167.232 122.883 l
168.72 132.927 l
170.208 138.993 l
171.696 140.199 l
173.184 136.402 l
174.672 128.225 l
176.16 116.894 l
180.624 78.8577 l
182.112 68.731 l
183.6 60.8041 l
185.088 55.0427 l
186.576 51.1705 l
188.064 48.7941 l
189.552 47.4981 l
191.04 46.9049 l
192.528 46.7042 l
196.992 46.5029 l
199.968 45.941 l
205.92 44.5176 l
208.896 44.114 l
213.36 43.7895 l
222.288 43.3853 l
231.216 43.2438 l
252.048 43.2011 l
272.88 43.2978 l
277.344 43.5243 l
284.784 44.0137 l
289.248 43.9853 l
293.712 43.9718 l
295.2 44.1064 l
296.688 44.3696 l
298.176 44.7993 l
299.664 45.4375 l
301.152 46.3316 l
302.64 47.5329 l
304.128 49.0884 l
305.616 51.0236 l
307.104 53.3187 l
311.568 61.0472 l
313.056 63.0951 l
314.544 64.4031 l
316.032 64.7643 l
317.52 64.102 l
319.008 62.492 l
320.496 60.1458 l
324.96 51.7126 l
326.448 49.3229 l
327.936 47.3894 l
329.424 45.927 l
330.912 44.8889 l
332.4 44.1956 l
333.888 43.759 l
335.376 43.4998 l
338.352 43.279 l
344.304 43.2299 l
365.136 43.445 l
368.112 43.6975 l
369.6 43.9916 l
371.088 44.462 l
372.576 45.1552 l
374.064 46.1004 l
375.552 47.2925 l
381.504 52.6998 l
382.992 53.4453 l
384.48 53.6746 l
385.968 53.3588 l
387.456 52.5544 l
388.944 51.3883 l
393.408 47.3321 l
394.896 46.2234 l
396.384 45.3382 l
397.872 44.6729 l
399.36 44.1985 l
402.336 43.6638 l
405.312 43.4586 l
408.288 43.4535 l
411.264 43.6846 l
412.752 43.9353 l
414.24 44.3095 l
415.728 44.834 l
417.216 45.5399 l
418.704 46.4737 l
420.192 47.7198 l
421.68 49.4318 l
423.168 51.8621 l
424.656 55.3739 l
426.144 60.409 l
427.632 67.3981 l
429.12 76.6094 l
430.608 87.9697 l
435.072 126.677 l
436.56 136.251 l
438.048 141.563 l
439.536 141.711 l
441.024 136.619 l
442.512 127.055 l
444 114.432 l
446.976 86.7452 l
448.464 74.5339 l
449.952 64.5322 l
451.44 56.9408 l
452.928 51.575 l
454.416 48.0315 l
455.904 45.8412 l
457.392 44.574 l
458.88 43.8912 l
460.368 43.5561 l
461.856 43.4196 l
464.832 43.4443 l
469.296 43.8329 l
473.76 44.2977 l
476.736 44.405 l
479.712 44.2675 l
485.664 43.8188 l
487.152 43.8619 l
488.64 44.0485 l
490.128 44.4236 l
491.616 45.0273 l
493.104 45.8839 l
494.592 46.9867 l
500.544 52.0944 l
502.032 52.7988 l
503.52 53.0009 l
505.008 52.668 l
506.496 51.8534 l
507.984 50.6826 l
512.448 46.6699 l
513.936 45.6044 l
515.424 44.7767 l
516.912 44.1789 l
518.4 43.7758 l
519.888 43.5217 l
519.888 43.5217 l
stroke
grestore
0.500 setlinewidth
[1 3] 0 setdash
0.000 setgray
gsave
446.4 113.3 72 43.2 clipbox
72 43.2 m
72 156.511 l
stroke
grestore
[] 0 setdash
gsave
/o {
gsave
newpath
translate
0.5 setlinewidth
1 setlinejoin
0 setlinecap
0 0 m
0 4 l
gsave
0.000 setgray
fill
grestore
stroke
grestore
} bind def
72 43.2 o
grestore
gsave
/o {
gsave
newpath
translate
0.5 setlinewidth
1 setlinejoin
0 setlinecap
0 0 m
0 -4 l
gsave
0.000 setgray
fill
grestore
stroke
grestore
} bind def
72 156.511 o
grestore
/DejaVuSans findfont
12.000 scalefont
setfont
gsave
61.359375 30.075000 translate
0.000000 rotate
0.000000 0.000000 m /six glyphshow
7.634766 0.000000 m /five glyphshow
15.269531 0.000000 m /zero glyphshow
grestore
[1 3] 0 setdash
gsave
446.4 113.3 72 43.2 clipbox
146.4 43.2 m
146.4 156.511 l
stroke
grestore
[] 0 setdash
gsave
/o {
gsave
newpath
translate
0.5 setlinewidth
1 setlinejoin
0 setlinecap
0 0 m
0 4 l
gsave
0.000 setgray
fill
grestore
stroke
grestore
} bind def
146.4 43.2 o
grestore
gsave
/o {
gsave
newpath
translate
0.5 setlinewidth
1 setlinejoin
0 setlinecap
0 0 m
0 -4 l
gsave
0.000 setgray
fill
grestore
stroke
grestore
} bind def
146.4 156.511 o
grestore
gsave
135.829687 30.075000 translate
0.000000 rotate
0.000000 0.000000 m /seven glyphshow
7.634766 0.000000 m /zero glyphshow
15.269531 0.000000 m /zero glyphshow
grestore
[1 3] 0 setdash
gsave
446.4 113.3 72 43.2 clipbox
220.8 43.2 m
220.8 156.511 l
stroke
grestore
[] 0 setdash
gsave
/o {
gsave
newpath
translate
0.5 setlinewidth
1 setlinejoin
0 setlinecap
0 0 m
0 4 l
gsave
0.000 setgray
fill
grestore
stroke
grestore
} bind def
220.8 43.2 o
grestore
gsave
/o {
gsave
newpath
translate
0.5 setlinewidth
1 setlinejoin
0 setlinecap
0 0 m
0 -4 l
gsave
0.000 setgray
fill
grestore
stroke
grestore
} bind def
220.8 156.511 o
grestore
gsave
210.229687 30.075000 translate
0.000000 rotate
0.000000 0.000000 m /seven glyphshow
7.634766 0.000000 m /five glyphshow
15.269531 0.000000 m /zero glyphshow
grestore
[1 3] 0 setdash
gsave
446.4 113.3 72 43.2 clipbox
295.2 43.2 m
295.2 156.511 l
stroke
grestore
[] 0 setdash
gsave
/o {
gsave
newpath
translate
0.5 setlinewidth
1 setlinejoin
0 setlinecap
0 0 m
0 4 l
gsave
0.000 setgray
fill
grestore
stroke
grestore
} bind def
295.2 43.2 o
grestore
gsave
/o {
gsave
newpath
translate
0.5 setlinewidth
1 setlinejoin
0 setlinecap
0 0 m
0 -4 l
gsave
0.000 setgray
fill
grestore
stroke
grestore
} bind def
295.2 156.511 o
grestore
gsave
284.543750 30.075000 translate
0.000000 rotate
0.000000 0.000000 m /eight glyphshow
7.634766 0.000000 m /zero glyphshow
15.269531 0.000000 m /zero glyphshow
grestore
[1 3] 0 setdash
gsave
446.4 113.3 72 43.2 clipbox
369.6 43.2 m
369.6 156.511 l
stroke
grestore
[] 0 setdash
gsave
/o {
gsave
newpath
translate
0.5 setlinewidth
1 setlinejoin
0 setlinecap
0 0 m
0 4 l
gsave
0.000 setgray
fill
grestore
stroke
grestore
} bind def
369.6 43.2 o
grestore
gsave
/o {
gsave
newpath
translate
0.5 setlinewidth
1 setlinejoin
0 setlinecap
0 0 m
0 -4 l
gsave
0.000 setgray
fill
grestore
stroke
grestore
} bind def
369.6 156.511 o
grestore
gsave
358.943750 30.075000 translate
0.000000 rotate
0.000000 0.000000 m /eight glyphshow
7.634766 0.000000 m /five glyphshow
15.269531 0.000000 m /zero glyphshow
grestore
[1 3] 0 setdash
gsave
446.4 113.3 72 43.2 clipbox
444 43.2 m
444 156.511 l
stroke
grestore
[] 0 setdash
gsave
/o {
gsave
newpath
translate
0.5 setlinewidth
1 setlinejoin
0 setlinecap
0 0 m
0 4 l
gsave
0.000 setgray
fill
grestore
stroke
grestore
} bind def
444 43.2 o
grestore
gsave
/o {
gsave
newpath
translate
0.5 setlinewidth
1 setlinejoin
0 setlinecap
0 0 m
0 -4 l
gsave
0.000 setgray
fill
grestore
stroke
grestore
} bind def
444 156.511 o
grestore
gsave
433.312500 30.075000 translate
0.000000 rotate
0.000000 0.000000 m /nine glyphshow
7.634766 0.000000 m /zero glyphshow
15.269531 0.000000 m /zero glyphshow
grestore
[1 3] 0 setdash
gsave
446.4 113.3 72 43.2 clipbox
518.4 43.2 m
518.4 156.511 l
stroke
grestore
[] 0 setdash
gsave
/o {
gsave
newpath
translate
0.5 setlinewidth
1 setlinejoin
0 setlinecap
0 0 m
0 4 l
gsave
0.000 setgray
fill
grestore
stroke
grestore
} bind def
518.4 43.2 o
grestore
gsave
/o {
gsave
newpath
translate
0.5 setlinewidth
1 setlinejoin
0 setlinecap
0 0 m
0 -4 l
gsave
0.000 setgray
fill
grestore
stroke
grestore
} bind def
518.4 156.511 o
grestore
gsave
507.712500 30.075000 translate
0.000000 rotate
0.000000 0.000000 m /nine glyphshow
7.634766 0.000000 m /five glyphshow
15.269531 0.000000 m /zero glyphshow
grestore
gsave
246.200000 11.575000 translate
0.000000 rotate
/DejaVuSans findfont
12.0 scalefont
setfont
0.000000 0.298125 moveto
/f glyphshow

4.224609 0.298125 moveto
/r glyphshow

9.158203 0.298125 moveto
/e glyphshow

16.541016 0.298125 moveto
/q glyphshow

24.158203 0.298125 moveto
/u glyphshow

31.763672 0.298125 moveto
/e glyphshow

39.146484 0.298125 moveto
/n glyphshow

46.751953 0.298125 moveto
/c glyphshow

53.349609 0.298125 moveto
/y glyphshow

60.451172 0.298125 moveto
/space glyphshow

64.265625 0.298125 moveto
/parenleft glyphshow

/Cmmi10 findfont
12.0 scalefont
setfont
68.947266 0.298125 moveto
/c glyphshow

74.132812 0.298125 moveto
/m glyphshow

/Cmr10 findfont
8.4 scalefont
setfont
84.667969 5.400000 moveto
/one glyphshow

/DejaVuSans findfont
12.0 scalefont
setfont
92.708719 0.298125 moveto
/parenright glyphshow


grestore
[1 3] 0 setdash
gsave
446.4 113.3 72 43.2 clipbox
72 43.2 m
518.4 43.2 l
stroke
grestore
[] 0 setdash
gsave
/o {
gsave
newpath
translate
0.5 setlinewidth
1 setlinejoin
0 setlinecap
0 0 m
4 0 l
gsave
0.000 setgray
fill
grestore
stroke
grestore
} bind def
72 43.2 o
grestore
gsave
/o {
gsave
newpath
translate
0.5 setlinewidth
1 setlinejoin
0 setlinecap
0 0 m
-4 0 l
gsave
0.000 setgray
fill
grestore
stroke
grestore
} bind def
518.4 43.2 o
grestore
gsave
61.953125 39.887500 translate
0.000000 rotate
0.000000 0.000000 m /zero glyphshow
grestore
[1 3] 0 setdash
gsave
446.4 113.3 72 43.2 clipbox
72 68.3803 m
518.4 68.3803 l
stroke
grestore
[] 0 setdash
gsave
/o {
gsave
newpath
translate
0.5 setlinewidth
1 setlinejoin
0 setlinecap
0 0 m
4 0 l
gsave
0.000 setgray
fill
grestore
stroke
grestore
} bind def
72 68.3803 o
grestore
gsave
/o {
gsave
newpath
translate
0.5 setlinewidth
1 setlinejoin
0 setlinecap
0 0 m
-4 0 l
gsave
0.000 setgray
fill
grestore
stroke
grestore
} bind def
518.4 68.3803 o
grestore
gsave
54.390625 65.067828 translate
0.000000 rotate
0.000000 0.000000 m /two glyphshow
7.634766 0.000000 m /zero glyphshow
grestore
[1 3] 0 setdash
gsave
446.4 113.3 72 43.2 clipbox
72 93.5607 m
518.4 93.5607 l
stroke
grestore
[] 0 setdash
gsave
/o {
gsave
newpath
translate
0.5 setlinewidth
1 setlinejoin
0 setlinecap
0 0 m
4 0 l
gsave
0.000 setgray
fill
grestore
stroke
grestore
} bind def
72 93.5607 o
grestore
gsave
/o {
gsave
newpath
translate
0.5 setlinewidth
1 setlinejoin
0 setlinecap
0 0 m
-4 0 l
gsave
0.000 setgray
fill
grestore
stroke
grestore
} bind def
518.4 93.5607 o
grestore
gsave
54.109375 90.248156 translate
0.000000 rotate
0.000000 0.000000 m /four glyphshow
7.634766 0.000000 m /zero glyphshow
grestore
[1 3] 0 setdash
gsave
446.4 113.3 72 43.2 clipbox
72 118.741 m
518.4 118.741 l
stroke
grestore
[] 0 setdash
gsave
/o {
gsave
newpath
translate
0.5 setlinewidth
1 setlinejoin
0 setlinecap
0 0 m
4 0 l
gsave
0.000 setgray
fill
grestore
stroke
grestore
} bind def
72 118.741 o
grestore
gsave
/o {
gsave
newpath
translate
0.5 setlinewidth
1 setlinejoin
0 setlinecap
0 0 m
-4 0 l
gsave
0.000 setgray
fill
grestore
stroke
grestore
} bind def
518.4 118.741 o
grestore
gsave
54.359375 115.428484 translate
0.000000 rotate
0.000000 0.000000 m /six glyphshow
7.634766 0.000000 m /zero glyphshow
grestore
[1 3] 0 setdash
gsave
446.4 113.3 72 43.2 clipbox
72 143.921 m
518.4 143.921 l
stroke
grestore
[] 0 setdash
gsave
/o {
gsave
newpath
translate
0.5 setlinewidth
1 setlinejoin
0 setlinecap
0 0 m
4 0 l
gsave
0.000 setgray
fill
grestore
stroke
grestore
} bind def
72 143.921 o
grestore
gsave
/o {
gsave
newpath
translate
0.5 setlinewidth
1 setlinejoin
0 setlinecap
0 0 m
-4 0 l
gsave
0.000 setgray
fill
grestore
stroke
grestore
} bind def
518.4 143.921 o
grestore
gsave
54.328125 140.608811 translate
0.000000 rotate
0.000000 0.000000 m /eight glyphshow
7.634766 0.000000 m /zero glyphshow
grestore
1.000 setlinewidth
gsave
72 156.511 m
518.4 156.511 l
stroke
grestore
gsave
518.4 43.2 m
518.4 156.511 l
stroke
grestore
gsave
72 43.2 m
518.4 43.2 l
stroke
grestore
gsave
72 43.2 m
72 156.511 l
stroke
grestore
/DejaVuSans findfont
14.400 scalefont
setfont
gsave
86.880000 118.740984 translate
0.000000 rotate
0.000000 0.000000 m /P glyphshow
8.677933 0.000000 m /C glyphshow
grestore

end
showpage
