%!PS-Adobe-3.0 EPSF-3.0
%%BoundingBox: 0 0 99 117
%%HiResBoundingBox: 0 0 98.604 116.2169
%%Title: ufcd-logo-e1-left-dl-color
%%CreationDate: 2009-12-08T12:58+0100
%%Creator: Project ufcd
%%LanguageLevel: 2
%%DocumentData: Clean7Bit
%%Pages: 1
%%EndComments
%%Page: 1 1
save
0 0 98.604 116.2169 rectclip
9 dict begin
/k{setcmykcolor}bind def
/p{closepath}bind def
/c{curveto}bind def
/f{fill}bind def
/l{lineto}bind def
/m{moveto}bind def
/s{setoverprint}bind def
/np{newpath}bind def
/clp{clip np}bind def
gsave
np
gsave
-5.166 119.4179 m
-5.166 .0089 l
98.596 .0089 l
98.596 119.4179 l
p
clp
gsave
-5.166 .0059 m
98.595 .0059 l
98.595 119.4179 l
-5.166 119.4179 l
-5.166 .0059 l
clp
gsave
-5.166 39.1739 m
45.468 39.1739 l
45.468 119.4179 l
-5.166 119.4179 l
-5.166 39.1739 l
clp
46.2139 116.2548 m
61.2549 116.9101 73.2852 110.9438 81.169 103.309 c
89.2305 95.5019 95.404 84.9609 96.273 70.4042 c
96.736 62.624 95.08 55.787 92.7129 50.0126 c
90.3379 44.2206 87.2051 39.2275 83.3262 35.2333 c
75.2832 26.9501 65.1797 20.7265 50.2051 20.1288 c
35.3506 19.5351 23.3277 25.3163 15.251 33.0751 c
11.086 37.0761 7.8076 41.5185 5.002 46.9931 c
2.273 52.3154 .2808 58.6845 .0386 66.0878 c
-0.4653 81.5151 5.2798 92.8979 12.877 101.1508 c
18.5718 107.3388 26.0249 111.916 35.5327 114.7451 c
38.8379 115.728 42.416 116.0888 46.2139 116.2548 c
13.0928 100.3959 m
9.3799 96.3827 6.0357 91.5829 3.815 85.9399 c
3.2676 84.5497 2.9238 82.9667 2.4116 81.4081 c
1.917 79.8969 1.4619 78.2241 1.2256 76.6611 c
-1.665 57.5468 5.4976 42.872 15.7896 33.3993 c
23.6846 26.1327 35.3189 19.8447 50.3145 20.6679 c
65.374 21.495 74.9658 27.6181 82.8945 35.664 c
84.8867 37.6855 86.6953 39.8837 88.1817 42.246 c
92.8262 49.623 96.141 58.6825 95.626 70.4042 c
95.308 77.6337 93.457 83.6152 90.7715 89.2841 c
89.4688 92.0297 88.1094 94.5107 86.3467 96.728 c
84.5918 98.936 82.8633 101.2128 80.7363 103.0927 c
72.4863 110.3872 61.2139 116.603 45.6738 115.6079 c
30.4746 114.6347 20.711 108.6288 13.0928 100.3959 c
false s
0.7 .45 0 0 k
f
63.3672 112.3715 m
53.8203 111.8496 43.8535 112.4673 33.4839 112.4795 c
42.1939 115.7485 54.7656 115.5273 63.3672 112.3715 c
f
33.1597 112.0478 m
20.9038 107.7621 12.231 99.891 6.728 88.852 c
6.8838 88.5409 7.3696 89.0878 7.5908 88.7441 c
7.5986 88.1782 7.9209 87.537 7.2666 87.4491 c
6.8218 87.58 7.1436 88.478 6.6196 88.5278 c
5.105 86.0878 4.1089 83.1279 3.3828 79.8979 c
4.1919 79.3388 5.4048 79.186 6.6196 79.0351 c
6.502 79.852 5.8428 80.1279 5.6489 80.8691 c
6.1299 81.2148 6.6787 81.4931 7.1587 81.8398 c
8.2886 81.2299 10.2027 80.873 11.6909 80.977 c
11.6558 80.0077 12.0767 79.1357 12.5537 78.3871 c
11.8897 77.8652 11.211 77.3559 10.5039 76.8769 c
8.8267 77.5741 6.6299 77.955 4.4619 77.8481 c
4.2598 78.5087 4.0698 79.1821 3.3828 79.3578 c
2.7549 78.4208 2.6177 77.0878 2.4116 75.9062 c
2.1958 74.664 1.9629 73.37 1.8726 72.1298 c
0.666 55.5507 7.3247 44.0458 15.0347 35.7724 c
15.9727 36.3808 16.8599 37.04 17.4077 38.038 c
17.1387 38.4872 16.0806 38.1493 15.4668 38.2538 c
15.4829 38.8456 15.478 39.4159 15.3589 39.872 c
16.918 40.6454 17.6778 41.5693 18.7027 42.8925 c
19.5127 42.7568 20.6797 42.8115 21.292 42.7851 c
21.3267 41.8847 21.6148 41.2382 21.832 40.5195 c
20.065 39.0136 18.1699 37.6357 17.1929 35.3408 c
16.7388 35.5702 16.23 35.745 15.4668 35.664 c
15.8179 34.5204 16.9707 33.8408 17.8399 33.0751 c
24.1069 27.5497 32.7588 23.62 42.9766 21.9628 c
31.71 23.0322 22.9536 28.0283 16.0059 34.2616 c
10.8848 38.8574 6.9356 45.1777 4.2456 52.1708 c
3.229 54.8154 2.354 57.87 1.8726 60.8017 c
-0.2641 73.8183 4.0098 85.2299 8.4536 93.1669 c
12.8086 98.8681 17.5777 104.9057 24.4209 108.5951 c
25.4898 109.1708 26.77 109.708 27.981 110.3208 c
29.688 111.186 30.8189 112.0849 33.1597 112.0478 c
6.6196 80.1127 m
6.7139 78.1938 10.7837 77.8329 11.4746 79.3578 c
10.2529 79.9228 8.1279 80.5297 6.6196 80.1127 c
16.7608 39.1171 m
16.7178 38.4628 17.46 38.5917 17.9478 38.4697 c
18.7588 39.2411 19.544 40.037 20.3208 40.8427 c
20.3057 41.3671 20.1509 41.7519 19.9976 42.1376 c
18.6226 41.4267 17.8037 40.1591 16.7608 39.1171 c
f
35.6411 112.0478 m
43.8482 111.58 54.3789 112.103 61.5332 111.6162 c
61.0957 110.8261 59.9014 111.185 59.1602 111.185 c
50.8457 111.185 44.897 110.9409 36.9351 111.292 c
36.4644 111.313 35.3941 111.1631 35.209 111.832 c
35.3692 111.8881 35.481 111.9922 35.6411 112.0478 c
f
36.6118 110.8608 m
36.9351 110.8608 l
37.1358 108.2358 37.2808 105.9135 37.043 102.9848 c
36.3198 103.0805 36.5298 104.2695 36.5039 104.9267 c
36.4351 106.6464 36.5562 108.8715 36.5039 110.5376 c
36.4741 110.7119 36.606 110.7226 36.6118 110.8608 c
f
44.0557 110.7534 m
44.4097 108.7324 44.4136 105.1181 44.0557 102.9853 c
43.3267 103.0453 43.6299 104.1074 43.625 104.6034 c
43.606 106.35 43.6387 108.6655 43.625 110.4292 c
43.625 110.7534 l
44.0557 110.7534 l
p
f
48.8028 110.7534 m
48.6592 109.0981 51.5567 109.748 51.7168 108.0561 c
51.5137 107.7504 50.874 107.4433 50.4219 107.7324 c
50.4766 108.309 50.9805 108.0195 51.2842 108.164 c
50.0664 109.0214 46.9883 109.0414 45.7822 108.164 c
45.7051 107.87 46.291 108.2411 46.2144 107.9482 c
46.1231 107.4164 45.5332 107.9882 45.2422 107.9482 c
45.4683 109.268 46.9024 109.3813 48.0469 109.7822 c
48.0772 110.1704 47.8477 110.3022 47.832 110.6455 c
48.0117 110.8252 48.4649 110.7304 48.8028 110.7534 c
f
43.085 110.5371 m
43.5361 108.3115 43.1748 105.9491 43.2998 103.0932 c
42.7988 105.1454 43.2271 108.1264 43.085 110.5371 c
f
44.5957 110.5371 m
44.7207 110.5542 44.7876 110.5131 44.8115 110.4292 c
44.6445 107.6044 45.0127 105.9194 44.4878 103.308 c
44.6724 105.7934 44.4224 108.1025 44.5957 110.5371 c
f
29.4912 109.8901 m
29.4561 109.3198 29.1592 108.5361 28.521 108.9189 c
28.688 109.3569 28.8833 110.2422 29.4912 109.8901 c
f
35.4253 108.7031 m
34.9444 108.1772 34.5845 107.5302 34.2383 106.8691 c
34.3154 107.3325 34.4141 107.7714 34.6704 108.0561 c
34.3574 108.5341 33.7954 108.7631 33.2671 109.0263 c
33.2344 107.4775 33.9751 105.7831 34.4541 104.3881 c
34.7075 104.3534 34.8594 104.2172 35.2095 104.2802 c
35.1592 103.7182 34.8071 103.4604 34.6704 102.9853 c
34.2505 103.2494 33.7632 103.4443 33.2671 103.6323 c
33.4624 105.2011 32.5664 106.5942 32.1885 107.9482 c
32.5752 108.6044 32.9444 109.2783 33.2671 109.997 c
34.2383 109.8173 34.8125 109.2402 35.4253 108.7031 c
f
42.6538 108.164 m
42.3701 107.912 42.2442 108.4726 41.8989 108.4867 c
40.833 108.6127 39.7178 108.6318 38.7691 108.3788 c
38.3662 108.395 38.3018 107.7148 38.0152 107.9477 c
38.336 109.8598 42.27 110.3637 42.6538 108.164 c
f
38.5542 107.9477 m
38.9268 108.0229 38.9409 107.5698 38.7691 107.4086 c
38.396 107.3329 38.3828 107.787 38.5542 107.9477 c
f
28.4126 106.8691 m
29.1206 104.7861 31.6275 103.0009 30.0313 100.5043 c
29.2603 100.56 28.6333 100.7602 27.7656 100.7201 c
26.9946 101.8549 26.3877 103.1542 25.3916 104.0639 c
25.4385 104.8442 25.6924 105.4169 25.7153 106.2221 c
25.5425 106.624 24.9893 106.6459 24.4204 106.6533 c
24.3853 107.1562 24.5044 107.5043 24.6367 107.8403 c
25.9126 107.5341 27.1685 107.207 28.4126 106.8691 c
26.2544 106.0063 m
26.9507 104.2201 27.7666 102.5551 29.1685 101.475 c
29.3667 103.1572 27.9175 106.204 26.2544 106.0063 c
f
34.2383 106.7612 m
34.6226 106.6049 34.3784 105.8222 34.6694 105.5741 c
35.0874 105.455 35.0537 105.956 35.3174 105.6821 c
35.2617 105.5219 35.1577 105.4111 35.1016 105.2499 c
34.4463 105.37 34.0303 106.1181 34.2383 106.7612 c
f
38.23 105.5746 m
39.3179 105.2245 39.8989 104.3676 40.065 103.0932 c
39.4361 103.6874 39.228 104.7026 38.1221 104.8193 c
38.1231 105.1064 38.0811 105.4355 38.23 105.5746 c
f
42.5454 105.3583 m
42.2544 104.4633 41.2515 104.2797 41.0347 103.3085 c
40.9126 104.1874 41.5147 105.2734 42.5454 105.3583 c
f
47.6162 102.9848 m
47.4595 102.8178 47.0635 102.8901 46.7534 102.8769 c
46.5025 103.1298 46.4653 103.5971 46.1055 103.7402 c
46.0884 103.4072 46.3613 103.1298 46.1055 102.8769 c
45.7554 102.8149 45.6045 102.9511 45.3506 102.9848 c
45.0264 104.0712 45.5474 105.0341 46.4292 105.2499 c
46.5972 104.268 47.6724 104.1918 47.6162 102.9848 c
f
23.9893 104.2797 m
24.6406 102.7377 25.4634 101.3657 26.4702 100.1796 c
26.8775 100.0888 26.9776 100.5385 27.2266 100.2875 c
27.1045 99.6908 27.4365 99.1225 27.2266 98.7778 c
26.5186 98.7538 26.1104 99.0287 25.5005 99.1015 c
25.2505 98.7387 25.4614 97.9169 25.3916 97.3759 c
24.5625 97.3007 24.0645 97.5575 23.2344 97.4838 c
22.7554 99.0185 21.5293 99.8066 20.6445 100.9345 c
20.3042 100.9877 20.2632 100.7407 19.8892 100.8276 c
19.9175 101.4477 19.8086 102.2026 19.9976 102.6606 c
20.6426 102.6596 20.9414 102.3105 21.6162 102.3378 c
22.1143 100.8588 23.2984 100.0649 23.9893 98.7778 c
24.3853 98.8129 24.7285 98.4697 24.9605 98.6699 c
25.4243 100.7177 23.6543 101.4638 23.1265 102.8769 c
22.7964 102.9555 22.8096 102.6908 22.4785 102.77 c
22.4282 104.1015 22.7632 105.0116 23.9893 104.2797 c
f
42.5454 104.3876 m
42.5454 103.0927 l
42.3247 102.9257 41.5796 102.9257 41.3594 103.0927 c
41.5156 103.7636 41.8745 104.2319 42.5454 104.3876 c
f
38.23 104.2797 m
39.1201 104.3417 39.1831 103.5776 39.5249 103.0927 c
39.3399 102.8466 38.7022 103.0536 38.3379 102.9848 c
38.2432 103.3359 37.9849 103.9296 38.23 104.2797 c
f
47.4004 102.122 m
47.2505 101.5214 46.3916 101.8115 45.9986 101.7983 c
43.3335 101.7133 40.1553 101.7983 37.7984 101.9062 c
36.8486 101.9501 35.7246 101.6171 34.9937 102.2294 c
34.9756 102.4994 35.1597 102.5673 35.3174 102.6611 c
38.8955 102.433 42.3985 102.8632 46.3213 102.5532 c
46.6206 102.5302 47.4546 102.8032 47.4004 102.122 c
f
46.8613 100.6117 m
46.5781 99.5785 45.148 100.1513 44.3789 100.1806 c
40.7822 100.3134 36.4292 99.8237 32.5122 100.1806 c
32.3853 100.9404 32.8379 100.6205 33.1602 100.7197 c
34.6773 101.1855 37.4849 100.8276 39.9561 100.8276 c
42.5171 100.8276 45.0591 100.9965 46.8613 100.6117 c
f
17.3003 100.1801 m
18.1655 100.0741 18.7334 99.6713 19.7813 99.749 c
20.6255 98.579 21.1113 97.0512 22.9107 96.8364 c
23.0225 96.5312 23.1167 95.8261 22.9107 95.5409 c
22.5147 95.5063 21.9556 95.6332 21.7236 95.433 c
21.5117 95.142 21.6597 94.4902 21.6157 94.0302 c
19.7847 93.0292 19.3897 94.8251 18.1636 95.3251 c
18.1397 95.6733 18.3545 95.7822 18.2715 96.1879 c
17.6353 96.0439 16.9527 96.0522 16.4375 96.2963 c
15.4937 97.809 17.0274 98.8891 17.3003 100.1801 c
17.0845 96.9433 m
17.4453 96.79 18.1265 96.79 18.4873 96.9433 c
20.3535 99.1513 15.4414 99.87 17.0845 96.9433 c
18.7027 96.5121 m
19.4234 95.874 19.8726 94.412 21.2925 95.1093 c
21.2075 96.7499 20.0547 97.3251 19.2427 98.2382 c
19.0567 97.6689 18.9336 97.037 18.7027 96.5121 c
f
33.8067 99.6406 m
31.5957 97.5366 29.1289 95.6874 26.5786 93.9223 c
26.2988 93.6274 26.1406 93.2094 25.4995 93.2753 c
27.7949 95.6552 30.6685 97.4565 33.1597 99.6406 c
33.8067 99.6406 l
p
f
44.5957 94.3544 m
43.8716 94.8495 43.5698 95.6386 42.4375 95.8647 c
41.1655 96.1186 40.1377 95.7455 39.7407 96.7275 c
39.3438 97.7114 40.1245 98.6445 41.0347 98.7773 c
43.1636 99.0873 44.9077 96.8974 44.5957 94.3544 c
40.0645 97.4833 m
39.8838 95.8935 42.2256 96.5385 43.4087 95.9726 c
43.9956 95.6913 43.7525 95.2905 44.3794 95.3256 c
44.2598 96.5507 43.2505 97.9467 42.0054 97.0517 c
41.9126 97.2826 42.0396 97.6254 41.8985 98.0224 c
41.2437 98.5717 40.1514 98.2504 40.0645 97.4833 c
f
38.6616 98.1303 m
37.9194 96.79 41.2134 92.6723 38.3384 92.6283 c
35.8736 92.5912 36.5186 97.808 38.6616 98.1303 c
38.1226 94.7851 m
37.7144 94.7983 37.5425 94.5751 37.4746 94.246 c
37.4014 93.3993 38.1016 92.935 38.8775 93.2753 c
39.5923 94.8129 38.1616 95.8901 37.9063 97.1591 c
37.0337 96.5322 37.4473 95.2851 38.1226 94.7851 c
f
43.5171 92.5204 m
42.8418 91.2802 40.4707 90.4584 38.8779 91.4413 c
39.815 92.1225 40.7837 92.7724 41.0347 94.1386 c
42.0928 95.1576 44.0078 94.5702 43.5171 92.5204 c
42.9771 94.0302 m
40.9458 94.8246 40.8867 92.0126 39.5249 91.4413 c
40.2949 91.1952 41.5488 91.3432 41.791 91.9804 c
41.938 92.3544 41.3047 92.4892 41.6817 92.7363 c
42.1319 92.7905 42.1577 92.4203 42.6538 92.5204 c
43.1568 92.7743 43.3369 93.4824 42.9771 94.0302 c
f
9.7481 93.3837 m
9.9971 93.4169 9.8682 93.0717 10.0723 93.0595 c
9.9194 92.1738 8.8174 91.4965 9.5322 90.6855 c
9.9912 90.8388 10.2573 91.1845 10.6113 91.4408 c
12.1641 90.6728 13.8311 88.7289 15.7901 89.3915 c
16.1514 88.9618 16.4321 88.4506 16.6533 87.8818 c
15.8521 87.9267 15.3823 87.6406 14.8194 87.4487 c
13.3325 88.5878 11.7285 89.6088 9.5322 90.0385 c
9.3013 90.5629 9.0103 91.0278 8.6694 91.4408 c
8.8672 92.2509 9.5664 92.5585 9.7481 93.3837 c
f
28.3047 89.7158 m
20.6445 89.7158 l
20.5386 90.2934 21.6245 90.7704 22.2637 91.3334 c
22.9956 91.9784 23.5996 92.7616 24.3125 93.2758 c
25.8257 92.2704 26.9995 90.9277 28.3047 89.7158 c
f
27.981 89.0683 m
26.001 88.6381 22.8042 88.85 20.645 88.9604 c
22.1211 89.5444 25.7778 89.3803 27.981 89.0683 c
f
14.3872 86.9101 m
14.8013 86.5322 15.1231 86.0644 15.2505 85.3993 c
14.6631 85.268 13.9815 85.2304 13.6323 84.8603 c
12.3091 85.4804 11.1362 87.0302 9.3174 86.4794 c
9.0913 87.08 8.6143 87.4311 8.5615 88.204 c
9.0601 88.2812 9.4942 88.4223 9.8565 88.6362 c
10.9063 87.6362 12.2031 86.8842 13.7403 86.37 c
14.1172 86.3891 14.2832 86.6191 14.3872 86.9101 c
f
27.2261 88.4203 m
27.1904 86.7665 27.417 85.3754 27.334 83.6733 c
26.7451 83.5566 25.6392 83.4584 25.0684 83.6733 c
25.0752 85.2983 24.8833 86.7255 24.96 88.4203 c
25.6992 88.6157 26.5293 88.6625 27.2261 88.4203 c
25.3911 88.0976 m
25.1743 86.8622 25.4053 85.1684 25.5 83.8896 c
26.0903 83.8744 26.5742 83.9653 27.0103 84.1044 c
26.9854 85.4824 26.9561 86.8564 26.7954 88.0976 c
26.4473 88.3383 25.7783 88.1552 25.3911 88.0976 c
f
21.6162 88.5283 m
22.3482 88.4697 23.3252 88.6552 23.8819 88.4203 c
23.8169 86.7382 23.9619 85.2646 23.9888 83.6733 c
23.4248 83.4975 22.1802 83.4975 21.6162 83.6733 c
21.7622 85.3823 21.3159 87.0195 21.6162 88.5283 c
21.939 88.0976 m
21.7871 87.0834 21.9829 85.1176 22.0469 83.9975 c
22.48 83.7582 23.2178 84.0136 23.666 84.1054 c
23.6992 85.5043 23.6489 86.8212 23.5581 88.0976 c
23.1611 88.3305 22.3682 88.1762 21.939 88.0976 c
f
24.313 88.5283 m
24.4868 88.5595 24.499 88.4262 24.6367 88.4203 c
24.4448 86.7182 25.2637 84.4242 24.313 83.5663 c
24.1348 84.9755 24.1348 87.1196 24.313 88.5283 c
f
21.0762 88.4203 m
21.4732 87.2284 21.2442 84.8554 21.292 83.6733 c
20.6074 84.6484 21.0703 87.4023 21.0762 88.4203 c
f
27.5498 88.4203 m
28.0425 87.3232 27.8408 84.8212 27.8736 83.6733 c
27.3257 84.9155 27.7246 86.5473 27.5498 88.4203 c
f
47.5083 84.9682 m
45.8887 84.539 44.9444 83.4321 44.4873 81.8403 c
43.5703 81.5483 42.4727 81.8744 41.8985 82.2714 c
41.8916 84.6523 44.4946 86.475 46.2134 87.2343 c
47.1255 87.6362 47.4126 85.912 47.5083 84.9682 c
f
9.1011 85.7231 m
9.0342 85.287 8.4512 85.3661 8.3462 84.9682 c
8.73 84.2963 11.2661 83.0292 12.23 83.4579 c
12.5088 83.582 12.8389 83.8881 12.7691 84.3212 c
13.211 83.7919 13.6948 83.3041 13.9561 82.5951 c
13.2119 82.475 12.7012 82.124 12.23 81.7309 c
11.0269 82.2089 8.625 83.8593 7.5908 82.4872 c
7.229 82.9169 6.9331 83.412 6.728 83.997 c
7.249 84.1591 7.7432 84.3481 8.1299 84.645 c
8.0742 85.2353 7.6621 85.4711 7.5908 86.0473 c
8.0488 86.7499 9.106 86.8759 9.1011 85.7231 c
f
48.9102 83.1342 m
48.2363 83.1972 48.7363 82.0864 48.0479 82.163 c
48.0293 81.9291 48.4297 82.1142 48.5879 82.0551 c
48.2871 81.62 47.4248 81.891 47.4009 82.3793 c
46.5967 81.5639 45.1226 81.4203 44.3799 80.5453 c
44.5425 80.3891 44.9268 80.9272 45.1348 81.0839 c
45.3286 80.5639 44.4199 80.2192 44.4878 79.4662 c
44.0996 79.5102 44.3198 80.1611 43.9478 80.2211 c
44.0098 80.9872 44.5235 81.2992 45.0269 81.624 c
44.6548 85.8759 52.0664 85.288 51.5 81.624 c
52.0166 81.1689 52.668 80.851 52.5781 79.79 c
52.2422 79.7402 52.2344 80.02 52.2559 80.329 c
51.6953 81.2431 50.2813 81.3041 49.4512 81.9472 c
49.4268 82.4882 49.4121 82.871 48.9102 83.1342 c
50.8535 81.8403 m
50.4776 81.9682 50.1328 82.1259 49.7735 82.2709 c
49.9844 81.7612 50.6865 81.745 51.2852 81.624 c
51.2871 81.9863 51.1358 82.1943 50.961 82.3793 c
50.9024 82.2221 51.0869 81.8212 50.8535 81.8403 c
f
37.6914 83.35 m
37.5581 82.9462 35.6704 82.5263 35.856 83.4579 c
36.312 83.5112 37.4292 83.7909 37.6914 83.35 c
f
28.521 83.0263 m
27.336 82.829 26.21 82.8661 25.0679 82.9184 c
23.5488 82.9882 21.648 82.4413 20.3208 83.0263 c
20.9551 83.4682 21.8618 83.2201 22.6948 83.2421 c
24.5278 83.2914 26.8867 83.6894 28.521 83.0263 c
f
40.8194 82.7026 m
40.4917 82.0468 38.5864 82.4355 37.9063 82.4867 c
37.9063 82.8105 l
38.6074 82.9169 40.2984 83.1308 40.8194 82.7026 c
f
37.6914 82.7026 m
37.9204 81.3495 39.3521 81.1996 40.7114 80.9765 c
40.6504 80.4848 40.9024 80.3046 40.8194 79.7895 c
39.6284 80.145 38.7671 80.8305 37.9063 81.5156 c
37.687 81.4848 37.6953 81.2236 37.4751 81.1928 c
37.626 80.6249 38.0274 80.3046 38.4463 80.0058 c
38.5611 80.3398 37.7632 80.6869 37.7993 81.2997 c
38.771 80.0068 41.0713 80.0409 41.3594 78.0639 c
40.9932 78.9838 39.5884 79.1157 38.7691 78.4946 c
37.8862 79.0497 37.8194 80.4218 37.1514 81.1928 c
36.606 80.0287 37.5044 78.1855 37.1514 76.8769 c
36.898 76.8427 36.7461 76.706 36.396 76.7685 c
36.3042 78.6547 36.7061 81.0346 35.856 82.1635 c
36.2793 82.1547 36.5303 81.9736 36.8281 81.8398 c
37.0962 82.1147 36.2373 82.1777 36.2881 82.5947 c
36.5791 82.8066 37.231 82.6586 37.6914 82.7026 c
f
29.9229 82.5947 m
30.1001 81.3105 27.8233 81.8495 26.9019 81.8398 c
25.814 81.8266 24.6602 81.624 23.6651 81.7319 c
23.459 81.7197 23.793 81.3705 23.6651 81.0849 c
22.8882 80.9179 22.6402 81.2817 22.3711 81.624 c
21.9102 77.8959 22.7481 73.4247 22.0469 70.6191 c
21.9199 73.9579 21.7251 78.0517 21.939 81.624 c
21.7193 81.8715 21.044 81.6625 20.645 81.7319 c
20.7793 81.4345 21.6441 81.8686 21.5083 81.2997 c
21.4019 80.8305 20.4531 81.2035 19.9971 81.0849 c
19.9971 78.1718 l
20.3203 77.9545 21.0152 78.1098 21.5083 78.0639 c
21.0962 77.4755 21.6143 77.2817 21.5083 76.4443 c
21.251 76.3779 21.0059 76.2997 20.9693 76.0136 c
20.8242 76.2646 20.583 76.4199 20.3213 76.5527 c
20.1582 77.1835 20.5913 77.2177 20.7529 77.5248 c
20.7422 77.8007 20.3511 77.6977 20.2129 77.8476 c
19.8052 75.8847 20.1192 74.1015 20.105 72.3456 c
20.1021 71.9062 20.1641 70.9609 19.6743 70.6191 c
19.5733 74.1503 19.6113 77.8168 19.5659 81.5156 c
19.418 81.7997 18.7539 81.5668 18.8111 82.0556 c
19.7661 82.853 22.606 82.4247 23.8809 82.4867 c
25.877 82.5849 27.919 82.6376 29.9229 82.5947 c
f
24.6367 81.624 m
24.6226 81.4301 24.7686 81.3959 24.7446 81.1928 c
24.5879 81.0341 24.0386 81.0341 23.8819 81.1928 c
23.8447 81.624 24.19 81.6747 24.6367 81.624 c
f
25.7153 81.624 m
25.7027 81.4301 25.8477 81.3959 25.8233 81.1928 c
25.6665 81.0341 25.1177 81.0341 24.9605 81.1928 c
24.9605 81.516 l
25.0996 81.665 25.4297 81.623 25.7153 81.624 c
f
26.1475 81.624 m
26.4702 81.624 l
26.5806 77.9301 26.7896 74.0009 26.4702 70.7275 c
25.8882 71.0527 26.1475 71.9716 26.1475 72.5615 c
26.1475 75.2343 26.0772 78.9218 26.1475 81.2997 c
26.1475 81.624 l
p
f
27.981 81.624 m
27.9639 81.499 28.0049 81.4321 28.0889 81.4081 c
28.085 81.0517 27.7822 80.996 27.4419 80.977 c
27.3511 81.102 27.2988 81.266 27.334 81.516 c
27.461 81.6401 27.7149 81.6381 27.981 81.624 c
f
28.3047 81.624 m
28.6426 81.5488 28.4453 81.3359 28.4126 81.0849 c
28.1387 81.0951 28.1577 81.4858 28.3047 81.624 c
f
27.0103 71.2665 m
26.667 71.8642 27.3174 72.3945 27.333 72.9921 c
26.0694 73.9052 27.606 74.4941 27.5493 75.9052 c
27.562 76.3144 26.919 76.0663 26.9024 76.4452 c
26.7861 76.9936 27.1011 77.1093 27.333 77.3085 c
27.419 77.7524 26.8174 77.5116 26.9024 77.9555 c
27.4033 78.0307 27.5991 78.4096 27.5493 79.0346 c
27.5464 79.4267 27.0391 79.3144 26.9024 79.5737 c
26.896 80.3945 27.5801 80.2324 27.0103 80.8686 c
27.4702 80.8246 28.1211 80.9736 28.4121 80.7607 c
28.3423 80.6166 28.1821 80.5595 27.981 80.5453 c
27.9234 80.0546 28.5552 80.2577 28.521 79.7895 c
28.604 79.2387 27.8604 79.5156 27.7652 79.1425 c
27.707 78.7255 27.958 78.6166 27.8731 78.1713 c
27.855 77.8666 28.5381 78.2616 28.521 77.9555 c
28.6553 77.4975 28.1611 77.6674 28.0894 77.4164 c
28.1953 77.0185 28.71 77.0307 28.6284 76.4452 c
28.4741 76.1327 27.9204 76.2197 27.7652 75.9052 c
27.7124 75.5654 27.959 75.5243 27.8731 75.1503 c
29.6753 75.831 28.2183 79.7685 28.8443 81.6235 c
29.2603 81.5883 29.2451 81.0893 29.2754 80.8686 c
29.481 79.3857 29.0293 77.8095 29.168 76.0136 c
31.5371 77.3134 33.398 79.1186 35.749 80.4374 c
35.6704 79.3837 34.4961 79.0024 33.8062 78.4955 c
31.646 76.9052 29.2984 75.287 27.1182 73.6406 c
30.126 75.2363 32.7861 77.7514 35.749 79.0346 c
35.749 76.5527 l
35.1411 75.9013 34.2754 75.5087 33.9141 74.6113 c
34.5112 73.3144 35.8672 72.54 35.749 70.7275 c
35.502 66.9511 35.9732 61.2226 35.749 56.7021 c
35.5484 52.6699 35.6963 47.8173 35.6411 43.8632 c
35.0591 43.6718 33.856 43.7118 33.2681 43.8632 c
32.8223 51.8954 33.8594 61.6318 33.2681 69.4325 c
33.084 71.8515 32.27 74.0195 29.3833 73.6406 c
28.9903 72.7958 29.4541 71.4941 28.9522 70.6191 c
28.0894 73.5312 m
28.1284 72.707 28.6812 71.8241 28.7363 71.3749 c
28.5982 72.1445 28.9824 73.3515 28.6284 73.6406 c
28.646 73.4062 28.2461 73.5917 28.0894 73.5312 c
f
26.9024 81.516 m
27.1875 81.5492 27.1802 81.2909 27.2261 81.0849 c
26.8653 80.976 26.8721 81.2338 26.9024 81.516 c
f
20.3213 80.6528 m
20.4365 80.8979 20.9995 80.6938 21.2925 80.7607 c
21.0972 80.2446 21.3194 80.1537 21.6162 79.8979 c
21.4751 79.2055 20.7622 79.2968 21.0762 78.3866 c
20.6802 78.6386 20.9243 79.5297 20.2134 79.4658 c
20.0205 80.0585 20.9644 80.2817 20.3213 80.6528 c
f
45.2427 80.5453 m
45.7544 80.184 44.9146 79.7284 45.5664 79.5741 c
45.6294 79.1874 45.2466 79.245 44.9194 79.2504 c
44.5396 79.6493 44.8545 80.309 45.2427 80.5453 c
f
43.6245 80.1132 m
43.8252 79.3432 44.4404 78.9872 45.2422 78.8183 c
45.2256 78.4775 45.5293 78.4584 45.4585 78.0634 c
45.0112 77.5395 44.6983 76.8827 44.0552 76.5527 c
42.9326 77.0834 42.4336 78.2392 42.1143 79.5741 c
42.4263 79.9443 42.8682 80.1865 43.6245 80.1132 c
f
37.4746 79.3578 m
37.8916 79.1279 38.127 78.7162 38.3379 78.2792 c
38.2466 77.975 38.0376 77.788 37.6909 77.7402 c
37.5318 78.1918 37.5537 78.8251 37.4746 79.3578 c
f
37.3672 76.5527 m
37.9004 77.4228 38.7271 77.998 39.6323 78.495 c
40.4693 77.7128 41.1065 76.7314 41.5742 75.5829 c
40.9863 75.4159 40.6533 74.9941 40.1724 74.7187 c
39.1265 75.2197 37.6694 75.3085 37.3672 76.5527 c
f
40.2798 78.495 m
41.2407 77.8012 42.0269 76.3583 42.4375 75.4745 c
41.9116 74.8134 40.9556 74.582 40.3877 73.9638 c
40.0977 74.9472 41.5337 75.0156 41.8989 75.6904 c
41.4727 76.7392 40.6387 77.3793 40.2798 78.495 c
f
45.1348 77.0927 m
45.2354 77.1718 45.2988 77.2885 45.3506 77.4155 c
46.7808 76.9408 47.4077 75.662 47.8316 74.1796 c
47.1094 75.329 46.0698 76.1562 45.1348 77.0927 c
f
23.3423 77.3085 m
23.7363 77.4057 23.4863 76.6991 23.2339 76.7685 c
23.145 77.0737 23.3862 77.0488 23.3423 77.3085 c
f
47.4004 74.287 m
47.4336 74.0029 47.1753 74.0097 46.9683 73.9638 c
46.9683 73.2089 l
47.0117 72.7831 47.9297 73.2343 47.7236 72.5615 c
47.8711 72.5947 47.8135 72.831 47.8316 72.9921 c
48.084 72.8847 48.1797 72.621 48.1553 72.2372 c
47.8477 72.1728 47.7144 72.3329 47.0777 72.2372 c
46.4517 73.4101 45.9385 74.6952 44.5957 75.1503 c
45.1157 74.5195 46.3526 73.6718 46.5376 72.3456 c
45.7993 72.3866 45.6074 72.332 45.0274 72.5615 c
44.9497 72.8915 45.1377 72.954 45.1343 73.2089 c
44.5337 71.8681 44.5664 69.8935 44.4873 68.0302 c
43.4776 68.2607 43.7534 70.3866 43.8403 71.6982 c
43.8936 72.5097 44.1587 73.3661 44.1636 74.1796 c
43.3067 72.915 43.6304 70.4697 43.3003 68.6777 c
42.6924 68.7519 42.1104 68.8534 41.5747 69.0009 c
41.5083 70.412 41.5034 71.6845 40.7114 72.5615 c
40.8076 71.9843 41.1826 71.1962 41.0357 70.7275 c
40.0957 71.2265 38.5606 71.7031 38.1226 72.3456 c
38.2515 72.8622 39.1226 72.6562 39.4175 72.4531 c
39.3486 73.787 38.5376 74.3779 38.0147 75.2577 c
39.4883 75.1142 40.0513 74.0585 40.6045 72.9921 c
41.2627 73.0761 41.3584 72.5976 41.5747 72.2372 c
41.5405 72.4677 41.8067 72.6728 41.6826 72.9921 c
41.9966 73.1318 42.4483 73.1318 42.7617 72.9921 c
43.1094 73.2109 42.2725 73.1415 42.3296 73.4238 c
42.6904 74.2138 43.0615 74.9941 44.0557 75.1503 c
43.9507 75.2968 43.6924 75.29 43.6245 75.4745 c
44.3775 77.6591 47.0635 75.7158 47.4004 74.287 c
42.9776 70.9433 m
43.1143 71.9804 42.5967 72.3603 42.0054 72.6689 c
42.4717 72.2363 42.6704 71.5351 42.9776 70.9433 c
f
4.6777 74.9345 m
4.1719 76.6669 6.0791 76.7441 6.2959 75.7978 c
6.459 75.0888 5.668 74.5253 4.6777 74.9345 c
f
38.7695 73.9638 m
37.9707 73.1806 36.5864 72.9833 35.9644 72.0224 c
35.3257 72.7851 34.8545 73.7167 34.3467 74.6113 c
34.7066 75.6894 35.9116 75.9228 36.8277 76.4452 c
38.0117 76.1552 37.5015 74.1699 38.7695 73.9638 c
f
9.209 75.9052 m
9.5869 75.9638 10.1748 75.7314 10.0718 75.0429 c
9.7969 73.1933 7.1851 75.5986 9.209 75.9052 c
f
20.8609 75.9052 m
20.9859 75.456 21.6099 75.5048 21.5078 74.8271 c
20.6885 73.9882 21.7505 72.7665 21.6157 71.5908 c
21.1987 71.9286 21.4229 72.9072 20.9688 73.2099 c
20.4658 72.9921 20.7046 72.0331 20.3218 71.6982 c
19.8486 72.5585 21.2525 74.0536 20.3218 75.0429 c
20.2368 75.5224 20.8999 75.2558 20.8609 75.6904 c
20.8609 75.9052 l
p
f
24.313 73.5322 m
25.313 72.0868 25.8897 70.2177 26.7949 68.6777 c
25.5278 69.5331 25.3018 71.4286 24.4209 72.6699 c
23.043 71.6025 22.9619 69.2382 21.292 68.4618 c
22.3701 70.081 23.4009 71.747 24.313 73.5322 c
f
36.1802 71.8066 m
36.7901 72.6347 37.6221 73.2411 38.9863 73.3173 c
38.4903 72.6181 37.0259 71.8613 36.1802 71.8066 c
f
6.7276 71.0507 m
6.4727 70.5185 5.5415 70.8408 5.0015 70.9433 c
5.1314 71.6132 4.7715 72.246 5.0015 72.6699 c
5.6895 72.2431 6.4536 71.8906 6.7276 71.0507 c
f
38.0147 71.914 m
37.6514 70.3359 38.6377 69.1679 38.4458 68.1376 c
38.2598 67.1396 36.9956 67.2177 36.8277 66.0878 c
36.8355 65.7021 37.2456 65.7138 37.3677 65.4404 c
37.7256 65.6689 37.0435 65.7538 37.1514 66.0878 c
37.4995 66.9267 38.4356 67.1767 38.8775 67.9218 c
38.6397 69.0517 38.5645 70.3427 38.3374 71.4824 c
38.6026 71.6933 38.9077 71.2529 39.3096 71.2665 c
39.5825 70.0654 39.1475 68.1562 39.9566 67.4911 c
39.7417 66.9472 39.4966 66.2402 39.7407 65.5488 c
38.6358 64.9374 36.9307 64.8417 36.3965 65.9804 c
37.0674 68.0566 35.2588 72.1708 38.0147 71.914 c
38.2295 65.5488 m
38.8028 65.4081 39.0366 66.6357 38.6616 66.7363 c
38.6694 66.1884 38.2798 66.038 38.2295 65.5488 c
f
45.9981 71.1581 m
45.6421 70.2353 46.0274 68.5458 45.5664 67.4902 c
45.0274 67.4902 l
44.7974 68.7314 44.8491 70.164 45.0274 71.4824 c
45.4893 71.5146 45.7403 71.3329 45.9981 71.1581 c
f
2.52 69.5409 m
2.9331 69.3788 3.2241 69.0937 3.4912 68.7861 c
3.5698 68.4911 3.2769 68.5683 3.2749 68.3534 c
2.7822 68.4355 2.5562 68.7861 2.1958 69.0019 c
2.2598 69.2255 2.4229 69.3495 2.52 69.5409 c
f
10.9356 68.3544 m
10.7046 67.7568 9.9424 67.6913 9.8565 66.9511 c
8.8423 67.5253 5.8067 67.7529 5.1094 66.7353 c
4.5137 66.787 4.2925 67.2128 3.9224 67.4911 c
4.1475 68.0927 4.7085 68.3583 5.0015 68.8935 c
5.8526 68.3066 7.4624 68.4775 8.8853 68.4609 c
9.4956 69.2968 10.2276 68.9687 10.9356 68.3544 c
f
20.4292 67.3827 m
20.8535 66.9033 20.5654 66.374 20.8604 65.7646 c
21.9434 65.9286 22.5571 67.0556 23.7735 66.7363 c
24.0034 65.706 23.7603 64.205 23.9893 63.1747 c
23.2295 63.5654 23.7764 65.2636 23.4502 66.0878 c
22.8555 65.5605 23.5542 64.0986 23.2344 63.499 c
22.7373 63.8652 23.0601 65.0507 22.8023 65.6572 c
22.3594 65.4179 22.6885 64.4052 22.5874 63.8232 c
22.0073 63.9618 22.5361 65.2109 22.0474 65.4404 c
21.7993 65.1855 22.0093 64.4726 21.9395 64.039 c
21.5015 64.1034 21.6743 64.7802 21.5083 65.1171 c
21.1314 65.0615 21.3491 64.413 21.2925 64.039 c
21.1343 64.1318 20.9502 64.2001 20.9683 64.4697 c
20.8233 64.3984 20.7671 64.2392 20.7525 64.039 c
20.8594 63.4609 21.5552 63.4745 21.9395 63.1747 c
21.7612 62.4999 22.6734 62.1591 23.5581 62.205 c
23.6655 61.6659 23.1875 61.7128 22.9102 61.5575 c
22.7974 62.0507 22.6001 61.7577 22.2632 61.665 c
22.1841 61.9599 22.4771 61.8818 22.4795 62.0966 c
22.0635 62.58 21.1875 62.6015 20.8604 63.1747 c
20.7193 63.1376 20.6914 62.9853 20.5371 62.9599 c
20.6724 62.4111 20.9561 62.0126 21.4004 61.7724 c
20.9341 61.4189 20.5972 62.1171 20.3213 62.3124 c
19.8364 62.2577 19.6685 61.8857 19.3501 61.665 c
19.1782 62.1279 20.1865 62.3368 19.8902 63.2831 c
18.8965 63.0175 18.6182 61.707 17.4082 61.9882 c
17.5054 62.3046 17.5054 62.3202 17.4082 62.6357 c
18.7193 62.2841 18.9414 63.6972 19.8902 64.039 c
19.9785 64.3437 19.7373 64.3183 19.7822 64.5781 c
19.4912 64.6533 19.5733 64.3544 19.4585 64.2538 c
19.1865 64.3427 19.3071 64.8232 19.1343 65.0097 c
18.7691 64.9433 18.9971 64.2831 18.8115 64.039 c
18.3145 64.081 18.8765 65.1825 18.3794 65.2245 c
18.1211 64.8359 18.2993 64.0107 17.8403 63.8232 c
17.8443 64.4384 17.7993 65.0038 17.6245 65.4404 c
17.1353 65.2109 17.5874 64.04 17.3003 63.6064 c
16.7261 63.8593 17.4434 65.4042 16.8692 65.6572 c
16.6441 65.6288 16.8394 65.1825 16.6533 65.1171 c
16.2495 65.2167 16.5122 65.9843 16.4375 66.412 c
17.6475 67.3144 18.2984 65.4882 19.8902 65.7646 c
19.9903 65.8437 20.0532 65.9609 20.1055 66.0878 c
20.1314 66.5458 19.8814 66.7265 19.5664 66.8437 c
19.8135 67.0634 19.9732 67.371 20.4292 67.3827 c
f
2.1963 66.7353 m
3.4902 67.2734 2.3872 64.4824 3.4912 64.4697 c
3.918 64.6533 3.832 65.3515 4.1382 65.6562 c
6.002 65.4531 8.7691 65.3339 9.9639 66.6279 c
10.4419 66.4589 10.8569 66.2265 11.1509 65.873 c
10.9492 65.2822 10.3672 65.0732 10.0723 64.5771 c
8.0303 65.0331 5.1699 64.5478 3.815 63.6064 c
3.4639 64.1181 2.9629 64.4814 2.4121 64.7939 c
2.293 65.3857 2.209 66.372 2.1963 66.7353 c
f
40.0645 64.4697 m
40.2344 64.0654 40.5137 63.7685 40.4956 63.1747 c
39.0908 63.0771 37.8657 63.2314 36.3965 63.0673 c
35.5435 65.1865 38.6148 64.2958 40.0645 64.4697 c
f
9.9644 63.9306 m
10.5723 63.8915 10.9111 63.582 11.3672 63.3915 c
11.273 62.7665 10.5352 62.7841 10.6113 61.9882 c
9.104 62.4179 6.583 62.0868 5.7573 61.1249 c
6.168 59.7392 10.0713 60.247 10.5034 61.5575 c
10.7984 61.1679 11.4243 61.1113 11.9063 60.9091 c
11.7671 60.2216 11.1553 60.0058 11.043 59.2919 c
9.7583 59.7353 6.6153 59.5634 6.2964 57.997 c
5.688 58.0361 5.3501 58.3447 4.8931 58.5361 c
5.0484 59.3163 5.8281 59.4726 5.9722 60.2626 c
5.6411 60.7939 5.0034 61.0195 4.4624 61.3408 c
4.8413 62.0038 5.1841 62.705 5.7573 63.1747 c
7.1343 63.0839 9.4063 62.8603 9.9644 63.9306 c
f
39.7407 62.5283 m
40.2378 61.5507 39.8169 59.6552 39.9556 58.3202 c
39.2359 59.1777 39.7866 61.5868 39.7407 62.5283 c
f
40.1724 62.5283 m
40.3462 62.5575 40.3584 62.4257 40.4961 62.4199 c
40.3784 60.9736 40.502 60.245 40.4961 58.3202 c
40.0703 59.6113 40.292 61.1093 40.1724 62.5283 c
f
26.1475 62.4199 m
25.9566 62.1933 25.9033 62.1015 26.0396 61.7734 c
25.2075 61.4267 25.3086 61.8827 24.7442 61.5575 c
24.3213 61.748 25.2754 62.0126 24.8526 62.205 c
25.1694 62.3368 25.7783 62.1181 26.1475 62.4199 c
f
11.2588 58.5361 m
11.8569 58.4872 12.1489 58.1318 12.5537 57.8886 c
12.543 57.1445 12.0391 56.8945 12.1221 56.0546 c
10.6348 55.6718 8.8999 55.537 8.1299 54.4374 c
7.1909 54.7919 6.3511 55.247 5.6489 55.8388 c
5.8779 56.6523 6.6011 56.9726 6.728 57.8886 c
7.2051 57.7538 7.4507 57.3896 7.9141 57.2421 c
7.4649 56.8281 6.9849 56.4452 6.9439 55.624 c
7.48 55.6767 10.1328 56.2294 11.043 56.8105 c
11.8628 57.3339 11.4771 57.9433 11.2588 58.5361 c
f
60.4551 57.5654 m
61.0957 55.8642 58.582 56.5908 57.7578 56.5947 c
51.7803 56.62 42.6553 56.4394 36.0723 56.7021 c
36.1397 56.995 35.9356 57.5585 36.1807 57.6728 c
43.4004 57.8456 52.9727 57.9638 60.4551 57.5654 c
f
9.9644 57.3495 m
10.2251 57.081 9.6431 56.7411 9.209 56.8105 c
9.3662 57.0849 9.8633 57.0185 9.9644 57.3495 c
f
22.1553 56.3788 m
22.4834 56.2753 22.5894 55.9501 23.1265 56.0546 c
23.3096 55.5478 22.6192 55.915 22.8023 55.4081 c
22.5054 55.5781 22.4844 56.0253 21.9395 55.9472 c
21.9854 56.1171 22.2783 56.039 22.1553 56.3788 c
f
37.9068 55.7314 m
37.4805 55.1142 36.9317 54.62 36.1797 54.3281 c
35.9566 54.7167 36.1245 55.495 36.0728 56.0546 c
36.5977 56.2577 37.7769 56.2734 37.9068 55.7314 c
f
46.7529 56.0546 m
44.8653 55.5361 41.7373 56.0439 39.9561 55.7324 c
39.8989 55.8193 39.8443 55.9062 39.8482 56.0546 c
41.8999 56.2333 44.7012 56.2363 46.7529 56.0546 c
f
39.3091 56.0546 m
39.0923 55.3769 38.3535 54.8876 37.7984 54.4374 c
37.2803 54.0146 36.7075 53.3222 36.0723 53.3583 c
36.8902 54.5185 38.0161 55.3691 39.3091 56.0546 c
f
42.1143 53.8974 m
41.7783 53.8007 42.0064 53.1435 41.791 52.9257 c
40.3882 52.9257 l
40.4893 53.747 39.9912 53.9677 39.8482 54.5439 c
42.3052 54.6318 44.1792 54.9072 46.4292 54.6523 c
46.4961 54.1083 46.7271 53.7275 46.7534 53.1425 c
46.541 52.9277 46.1372 53.0732 45.8902 53.1425 c
45.9653 53.6132 45.707 53.749 45.7822 54.2206 c
45.0962 54.2958 45.2573 53.5234 45.0274 53.1425 c
44.3423 53.2118 43.374 52.9999 42.8692 53.2499 c
42.4131 53.2616 42.6851 54.0009 42.1143 53.8974 c
f
38.1226 54.2206 m
38.2695 53.749 38.1358 53.6659 38.0147 53.2499 c
37.6148 53.204 37.1157 52.8505 36.8277 53.0341 c
36.8545 53.4296 37.3755 54.1923 38.1226 54.2206 c
f
42.6538 52.9267 m
43.7329 52.9267 l
43.4971 52.4423 43.1382 52.082 42.6538 51.8476 c
41.8052 52.0263 42.1299 52.7812 42.1138 53.6816 c
42.5879 53.7245 42.4859 53.1913 42.6538 52.9267 c
f
37.1514 52.9267 m
37.7984 52.9267 l
37.9014 52.5361 37.3745 52.7763 37.1514 52.7109 c
37.1514 52.9267 l
p
f
39.7407 52.6025 m
40.0645 52.6025 l
40.2398 52.2753 40.3819 51.912 40.3877 51.4159 c
39.8589 51.498 39.6548 51.9062 39.7407 52.6025 c
f
37.0435 52.2792 m
37.3672 52.2792 l
37.3032 50.7783 37.3135 48.6259 37.7984 47.1005 c
37.0435 47.1005 l
36.3823 48.7021 36.4346 50.5683 37.0435 52.2792 c
f
41.7905 51.2001 m
42.0488 51.3954 41.1826 51.3769 41.3599 51.8476 c
41.8355 52.0986 42.3545 51.872 42.5459 51.5234 c
42.1968 50.5781 41.5967 49.8837 40.9268 49.2577 c
39.8657 49.3837 39.4107 50.1152 38.5537 50.4452 c
38.2329 49.2587 38.8726 48.1034 39.0938 47.1005 c
38.8535 46.873 38.5728 47.2138 38.1226 47.1005 c
37.8306 48.5273 37.3316 50.8769 38.0147 52.2792 c
39.2256 52.2324 39.4297 51.1757 40.3877 50.8759 c
40.9409 51.0185 41.2139 51.6562 41.7905 51.2001 c
f
14.1719 50.4452 m
14.8306 50.5283 15.1817 50.3036 15.7896 50.3368 c
15.9409 49.8095 15.5777 49.1015 15.5747 48.3945 c
14.002 47.9179 12.7598 47.1103 11.583 46.2382 c
11.5259 45.8437 12.0557 45.7529 11.7988 45.4824 c
11.1817 45.5488 10.4898 45.54 9.9639 45.6991 c
10.0928 46.287 10.397 46.704 10.5039 47.3154 c
10.1939 47.6542 9.354 47.4609 8.8858 47.6396 c
8.8198 48.3163 9.043 48.705 9.209 49.1493 c
9.5986 49.1074 9.9326 49.0107 10.2876 48.9335 c
10.3086 48.5175 10.292 48.1386 10.1797 47.8554 c
12.064 47.5175 13.2988 48.7636 14.3867 49.582 c
14.5059 50.0595 14.2046 50.1181 14.1719 50.4452 c
f
38.9859 49.582 m
39.9898 49.2558 39.9878 47.9238 40.3877 46.9931 c
39.6328 46.9931 l
39.2378 47.6366 38.9307 48.8349 38.9859 49.582 c
f
36.0728 49.3661 m
36.3364 48.873 36.4878 47.6972 36.3965 47.2079 c
35.7324 47.371 36.2246 48.6913 36.0728 49.3661 c
f
43.4087 48.5029 m
43.5938 48.0771 43.7197 47.5908 43.7329 46.9931 c
43.4531 46.7255 43.2041 47.0976 42.7608 46.9931 c
42.7608 47.4238 l
42.333 47.1728 41.731 46.7529 41.0347 47.1005 c
41.0498 47.6552 40.6118 47.7568 40.604 48.287 c
41.147 48.7158 42.5938 48.6913 43.4087 48.5029 c
f
45.9981 48.3945 m
46.0054 47.8486 45.8125 47.5019 45.8902 46.8847 c
45.4624 46.9247 44.8565 46.7861 44.5952 46.9931 c
44.6074 47.8603 45.0015 48.8661 45.9981 48.3945 c
f
17.3003 47.748 m
17.2476 47.1533 17.0523 46.7021 16.9766 46.1298 c
17.2427 45.7109 18.0396 45.8261 18.7027 45.8056 c
18.5523 45.2734 18.5977 44.5439 18.5957 43.8642 c
17.1304 43.2783 15.9785 42.3808 14.9263 41.3827 c
14.8233 40.9179 15.5523 40.9599 15.2505 40.6269 c
13.4165 40.6269 l
13.4263 41.2636 13.7305 41.6083 13.6314 42.3525 c
15.3223 42.8925 16.8096 43.6347 17.3003 45.374 c
16.4517 46.2421 13.6836 44.0937 13.0933 43.0009 c
12.5596 43.079 11.9273 43.0575 11.4746 43.2167 c
11.5244 43.706 11.6685 44.1005 11.6904 44.6191 c
13.3965 44.5937 14.4107 46.0263 15.7896 46.6689 c
15.9414 47.1337 15.7666 47.499 15.7896 47.6396 c
16.2236 47.746 16.7373 47.7724 17.3003 47.748 c
f
60.3467 46.3456 m
60.3535 45.8134 60.4317 44.3339 60.2383 43.6474 c
59.5762 44.707 59.2344 45.9638 57.7578 45.6991 c
56.4336 45.4609 56.9561 43.8476 55.5996 43.5409 c
55.1426 44.914 53.5762 46.4658 52.1465 45.0507 c
51.7363 44.6445 51.542 43.6054 51.0684 43.5409 c
50.2471 43.4267 50.5195 44.1093 49.9903 44.8349 c
49.6797 45.2597 48.8184 45.8525 47.9395 45.6991 c
46.7339 45.4853 46.7837 43.5068 45.3511 43.7558 c
44.7437 46.3388 41.7769 46.1904 41.0347 43.7558 c
40.604 43.7558 l
40.023 44.7978 39.4707 46.0976 38.23 46.0214 c
37.0508 45.9491 37.0147 44.5605 36.1797 43.8642 c
36.0327 44.5087 35.978 45.8163 36.1797 46.4531 c
36.1631 46.579 36.2041 46.6445 36.2881 46.6689 c
44.1538 46.5458 53.125 46.4091 60.3467 46.3456 c
f
32.0806 43.2167 m
32.1026 42.5468 32.0884 41.914 31.8657 41.4902 c
30.2168 41.5224 27.9317 41.4042 26.7944 41.5986 c
26.8648 42.1396 26.6524 42.9628 26.9024 43.3241 c
28.4097 43.4658 30.7354 43.5878 32.0806 43.2167 c
f
32.8355 43.3241 m
43.2593 43.2236 53.461 43.1816 63.6914 43.1083 c
63.6367 42.5156 63.8106 41.6952 63.584 41.2743 c
58.4356 41.3642 52.707 41.1464 47.9395 41.2743 c
42.8706 41.4101 37.9863 41.4111 32.7285 41.5986 c
32.5156 41.8896 32.6636 42.5419 32.6206 43.0009 c
32.6153 43.1855 32.7002 43.2792 32.8355 43.3241 c
f
30.2466 40.7353 m
31.5777 40.9872 33.3755 40.7714 34.8853 40.8427 c
36.7363 39.0263 38.9907 37.6113 39.5244 34.4784 c
37.0674 37.1982 34.1074 39.4179 30.2466 40.7353 c
f
35.8565 40.8427 m
38.4458 40.8427 l
38.8179 40.4599 39.2388 40.1249 39.3096 39.4404 c
38.7188 39.456 38.2827 39.3163 37.7988 39.2245 c
38.0435 38.4267 38.6118 37.9521 38.8779 37.1747 c
38.3696 37.5273 37.8726 38.2704 37.3677 38.9013 c
36.8399 39.5605 36.2925 40.2128 35.8565 40.8427 c
f
39.4175 40.8427 m
40.2871 40.9218 40.8242 40.6679 41.6821 40.7353 c
41.8955 40.3368 42.2344 40.0644 42.2222 39.4404 c
40.1724 39.4404 l
39.8862 39.874 39.4751 40.1806 39.4175 40.8427 c
f
42.5454 40.7353 m
44.7036 40.7353 l
44.9697 40.3896 45.2627 40.0722 45.2427 39.4404 c
44.5176 39.2783 44.1148 39.4599 43.0845 39.4404 c
42.9307 39.8574 42.3794 40.3447 42.5454 40.7353 c
f
23.7735 40.1952 m
23.7793 39.4853 23.3814 39.0478 23.6655 38.3613 c
22.5025 37.5468 21.4995 36.5732 20.6445 35.4491 c
20.5293 35.0458 20.9126 35.1415 20.8604 34.8017 c
20.4317 34.62 19.7227 34.7167 19.1343 34.6933 c
19.1016 35.3027 19.3257 35.6523 19.2427 36.3115 c
20.6714 36.8613 21.3555 38.1533 22.2637 39.2245 c
22.2803 39.5654 21.9766 39.5859 22.0474 39.9794 c
22.6377 40.038 23.0835 40.2372 23.7735 40.1952 c
f
33.2676 103.4164 m
33.2529 102.9277 33.0039 102.6733 32.9439 102.2294 c
32.4009 102.3334 32.2007 102.7826 31.541 102.7695 c
30.918 104.3754 30.4649 106.1523 29.3838 107.3002 c
29.5596 107.7353 29.6836 108.2226 29.9229 108.5956 c
31.333 108.4946 31.1177 106.1943 31.7569 105.6825 c
31.961 105.0234 32.1948 103.5566 33.2676 103.4164 c
f
49.7735 98.8852 m
50.1192 99.1342 49.544 99.3666 49.666 99.7485 c
52.166 99.3906 57.3399 100.0063 60.6699 99.3163 c
60.5332 98.8447 59.542 99.2236 59.0518 99.1015 c
59.4863 98.4194 60.499 97.3832 60.7774 96.1884 c
60.9238 96.8935 60.9522 98.4106 60.8858 99.4252 c
62.2481 98.6703 63.6817 97.5165 65.0938 96.4042 c
66.4805 95.3115 67.7871 94.0375 69.1934 93.0595 c
67.8985 93.3354 64.2149 94.3285 63.584 92.7363 c
63.3047 92.0312 63.5176 90.9384 63.4766 89.8232 c
63.3653 86.8564 63.333 82.0776 63.3682 79.3583 c
62.5684 79.7455 61.9649 80.3295 61.21 80.7602 c
63.2168 78.9916 65.4746 77.4736 67.5752 75.7978 c
67.7363 76.9413 67.3858 79.5854 67.6836 81.4086 c
68.2676 79.5014 67.6192 76.8544 68.1133 75.2587 c
68.1572 75.6825 68.8945 75.412 68.8701 75.9052 c
69.0156 76.5917 68.0586 76.1738 68.1133 76.7685 c
68.0391 77.1684 68.2861 77.2455 68.6543 77.2006 c
68.834 77.6064 68.1524 77.6913 68.4395 77.8476 c
69.7324 77.8476 l
69.419 77.3974 69.5361 77.1933 70.0567 77.0922 c
70.1621 76.3769 69.4707 76.456 69.1934 76.121 c
69.1055 75.5302 69.7822 75.7031 69.9473 75.3661 c
70.043 74.8046 69.3477 75.0331 69.1934 74.7197 c
69.2998 74.0341 70.2822 74.2245 70.0567 73.2079 c
66.9473 75.4941 63.8184 77.7602 60.8858 80.2216 c
60.9082 80.6386 60.8906 81.0165 60.7774 81.3002 c
60.1338 81.1274 59.2266 80.3256 58.6211 81.0844 c
58.1182 80.6166 57.5752 80.1874 57.1113 79.6825 c
57.6524 79.6083 58.0723 80.5873 58.7285 80.7602 c
58.4502 79.2045 57.4395 78.3813 56.7861 77.2006 c
55.9229 77.2006 l
57.501 76.0771 58.2442 79.4916 59.0518 80.4374 c
59.2207 76.6435 57.5908 71.9413 57.3262 68.0302 c
58.4453 70.8515 58.9297 74.8671 59.4844 78.4955 c
59.6035 79.2846 59.3379 80.6425 60.3477 80.8686 c
60.2363 75.8378 60.1338 70.4638 60.0235 65.7646 c
59.6778 65.2822 59.0752 65.0585 58.7285 64.5771 c
58.1445 65.0351 57.0459 64.9804 56.2471 65.2245 c
56.1914 67.6611 55.9375 70.7079 54.9531 72.5615 c
55.2754 74.0087 54.0352 74.8027 53.5498 75.7978 c
54.1836 76.5673 54.7305 77.4223 55.168 78.3876 c
55.5957 78.2636 56.4248 77.2245 56.7861 78.0634 c
56.2041 77.9682 55.3985 78.5156 55.3838 79.0346 c
55.3496 80.2255 58.1895 80.5644 58.5117 81.6244 c
57.4903 81.1352 56.7881 80.3276 55.5996 80.0053 c
55.5469 81.6406 58.0313 80.7392 58.0811 82.2714 c
57.3311 82.6655 56.4395 82.2704 55.3838 82.3783 c
55.5547 79.8105 54.749 76.7763 53.0098 76.121 c
53.4004 77.3852 54.626 77.8144 54.6279 79.4662 c
54.0156 78.3534 53.7412 76.9013 52.3633 76.5527 c
51.7861 76.9814 51.8496 78.0527 50.961 78.1713 c
51.8379 78.6962 52.9395 78.9975 53.0098 80.3295 c
53.6445 80.1713 54.4971 80.2333 54.6279 79.5746 c
55.959 84.7685 51.1211 89.1083 45.3511 87.2343 c
43.0669 86.0512 41.0938 83.5043 41.5742 80.2216 c
41.8379 78.4233 42.7871 77.4565 43.624 76.121 c
41.8389 76.9306 40.9429 79.3534 41.0352 81.8393 c
41.1861 85.9096 45.5982 88.9462 49.8819 88.0976 c
52.4541 87.5873 54.4111 85.4135 55.2754 82.9184 c
60.4551 82.9184 l
60.5625 82.5624 59.7637 82.5063 60.4551 82.4863 c
60.3086 81.8412 59.6309 81.7284 59.0518 81.5165 c
59.7168 81.1762 60.0723 82.0756 60.7774 82.0556 c
60.6113 83.7734 61.1914 85.5995 60.7774 87.1254 c
60.4297 88.4174 59.1631 88.9535 58.1895 89.7153 c
59.5361 90.4526 61.2881 91.6952 60.7774 93.5995 c
60.1524 91.4184 58.3291 90.4384 55.8164 90.1464 c
57.9414 88.9286 60.2022 87.8447 60.5625 84.8603 c
59.7002 84.8603 l
58.2617 89.7162 51.3203 89.0683 48.8028 92.8432 c
47.7901 90.3696 44.6758 89.9946 42.9771 88.2045 c
42.8618 87.7812 42.9541 87.1484 42.7608 86.8027 c
42.148 86.5575 41.8902 87.2314 41.4668 87.3412 c
39.5029 87.8505 38.4292 85.7895 37.4751 84.6445 c
37.7261 86.7045 40.19 88.6596 42.2222 87.2343 c
43.127 90.6196 48.544 90.0302 48.4785 94.0302 c
48.9639 94.0834 49.2881 93.9755 49.666 93.9223 c
50.3701 92.6132 51.3477 91.5776 52.9024 91.1176 c
52.4502 91.7953 51.291 93.2265 51.2852 94.3544 c
49.9336 94.4394 47.4151 94.2016 45.8902 94.4623 c
47.5298 95.1332 49.5528 94.5566 51.1768 94.6786 c
51.1328 95.4042 51.2735 95.9487 51.3926 96.5126 c
51.4229 96.5864 50.0088 95.8183 49.9903 96.6205 c
49.6074 96.6083 49.5977 96.2216 49.127 96.2963 c
49.4317 96.2636 49.5899 95.8002 49.3418 95.5414 c
48.9121 95.4716 48.6836 95.6005 48.6953 95.9726 c
48.4453 95.2455 48.1162 95.8984 47.6162 95.5414 c
47.1231 95.5512 47.2022 96.1323 46.8609 96.2963 c
46.3052 96.3163 45.5762 96.1616 45.459 96.6205 c
46.166 94.5746 45.2891 92.5785 44.272 91.3334 c
45.6118 91.8285 46.4209 92.8525 47.0772 94.0302 c
48.0469 94.0302 l
46.3452 88.8295 38.2261 90.0434 36.7202 84.6445 c
35.9649 84.6445 l
35.8628 87.6616 38.479 88.8906 40.711 89.9316 c
38.211 90.4145 36.6792 91.8676 35.8569 94.0302 c
35.042 91.9155 36.7202 90.6342 37.9072 89.8232 c
36.3721 88.6996 35.2129 86.9843 35.6411 84.2133 c
36.0698 84.1293 37.7412 84.7084 38.23 84.2133 c
37.7388 83.5585 36.8418 83.9604 35.8569 83.7812 c
35.6148 82.9804 35.813 81.7392 35.749 80.7602 c
34.9341 80.3163 34.3882 79.6034 33.4829 79.2504 c
33.1851 81.7646 33.501 85.2035 33.375 88.3124 c
33.2998 90.1796 33.5278 92.9443 32.5122 93.7075 c
30.6392 95.1132 27.8018 93.9116 26.0391 92.9516 c
28.9092 95.3325 31.9531 97.5395 34.9932 99.7485 c
38.063 99.6264 41.959 100.0947 45.2432 99.7485 c
45.3008 98.9726 44.313 99.2407 43.7329 99.1015 c
44.0088 98.5136 45.023 97.7314 45.3511 96.8354 c
45.187 97.7304 46.4541 97.9023 46.8609 98.5624 c
47.916 98.4423 48.4746 97.8393 49.4502 98.4545 c
47.6099 98.4882 46.6792 99.0165 45.3511 99.1015 c
45.273 99.4316 45.461 99.4946 45.459 99.7485 c
46.2959 99.9335 46.4121 99.3403 46.7529 99.3163 c
46.9712 99.0712 47.1118 99.8154 47.5088 99.7485 c
48.2481 99.0116 49.7246 100.3124 49.7735 98.8852 c
35.8569 95.5414 m
36.0381 97.3373 37.2271 98.1264 38.1231 99.2094 c
35.749 99.2094 l
35.6372 98.2065 35.4531 96.3705 35.8569 95.5414 c
50.0977 98.4545 m
50.4629 97.8124 51.5742 97.9164 51.5 96.8354 c
51.7998 97.9013 52.6133 98.4555 53.2266 99.2094 c
51.7285 99.2446 50.8711 99.2143 50.0977 98.4545 c
53.6582 95.9726 m
54.5928 96.2182 55.6328 95.6166 56.3555 95.7573 c
58.5723 96.1894 57.875 99.1264 55.9229 99.2094 c
53.8145 99.2983 51.666 96.8432 52.0401 94.6786 c
52.8008 95.2543 52.8067 95.7475 53.6582 95.9726 c
40.604 98.8852 m
39.918 98.7035 39.3672 97.8002 39.417 97.1596 c
39.5601 95.3246 41.6148 96.2216 43.085 95.5414 c
44.1992 95.0253 43.9082 94.2294 44.4878 93.1674 c
45.6748 95.6972 43.5918 99.6806 40.604 98.8852 c
36.5039 94.8935 m
36.5181 93.5424 37.9121 91.5375 39.3091 92.7363 c
41.2139 94.3705 37.2481 96.8085 39.0928 98.7773 c
38.0191 98.3105 36.4839 96.8373 36.5039 94.8935 c
56.3555 93.9223 m
56.3067 92.6113 57.1543 91.3676 58.5117 91.7646 c
61.0049 92.4955 60.5235 98.1523 58.0811 98.3466 c
59.3662 96.4794 57.3242 94.8964 56.3555 93.9223 c
56.2471 91.9804 m
55.416 93.0175 55.9561 94.9975 54.6279 95.3256 c
53.3438 95.6435 52.4453 94.8403 52.3633 93.8144 c
52.2129 91.9277 54.707 90.5693 57.2178 91.1176 c
56.8184 91.6176 56.6133 91.5224 56.2471 91.9804 c
42.8692 94.8935 m
39.9771 95.1244 40.7598 91.6806 38.1231 91.6576 c
40.3491 89.3783 45.959 92.0204 42.8692 94.8935 c
57.3262 72.5615 m
57.3653 74.1406 57.7119 75.9863 57.9727 76.9843 c
57.293 76.1044 56.6895 74.0449 57.3262 72.5615 c
56.7861 67.9228 m
56.1445 70.7685 57.0645 75.1767 54.9531 76.5527 c
56.4502 74.5634 55.8906 70.5136 56.7861 67.9228 c
57.4336 67.5986 m
58.2881 67.1933 57.876 65.5224 58.6211 65.0097 c
58.8389 65.5087 57.957 66.3378 58.2969 66.9511 c
58.9619 66.789 59.0684 66.0693 59.4844 65.6562 c
59.9561 66.581 58.2158 67.9531 57.4336 67.5986 c
f
40.711 73.4247 m
40.7129 74.6454 41.9409 74.6406 42.6543 75.1503 c
42.771 76.2392 42.0391 76.4784 41.791 77.2006 c
42.0669 77.3505 42.8399 76.1786 43.1929 75.6894 c
42.919 74.8476 42.043 73.2968 40.711 73.4247 c
f
6.0801 72.2372 m
6.6851 72.3534 6.731 73.0253 6.9434 73.5322 c
7.6504 73.0527 8.6172 73.4521 9.4253 73.2089 c
10.2144 72.9706 10.4971 72.0546 11.1514 71.8066 c
10.9712 70.9784 10.7813 69.8886 11.1514 69.1093 c
9.77 69.3466 9.0733 70.2675 7.9141 70.7275 c
7.6123 70.5263 7.4981 70.1366 7.375 69.7568 c
6.8091 69.8984 5.8301 69.9824 5.541 69.5409 c
4.9732 70.0888 4.3101 70.54 3.9224 71.2665 c
4.1094 71.8222 4.3863 72.663 4.1382 73.3173 c
4.9741 73.1454 5.3594 72.5234 6.0801 72.2372 c
10.1802 69.6493 m
10.1323 70.12 9.7573 71.2822 10.1802 72.0224 c
9.1641 71.8935 8.188 72.373 7.4834 71.914 c
7.7583 70.5351 9.2134 70.3349 10.1802 69.6493 c
f
39.8482 70.8349 m
40.5713 70.4843 40.2915 68.6601 40.3882 68.0302 c
43.1055 69.6181 44.8394 66.3417 47.8325 66.6279 c
48.2061 66.663 48.586 67.0312 49.0176 66.8427 c
48.5449 66.3818 47.7852 66.206 46.8613 66.1962 c
47.0752 65.5029 48.4219 66.0273 49.0176 65.9814 c
48.086 64.9697 46.3452 65.2363 45.3501 65.9814 c
45.6035 65.4921 46.5454 64.579 47.4004 64.5781 c
50.0342 64.5751 52.3154 70.4511 55.5996 67.3827 c
57.0449 64.3681 52.9395 60.5439 54.6289 58.4277 c
54.5137 58.1825 53.9502 58.3866 53.6582 58.3202 c
53.2969 58.8593 53.1611 59.622 53.0098 60.37 c
52.6514 59.8046 53.1485 58.6708 52.9033 58.2118 c
52.3633 58.2118 l
52.1367 58.6327 52.3086 59.4531 52.2559 60.0468 c
51.6758 59.8339 52.1231 58.5966 51.6084 58.3202 c
51.1895 60.2607 53.1104 62.1874 53.4424 64.2538 c
52.4727 62.3456 51.25 60.6923 50.7451 58.3202 c
50.291 58.2158 49.8125 58.3759 49.127 58.3202 c
50.3477 60.5507 51.7305 62.622 52.6865 65.1171 c
51.3399 62.7968 50.0528 60.4159 48.4795 58.3202 c
47.6743 58.1425 47.1792 58.2656 46.4292 58.3202 c
45.3745 60.5732 44.2285 62.7363 42.9771 64.7929 c
43.5235 62.7861 45.1211 60.8964 45.4585 58.3202 c
44.5571 58.1376 44.7954 59.0947 44.5952 59.6152 c
44.3491 59.1718 44.6245 58.873 44.4873 58.3202 c
44.1851 58.1962 43.9273 58.1962 43.6245 58.3202 c
43.6094 59.0488 44.1113 59.8105 43.6245 60.37 c
43.4444 59.579 43.3872 58.665 42.8692 58.2118 c
41.6821 58.2118 l
41.9424 59.1142 42.9893 59.7695 42.5454 61.0185 c
42.2534 61.0937 42.6231 60.5087 42.3291 60.5859 c
41.7505 60.7363 41.8872 61.329 41.6821 61.8808 c
41.0381 63.6191 39.2915 65.9638 40.3882 67.9218 c
39.8032 68.4277 39.6514 69.9042 39.8482 70.8349 c
47.7241 61.0185 m
47.2544 61.123 47.0962 61.5409 46.6455 61.665 c
48.1289 58.2148 51.1367 64.789 51.3926 65.7646 c
50.2617 64.0898 49.4219 62.1259 47.7241 61.0185 c
47.8325 62.205 m
48.6758 62.3447 49.3438 63.8036 49.666 64.3622 c
48.8985 63.871 48.4082 63.1025 47.6162 62.6347 c
46.2124 63.3183 45.3394 64.5312 44.1631 65.4413 c
45.0371 64.4863 46.2652 61.9443 47.8325 62.205 c
47.5083 59.0761 m
48.2881 59.374 48.7344 60.0068 49.0176 60.8017 c
48.4385 60.5556 48.2227 59.9443 47.6162 59.7226 c
45.9883 61.08 45.1621 63.2392 43.7334 64.7929 c
44.9053 62.8017 45.7515 60.4833 47.5083 59.0761 c
53.6582 59.9394 m
53.9727 59.9023 54.0225 61.0702 53.7656 60.9091 c
53.8233 60.4931 53.5733 60.3827 53.6582 59.9394 c
f
45.2427 72.1298 m
47.3013 72.1386 48.4649 71.2519 49.8809 70.6191 c
49.9854 70.1464 50.0694 69.6562 50.0977 69.1083 c
48.9238 69.2294 47.9385 69.831 47.0777 69.2167 c
46.7373 69.4531 46.4907 69.7822 46.2134 70.08 c
46.1455 70.6884 46.5034 70.87 46.6455 71.2665 c
46.4683 71.8456 45.2827 71.414 45.2427 72.1298 c
f
31.2178 61.4491 m
30.4678 62.2988 29.6387 62.4892 28.7368 63.0673 c
28.4888 62.5292 29.2227 62.0449 29.4907 61.665 c
28.8257 61.79 28.4956 62.2509 28.1968 62.7441 c
27.7407 62.4814 27.7608 61.7411 27.0098 61.7724 c
27.0747 62.3193 27.814 62.1923 27.6568 62.9599 c
27.1157 63.0341 27.1558 62.5263 26.5786 62.6357 c
26.5879 62.789 26.5967 62.9413 26.4707 62.9599 c
26.6939 63.4921 27.416 63.5243 27.981 63.7148 c
28.0767 64.8368 27.312 64.5019 27.2256 65.3329 c
26.9068 65.1845 27.0718 64.5527 26.9028 64.2538 c
26.5259 64.4159 26.8989 65.329 26.4707 65.4413 c
26.2368 65.0995 26.356 64.4052 26.148 64.038 c
25.7578 64.3691 26.085 65.414 25.7158 65.7656 c
25.231 65.4579 25.6299 64.2685 25.5 63.6074 c
25.1109 64.2255 25.3399 65.4599 24.96 66.0878 c
24.71 65.332 24.9238 64.1113 24.853 63.1747 c
24.2988 63.8105 24.2798 65.8798 24.6367 66.7353 c
26.042 66.8857 27.2178 65.2919 28.0889 66.5195 c
28.2178 67.1161 27.5308 66.8964 27.5498 67.3827 c
27.8638 67.6064 27.9556 67.7304 28.4126 67.5986 c
28.6587 67.3056 28.7207 66.8281 28.7368 66.3046 c
29.9248 65.6669 30.4507 67.3339 31.7569 67.2753 c
32.2676 66.0732 31.9468 64.6552 32.189 63.2831 c
31.648 63.9648 31.9068 65.4472 31.7569 66.5195 c
31.3028 65.8954 31.4859 64.6327 31.4326 63.6074 c
30.961 64.1415 31.4199 65.6074 31.1099 66.3046 c
30.7129 65.8027 30.7998 64.8154 30.7857 63.9306 c
30.416 64.3154 30.584 65.2382 30.355 65.7656 c
29.9356 65.331 30.0938 64.9628 30.0308 64.1464 c
29.5977 64.288 29.7236 64.9902 29.7066 65.5488 c
29.1797 65.6093 29.4497 64.871 29.3838 64.4706 c
29.104 64.4052 28.9946 64.5136 29.0596 64.7929 c
28.7559 64.6669 28.7319 64.2577 28.6289 63.9306 c
29.6358 63.3554 30.0767 62.2138 31.6489 62.205 c
31.5259 61.8886 31.586 61.8046 31.8648 61.665 c
31.8408 61.3945 31.0986 62.1874 31.2178 61.4491 c
f
42.1143 107.9477 m
42.1411 106.621 41.917 104.4858 40.604 104.3876 c
39.2271 104.2846 38.124 106.7597 39.2012 108.0556 c
40.3062 108.268 41.1904 108.1376 42.1143 107.9477 c
39.5254 107.517 m
39.4414 107.1376 40.4141 107.2646 40.4961 107.4086 c
40.3521 107.6269 39.7744 107.7338 39.5254 107.517 c
41.0352 106.0058 m
41.418 106.1259 41.3521 106.6957 41.8994 106.6528 c
42.0264 107.1059 41.4434 106.8456 41.3594 107.0849 c
41.4043 107.3281 41.9502 107.0688 41.8994 107.4086 c
41.0952 107.8056 41.1953 106.5888 41.0352 106.0058 c
39.8482 106.8686 m
40.0391 106.7739 40.1631 106.5278 40.3882 106.7607 c
40.4922 107.1567 39.8584 107.1899 39.8482 106.8686 c
41.251 105.4667 m
41.0943 105.6327 40.6983 105.5619 40.3882 105.5746 c
40.2783 105.205 41.1983 105.3178 41.251 105.4667 c
f
25.2842 80.7607 m
25.189 80.4965 24.6821 80.6435 24.7442 80.2216 c
24.9033 79.8408 25.7901 80.1879 25.8233 79.6816 c
25.728 79.0937 24.8169 79.3217 24.4209 79.0346 c
24.4209 78.2797 l
24.4483 78.0556 24.895 78.2509 24.96 78.0639 c
24.6743 77.4286 25.1519 77.2665 25.0679 76.5527 c
25.3989 77.1908 24.6729 77.7787 25.3921 78.1718 c
25.6821 77.8906 25.2603 77.8456 25.2842 77.5248 c
25.5801 77.2807 25.9531 77.1147 25.8233 76.4443 c
25.521 76.3163 25.0791 76.3271 24.6372 76.3378 c
24.398 76.3251 24.5913 75.8798 24.5293 75.6894 c
24.6963 75.3173 25.502 75.5849 25.5 75.0429 c
25.481 74.7021 25.0733 74.7499 24.7442 74.7187 c
24.6973 74.3486 24.7871 74.1152 24.853 73.8564 c
25.1572 73.7665 25.1323 74.0087 25.3921 73.9648 c
25.3389 73.5146 25.52 73.3007 25.8233 73.2089 c
25.2051 72.6396 25.7451 71.9218 25.9312 71.2665 c
25.209 71.912 24.9732 73.0419 24.5293 73.9648 c
23.6172 73.4365 23.4502 72.165 22.8032 71.3749 c
22.27 71.9374 23.6402 72.5839 22.9111 72.9931 c
22.9649 73.3339 23.228 73.4667 23.2339 73.8564 c
23.5283 73.9345 23.4512 73.6415 23.6651 73.6406 c
23.8291 73.9081 24.0889 74.08 24.0972 74.5038 c
24.0733 74.8388 23.5601 74.6855 23.2339 74.7187 c
23.252 74.8447 23.21 74.9111 23.126 74.9345 c
23.1133 75.1288 23.2583 75.163 23.2339 75.3671 c
23.8809 75.3671 l
24.2393 75.4042 24.0503 75.9892 24.0972 76.3378 c
23.6382 76.5605 23.042 75.9472 22.5869 76.4443 c
22.5869 77.2006 l
22.812 77.2626 22.8941 77.4677 23.2339 77.4159 c
23.336 77.8339 22.813 77.8608 23.126 78.1718 c
23.584 78.0385 23.707 78.1318 24.2051 78.1718 c
24.6372 79.6108 22.9693 78.9496 22.5869 79.5737 c
22.6079 80.1996 23.5181 79.9379 23.773 80.3295 c
23.6763 80.6269 23.1563 80.5029 23.126 80.8686 c
23.69 80.9618 24.647 80.9106 25.2842 80.7607 c
f
38.8775 62.6357 m
39.1084 62.2919 39.1157 61.7226 39.0933 61.1259 c
38.5947 61.2978 38.3516 61.0527 38.1226 60.6933 c
38.1485 60.3183 38.5415 59.2861 37.7984 59.3993 c
38.9014 58.8271 38.0474 60.4863 39.0933 60.2626 c
39.2207 59.2353 38.6826 58.8759 38.3384 58.3202 c
37.1514 58.3202 l
36.2417 58.9521 35.8526 61.0263 36.3965 62.4208 c
37.0747 62.6415 38.1797 62.4355 38.8775 62.6357 c
36.8277 60.8017 m
36.9424 61.0468 37.5064 60.8427 37.7984 60.9091 c
37.7905 61.5312 36.4043 61.3408 36.8277 60.8017 c
37.1514 60.1542 m
37.4795 60.1503 37.8613 60.0927 37.7984 60.4775 c
37.6416 60.8095 36.9966 60.7245 37.1514 60.1542 c
38.2305 58.7529 m
38.3633 59.1113 37.5005 59.0156 37.4746 58.8593 c
37.6826 58.7177 37.9097 58.9394 38.2305 58.7529 c
f
38.7695 54.9765 m
39.3657 54.7812 39.5044 54.1288 39.9566 53.789 c
39.8145 53.6015 39.3555 53.1738 39.9566 53.1425 c
39.8355 52.7597 39.4917 52.5995 39.6323 51.955 c
38.7486 51.9335 38.9893 53.038 38.1226 53.0341 c
38.3794 53.4579 38.5635 53.9433 38.1226 54.329 c
38.2305 54.6533 38.4453 54.8681 38.7695 54.9765 c
f
16.1133 52.2792 m
14.3135 56.0058 12.9551 60.0429 12.5532 65.0097 c
11.7144 75.372 15.2715 84.206 19.5664 90.039 c
18.6113 89.7709 18.2861 88.874 18.0552 87.8818 c
17.3233 88.4081 16.9282 89.2709 16.6533 90.2548 c
15.1294 89.8207 14.1753 91.7548 12.6611 91.6572 c
12.6992 92.7367 12.5733 93.6547 12.4453 94.5698 c
13.5542 95.1161 14.7861 95.538 16.0054 95.9731 c
16.0723 95.5107 15.6543 95.5331 15.6821 95.1088 c
16.0083 94.5278 16.8194 94.517 17.6245 94.6782 c
17.6641 94.206 17.1543 94.2851 17.3003 93.707 c
17.7002 93.2118 18.2642 93.8871 18.7022 93.5991 c
20.0235 93.2421 19.1802 91.374 19.8902 90.4711 c
21.6553 92.373 23.2803 94.4159 25.3911 95.9731 c
27.4204 97.4701 29.7354 99.2509 32.0801 100.0727 c
29.7925 98.4711 27.4693 97.2387 25.3911 95.6489 c
23.3692 94.102 21.5635 92.102 19.9971 90.039 c
15.9024 84.644 13.1123 78.1879 12.7691 68.7861 c
19.3071 67.6962 26.0694 68.3515 32.4043 68.8935 c
34.0352 60.5839 32.4151 48.8896 24.3135 48.287 c
18.2241 47.8339 16.2202 52.8671 14.7114 57.4579 c
17.9644 59.9433 16.3794 66.7148 12.9854 67.8144 c
12.7363 62.7314 13.6865 57.664 15.7905 53.6816 c
16.5884 52.1689 17.4844 50.6747 18.3794 49.2577 c
22.6231 42.5361 29.2705 36.9658 37.4741 34.37 c
38.2041 34.1386 39.1445 34.2099 39.6323 33.5068 c
28.4932 36.3925 21.0845 43.0087 16.2212 52.1708 c
15.5025 51.8398 14.7691 52.3525 13.9561 52.2792 c
13.5523 52.1786 13.8154 51.413 13.7403 50.9843 c
12.6402 50.6816 11.5191 50.4003 11.0435 49.4736 c
9.8213 49.6552 8.8574 50.0937 7.5903 50.2284 c
7.7363 51.5937 8.4121 52.4286 8.4531 53.8974 c
8.8194 53.831 8.8384 53.4179 9.1011 53.2499 c
9.7232 53.3827 10.1245 53.7382 10.1792 54.4365 c
10.6582 54.4833 10.4141 53.8075 10.8272 53.79 c
11.9434 54.1347 11.6821 55.4755 12.9854 55.5156 c
13.9102 55.5429 14.7915 54.8876 15.1421 54.1132 c
15.4063 53.5312 15.1655 52.4521 16.1133 52.2792 c
13.0933 93.3837 m
14.1045 92.9828 15.5713 90.809 16.7603 92.3051 c
15.9834 93.247 14.3604 94.7841 13.0933 93.3837 c
19.2422 91.3329 m
19.3164 92.3388 17.8535 92.5937 16.9761 91.873 c
16.9102 90.7651 16.8745 89.6059 17.6245 89.0678 c
17.4273 90.1152 19.1841 90.5532 19.2422 91.3329 c
13.9561 68.0302 m
15.7583 66.2499 17.5684 63.9775 17.1924 60.371 c
17.9434 61.3359 19.8594 58.4599 20.4292 60.4775 c
20.3071 60.7519 19.8872 60.7265 19.7822 61.0175 c
20.5122 61.8359 21.1885 60.9081 21.0762 59.9394 c
22.1714 59.5702 22.8511 60.4335 23.7735 60.5859 c
24.2261 59.6513 24.1182 58.248 23.9893 57.1337 c
23.7671 57.164 23.7744 57.4218 23.6655 57.5654 c
23.6675 58.0351 23.7012 58.5361 23.5581 58.8603 c
23.3511 60.2519 23.6323 57.5517 23.2344 57.4579 c
22.9424 57.8847 23.2603 58.9228 22.8023 59.1825 c
22.7573 58.6894 22.9414 57.9658 22.5864 57.7812 c
22.3784 58.1113 22.5513 58.8251 22.2632 59.0761 c
22.1655 58.7783 22.2295 58.3183 22.0474 58.1054 c
21.8765 58.2939 21.9024 58.6796 21.8325 58.9667 c
21.3482 59.0556 21.8545 58.1533 21.4004 58.2128 c
21.3403 58.4042 21.3443 58.6611 21.1841 58.7519 c
21.0615 58.5156 20.9053 58.3105 20.9683 57.8886 c
21.3731 57.5458 22.4302 57.1747 21.9395 56.5937 c
21.4302 56.6962 21.1792 57.0575 20.8604 57.3495 c
20.6875 56.3124 21.4224 56.1845 21.6162 55.5156 c
20.9585 55.5771 21.0205 56.3583 20.4292 56.4863 c
20.0435 56.3329 19.9795 55.8574 19.5664 55.7324 c
19.6865 56.1855 20.1441 56.3036 19.9971 57.0253 c
19.5484 56.7187 18.9702 56.5429 18.3794 56.3788 c
18.1763 56.1728 18.4434 56.1825 18.3794 55.8388 c
17.9273 56.1855 17.5523 55.7099 17.3003 55.5156 c
17.4502 56.0243 16.8154 55.7499 16.7603 56.0546 c
17.1621 55.9413 16.9722 56.4189 17.1924 56.4863 c
18.6641 55.9784 18.8731 57.5888 19.9971 57.7812 c
20.1133 58.2177 20.1133 58.5312 19.9971 58.9667 c
19.5464 59.0234 19.7012 58.4726 19.4585 58.3202 c
19.1885 58.4111 19.5825 59.164 19.1343 59.0761 c
18.9663 58.6904 19.1914 58.3915 18.9185 57.997 c
18.4341 58.0517 18.9253 59.0829 18.5952 59.2919 c
18.1343 59.0693 18.7144 57.8056 18.0552 57.7812 c
17.9541 58.3632 18.2832 59.3759 17.8403 59.6152 c
17.5161 59.0761 18.0503 57.6777 17.4082 57.4579 c
17.2534 58.1659 17.3843 59.1601 17.1924 59.831 c
16.8125 59.8163 16.8853 59.3466 16.7603 59.0761 c
17.4141 58.8759 17.0313 57.1415 16.6533 56.9179 c
16.6592 57.5712 16.6841 58.2431 16.4375 58.6435 c
16.1812 57.9648 15.4722 57.7382 15.1421 57.1337 c
16.2271 53.5693 18.0523 49.7646 22.0474 48.9335 c
23.6362 48.6034 26.1485 48.8505 27.1182 50.0136 c
25.9634 49.7695 25.5513 50.7841 24.5283 50.9843 c
24.4653 50.0566 25.0073 49.7372 25.3911 49.2577 c
24.5713 49.2284 24.3872 49.8359 24.2051 50.4452 c
23.6792 50.2646 23.5054 49.2343 22.9102 49.4736 c
23.2984 49.9491 23.7251 50.3847 23.6655 51.3075 c
23.3281 50.7089 21.6392 50.6835 22.1553 49.9062 c
21.4912 50.1015 21.7334 49.3915 21.2925 49.3661 c
21.4624 49.955 20.8443 49.4804 20.8604 49.6904 c
20.8731 50.1152 21.3291 50.0195 21.0762 50.4452 c
22.1011 50.3661 22.7285 51.5888 23.4502 52.1708 c
23.1631 52.2802 23.2363 52.749 23.0181 52.9257 c
22.8335 52.7509 22.9761 52.249 22.5864 52.2792 c
22.6104 52.6269 22.3955 52.7353 22.4785 53.1415 c
22.0313 53.121 22.3174 52.3681 21.8325 52.3866 c
21.7534 52.6318 22.0264 53.2275 21.6162 53.1415 c
21.4873 52.7314 21.6504 52.0292 21.2925 51.8476 c
21.1182 52.3574 21.1465 53.0693 20.8604 53.4658 c
20.7783 52.829 21.0864 51.8017 20.5371 51.6318 c
20.4673 52.3183 20.5513 53.1572 20.1055 53.4658 c
20.0405 52.6679 20.2295 51.6152 19.6743 51.3075 c
19.7471 52.3525 19.5703 53.1454 19.5664 54.1132 c
20.7642 54.9179 22.3843 53.0771 23.8814 53.8974 c
24.0513 54.6074 23.5703 54.665 23.4502 55.0839 c
24.7705 55.7743 24.4185 54.413 24.7442 53.5741 c
26.2925 53.3202 26.6074 54.2997 27.9815 54.2206 c
28.6411 53.4033 28.1182 51.8359 28.1973 50.9843 c
27.6524 51.665 28.0064 52.747 27.7652 53.5741 c
27.4605 53.0878 27.8594 51.8984 27.5493 51.4159 c
27.1963 51.747 27.3775 52.6113 27.3335 53.2499 c
26.6973 53.2031 27.3125 51.9052 26.7944 51.7402 c
26.5464 52.0312 26.8985 52.9218 26.4712 53.0341 c
26.2022 52.871 26.5371 52.1054 26.2554 51.955 c
25.7754 51.9804 26.3023 53.0097 25.8233 53.0341 c
25.5762 52.9218 25.8745 52.2636 25.6074 52.1708 c
25.2031 52.163 25.5801 52.9345 25.1763 52.9257 c
25.2783 52.4872 25.0962 52.0468 24.7442 52.3866 c
24.3511 51.3007 25.7705 51.5058 25.9312 50.6611 c
26.3804 50.5458 26.4072 50.6327 26.9024 50.6611 c
26.6734 50.2509 27.1035 50.1454 27.4424 50.0136 c
29.6714 51.7402 31.3653 54.0009 31.9732 57.3495 c
31.2803 57.3163 31.7261 59.2265 31.4331 59.9394 c
31.1924 59.3525 31.4453 58.2734 31.1094 57.7812 c
30.9605 58.207 30.9531 58.7763 30.8945 59.2919 c
30.6802 59.3925 30.8535 58.1845 30.5703 57.997 c
30.4185 58.3847 30.5772 59.082 30.2461 59.2919 c
29.9873 59.1552 30.3062 58.4413 30.0313 58.3202 c
29.6904 58.3749 29.8565 58.9365 29.5991 59.0761 c
29.4492 58.9013 29.5083 58.5195 29.2754 58.4286 c
29.2393 58.6796 29.1651 58.8925 28.9512 58.9667 c
28.7964 58.7275 28.6812 58.4482 28.7363 57.997 c
29.8775 57.7353 29.8482 56.3036 31.3252 56.3788 c
31.1143 56.1767 31.2925 55.9843 31.3252 55.7324 c
30.8892 55.8788 30.9434 55.538 30.7861 55.4081 c
30.7754 55.7568 30.4873 55.8281 30.2461 55.9472 c
30.2564 56.1171 30.5215 56.0322 30.4624 56.2704 c
29.8653 56.6435 29.2002 56.9501 28.6284 57.3495 c
28.5361 56.249 29.4854 55.6181 29.7075 55.1923 c
28.8623 55.0302 29.0762 55.9277 28.5215 56.0546 c
27.9331 55.957 27.6914 54.9462 27.0103 55.2997 c
27.6802 55.7079 28.0581 56.4091 28.1973 57.3495 c
27.5703 57.3652 27.6055 56.7187 27.2261 56.4863 c
26.4961 57.0712 26.1865 55.5517 25.6074 55.8388 c
25.7505 56.3437 26.2612 56.4804 26.6865 56.7021 c
26.9722 56.9531 26.4004 56.9921 26.6865 57.2421 c
27.1904 57.3847 27.4483 57.7753 27.9815 57.8886 c
27.9883 58.4003 27.9981 58.913 27.6572 59.0761 c
27.7085 58.7372 27.5235 58.6347 27.3335 58.5361 c
27.2495 58.7763 27.2715 59.121 27.0103 59.1825 c
27.0132 58.749 26.9795 58.3515 26.6865 58.2128 c
26.6895 58.6484 26.6553 59.0449 26.3633 59.1825 c
26.3511 58.6933 26.3604 58.1786 26.0391 57.997 c
26.0532 58.622 26.0215 59.2021 25.7153 59.5068 c
25.4492 58.7968 25.9063 58.0273 25.3911 57.5654 c
25.3413 58.3056 25.3394 59.0947 25.0684 59.6152 c
24.8623 58.8866 25.1421 57.6699 24.7442 57.1337 c
24.8755 58.3036 24.5142 59.4482 24.7442 60.371 c
26.0005 60.7021 26.6763 59.6845 27.9815 59.7226 c
28.0703 59.9931 28.2764 60.1474 28.3042 60.4775 c
28.2593 60.9003 27.6875 60.7958 27.6572 61.2333 c
27.9375 61.3486 28.1865 61.496 28.6284 61.4491 c
28.9912 61.0204 28.8115 60.0497 29.2754 59.7226 c
30.4942 59.6562 30.6631 60.6357 31.8653 60.5859 c
31.8643 60.4775 31.9522 60.4579 31.9732 60.371 c
32.0015 59.6425 31.5195 58.3085 32.1885 57.7812 c
32.4903 61.2626 32.4185 64.6952 31.9732 68.1376 c
26.0235 67.8105 19.9273 67.2128 13.9561 68.0302 c
12.6611 53.0341 m
13.4273 52.8652 13.9263 52.4296 14.9263 52.495 c
15.0635 55.1699 12.7915 55.7704 12.6611 53.0341 c
8.7774 50.3368 m
10.4043 50.4716 11.2403 51.3984 12.5532 51.8476 c
12.4541 52.3417 12.8233 52.3681 12.7691 52.8183 c
11.1734 53.0527 8.7744 52.4023 8.7774 50.3368 c
f
45.4585 53.79 m
45.8965 53.6298 45.8726 52.4784 45.4585 52.1708 c
45.8814 52.2685 46.1314 52.3027 46.4297 52.0634 c
46.3794 51.1786 46.2153 50.4072 46.1055 49.582 c
45.5835 50.7499 44.9927 51.8486 44.3794 52.9267 c
45.1973 52.7568 45.4224 53.1777 45.4585 53.79 c
f
grestore
gsave
-5.166 .0059 m
98.595 .0059 l
98.595 119.4179 l
-5.166 119.4179 l
-5.166 .0059 l
clp
69.374 9.0359 m
66.6182 9.0359 l
66.6182 .4409 l
80.8067 .4409 l
80.8067 3.9609 l
75.1592 3.9609 l
75.1592 8.7639 l
72.457 8.7639 l
72.457 3.9609 l
69.374 3.9609 l
p
80.8067 22.5488 m
76.2227 19.4099 l
75.6221 18.9999 75.0488 18.6179 74.667 18.3469 c
74.1758 20.3925 72.8125 21.7841 70.6289 21.7841 c
67.8731 21.7841 66.5361 19.7099 66.5361 16.2179 c
66.5361 14.4159 66.5645 12.2619 66.6182 11.1149 c
80.8067 11.1149 l
80.8067 14.6359 l
75.2676 14.6359 l
75.2676 14.7719 l
80.8067 18.2649 l
80.8067 22.5488 l
p
70.9844 18.0449 m
72.1572 18.0449 72.9483 17.1729 72.9483 15.8089 c
72.9483 15.4269 72.9483 14.9889 72.8945 14.6359 c
69.2656 14.6359 l
69.2383 14.9619 69.21 15.3169 69.21 15.6989 c
69.21 17.1459 69.8653 18.0449 70.9844 18.0449 c
80.8067 32.9511 m
77.9961 32.9511 l
77.9961 27.7402 l
74.8867 27.7402 l
74.8867 32.706 l
72.2119 32.706 l
72.2119 27.7402 l
69.374 27.7402 l
69.374 32.9511 l
66.6182 32.9511 l
66.6182 24.2206 l
80.8067 24.2206 l
p
80.8701 39.1796 m
66.5645 39.1747 l
66.5645 35.498 l
80.8701 35.4941 l
p
76.3867 53.3886 m
74.8574 53.3886 73.6582 52.5976 73.2207 51.0146 c
73.1934 51.0146 l
72.6485 52.4335 71.4483 53.1972 70.083 53.1972 c
67.8457 53.1972 66.5361 51.6425 66.5361 47.8222 c
66.5361 45.9394 66.6182 43.62 66.6182 42.1747 c
80.8067 42.1747 l
80.8067 44.3574 80.8613 46.2118 80.8613 47.249 c
80.8613 51.915 78.5156 53.3886 76.3867 53.3886 c
70.6016 49.4589 m
71.8301 49.4589 72.4297 48.3408 72.4297 46.6767 c
72.4297 46.4853 72.4297 46.0761 72.4033 45.6659 c
69.0195 45.6659 l
69.0195 46.1308 68.9922 46.7031 68.9922 47.1406 c
68.9922 48.913 69.6465 49.4589 70.6016 49.4589 c
76.3867 49.6777 m
77.5606 49.6777 78.3516 48.8866 78.3516 47.1669 c
78.3516 46.621 78.3242 46.0761 78.2695 45.6659 c
74.6406 45.6659 l
74.6133 46.0214 74.6133 46.5673 74.6133 46.8671 c
74.6133 48.6406 75.1309 49.6777 76.3867 49.6777 c
75.3223 68.7665 m
66.6182 68.7665 l
66.6182 65.3017 l
74.8867 65.3017 l
76.9317 65.3017 78.1328 64.455 78.1328 62.2997 c
78.1328 60.3075 77.2051 59.2714 75.0215 59.2714 c
66.6182 59.2714 l
66.6182 55.7509 l
75.8125 55.7509 l
79.0332 55.7509 81.0528 57.7978 81.0528 62.1083 c
81.0528 66.7743 78.4873 68.7665 75.3223 68.7665 c
80.8067 83.1464 m
76.2227 80.0082 l
75.6221 79.5986 75.0488 79.2162 74.667 78.9443 c
74.1758 80.9902 72.8125 82.3823 70.6289 82.3823 c
67.8731 82.3823 66.5361 80.3085 66.5361 76.8154 c
66.5361 75.0146 66.5645 72.8593 66.6182 71.7138 c
80.8067 71.7138 l
80.8067 75.2333 l
75.2676 75.2333 l
75.2676 75.3691 l
80.8067 78.8622 l
80.8067 83.1464 l
p
70.9844 78.6435 m
72.1572 78.6435 72.9483 77.7704 72.9483 76.4062 c
72.9483 76.0243 72.9483 75.5868 72.8945 75.2333 c
69.2656 75.2333 l
69.2383 75.5605 69.21 75.915 69.21 76.2978 c
69.21 77.7431 69.8653 78.6435 70.9844 78.6435 c
80.0156 96.4394 m
73.249 96.4394 l
73.249 92.9194 l
77.6963 92.9194 l
77.8594 92.4282 77.9414 91.8285 77.9414 91.2275 c
77.9414 88.9081 76.4414 87.3261 73.7119 87.3261 c
70.9024 87.3261 69.3184 89.1542 69.3184 91.6371 c
69.3184 93.0014 69.5918 94.2563 70.1113 95.5112 c
67.082 96.1664 l
66.5918 94.6381 66.3731 93.0834 66.3731 91.5551 c
66.3731 86.5341 69.7559 83.5873 73.9844 83.5873 c
78.6778 83.5873 81.0528 86.7255 81.0528 90.9272 c
81.0528 92.9462 80.6699 94.7475 80.0156 96.4394 c
false s
1 .75 0 0 k
f
57.5996 13.1339 m
48.8223 13.1339 l
48.8223 9.6389 l
57.1602 9.6389 l
59.2227 9.6389 60.4336 8.7859 60.4336 6.6129 c
60.4336 4.6049 59.499 3.5579 57.2969 3.5579 c
48.8223 3.5579 l
48.8223 .0089 l
58.0957 .0089 l
61.3418 .0089 63.3779 2.0719 63.3779 6.4199 c
63.3779 11.1249 60.792 13.1339 57.5996 13.1339 c
63.1309 30.9267 m
48.8223 30.9267 l
48.8223 27.4872 l
54.8477 27.5146 l
56.334 27.5146 57.5176 27.5429 58.3701 27.5976 c
58.3701 27.5702 l
57.4072 27.1298 56.499 26.6337 55.6465 26.0839 c
48.8223 21.9286 l
48.8223 17.1689 l
63.1309 17.1689 l
63.1309 20.581 l
56.0586 20.581 l
54.9317 20.581 54.2149 20.5527 53.5274 20.498 c
53.5274 20.5263 l
54.3262 20.8837 55.3438 21.3788 56.1426 21.874 c
63.1309 26.1669 l
63.1309 30.9267 l
p
63.1621 39.1738 m
48.8555 39.1738 l
48.8555 35.4941 l
63.1621 35.4941 l
p
f
0 1 .8 .2 k
84.285 35.4839 14.31 3.681 rectfill
31.149 35.4839 14.328 3.69 rectfill
grestore
grestore
grestore
grestore
end
restore
showpage
%%EOF
