%!PS-Adobe-3.0 EPSF-3.0
%%BoundingBox: 0 0 100 117
%%HiResBoundingBox: 0 0 99.45 116.28
%%Title: ufcd-logo-e1-right-dl-color
%%CreationDate: 2009-12-08T12:58+0100
%%Creator: Project ufcd
%%LanguageLevel: 2
%%DocumentData: Clean7Bit
%%Pages: 1
%%EndComments
%%Page: 1 1
save
0 0 99.45 116.28 rectclip
9 dict begin
/k{setcmykcolor}bind def
/p{closepath}bind def
/c{curveto}bind def
/f{fill}bind def
/l{lineto}bind def
/m{moveto}bind def
/s{setoverprint}bind def
/np{newpath}bind def
/clp{clip np}bind def
gsave
np
gsave
0 119.414 m
0 0 l
104.965 0 l
104.965 119.414 l
p
clp
gsave
0 .002 m
104.967 .002 l
104.967 119.414 l
0 119.414 l
0 .002 l
clp
gsave
53.127 39.161 m
104.967 39.161 l
104.967 119.414 l
53.127 119.414 l
53.127 39.161 l
clp
49.2988 116.247 m
64.3398 116.9018 76.3691 110.936 84.2539 103.3007 c
92.3164 95.4941 98.4902 84.9531 99.3574 70.3954 c
99.8223 62.6161 98.1641 55.7792 95.7979 50.0048 c
93.4229 44.2128 90.2891 39.2197 86.4121 35.2245 c
78.3672 26.9423 68.2646 20.7187 53.291 20.121 c
38.4355 19.5273 26.4126 25.3076 18.3359 33.0673 c
14.1709 37.0683 10.8926 41.5107 8.0869 46.9853 c
5.3579 52.3066 3.3657 58.6767 3.1235 66.08 c
2.6196 81.5068 8.3648 92.8901 15.9619 101.143 c
21.6567 107.331 29.1089 111.9077 38.6177 114.7368 c
41.9229 115.7197 45.5005 116.081 49.2988 116.247 c
16.1777 100.3876 m
12.4648 96.3749 9.1206 91.5746 6.8999 85.9321 c
6.3525 84.5419 6.0088 82.9589 5.4966 81.3998 c
5.0015 79.8886 4.5469 78.2158 4.3106 76.6533 c
1.4199 57.539 8.5825 42.8642 18.8745 33.3906 c
26.7695 26.1249 38.4038 19.8369 53.3984 20.6601 c
68.459 21.4872 78.0508 27.6103 85.9795 35.6562 c
87.9717 37.6777 89.7793 39.8759 91.2666 42.2382 c
95.9102 49.6152 99.2256 58.6747 98.7109 70.3954 c
98.3926 77.6259 96.541 83.6069 93.8555 89.2758 c
92.5537 92.0219 91.1934 94.5029 89.4316 96.7197 c
87.6768 98.9277 85.9492 101.205 83.8223 103.0849 c
75.5723 110.3788 64.2988 116.5947 48.7588 115.6 c
33.5596 114.6269 23.7959 108.621 16.1777 100.3876 c
false s
0.7 .45 0 0 k
f
66.4531 112.3632 m
56.9043 111.8413 46.9385 112.4594 36.5688 112.4711 c
45.2788 115.7402 57.8506 115.5195 66.4531 112.3632 c
f
38.7261 112.04 m
46.9331 111.5717 57.4648 112.0947 64.6182 111.6078 c
64.1816 110.8178 62.9863 111.1767 62.2451 111.1767 c
53.9316 111.1767 47.9824 110.933 40.02 111.2836 c
39.5493 111.3046 38.479 111.1547 38.2944 111.8237 c
38.4541 111.8798 38.5664 111.9838 38.7261 112.04 c
f
66.8848 111.7158 m
69.3711 111.6357 71.4893 110.435 73.4648 109.4506 c
75.8369 108.269 78.0625 106.5239 80.1543 104.9189 c
89.8027 97.5146 97.1055 86.0268 98.0625 70.6113 c
98.8105 58.5898 94.6563 48.5195 89.4316 41.1591 c
86.6777 37.2783 83.8965 34.2656 80.2617 31.3408 c
79.1143 30.4169 77.6855 29.704 76.3779 28.8603 c
73.4482 26.9667 70.5303 25.3535 66.8848 24.0048 c
63.3516 22.6982 59.7344 21.916 55.4482 21.5234 c
56.3066 22.2031 57.5176 22.1064 58.5771 22.2792 c
61.7656 22.7949 64.8828 23.7783 67.6387 24.7597 c
67.4336 25.4169 67.3086 26.1562 66.9922 26.7021 c
66.4355 26.8124 66.0527 26.3456 65.6973 26.5937 c
65.4941 27.4794 66.3359 27.3222 66.4531 27.8886 c
65.8643 29.5654 65.7891 31.7568 64.2949 32.5283 c
64.2813 32.9726 64.4824 33.2031 64.4033 33.7138 c
64.8662 33.4589 65.4316 33.3036 66.1289 33.2831 c
66.498 30.8466 67.3438 28.8876 68.3945 27.1327 c
68.2051 26.4228 67.7656 25.9638 67.8555 24.9755 c
72.4844 26.5351 76.7422 29.1191 80.4766 32.0956 c
84.6992 35.4609 88.8223 40.039 91.6982 45.0429 c
95.2363 51.2001 98.1426 60.4872 97.7393 69.6406 c
97.1348 83.3798 91.0215 94.6889 82.959 101.8979 c
82.6504 101.8837 83.0527 101.1577 82.7432 101.143 c
82.3848 101.2519 81.5703 100.9047 81.5566 101.3578 c
81.332 102.416 82.293 101.624 82.6348 102.1137 c
78.2578 106.1869 73.4521 109.8329 66.8848 111.7158 c
f
71.9551 108.8032 m
71.292 108.351 70.5313 107.997 70.1211 107.2919 c
70.4453 106.538 70.9805 105.9941 71.3066 105.2421 c
71.6758 102.393 69.2422 102.3461 67.6387 101.4672 c
67.0762 101.7661 67.0293 102.582 66.5605 102.977 c
66.166 103.2651 66.123 102.4579 65.8047 102.33 c
64.9219 102.7128 64.0234 103.5082 64.5107 104.9189 c
65.3281 105.309 66.2305 104.9531 66.7773 104.4882 c
66.918 104.5248 66.9453 104.6772 67.0996 104.7031 c
66.582 105.9511 64.4824 106.7138 65.4824 108.4789 c
66.2305 107.5732 67.0176 106.707 67.9629 105.998 c
68.9336 107.2802 64.8301 108.1459 66.4531 110.4208 c
68.7344 111.6533 70.4883 109.6992 71.9551 108.8032 c
67.0996 110.3129 m
67.2441 109.122 69.6152 106.7621 70.3369 108.1562 c
69.8066 109.3578 68.7227 110.5629 67.0996 110.3129 c
70.0117 102.977 m
70.3965 104.2929 69.2471 106.6269 68.2871 105.5659 c
68.9609 105.2631 69.5107 104.0229 68.8262 103.3002 c
68.1934 103.603 68.1338 104.4789 67.3164 104.5952 c
67.3203 104.4091 67.2324 104.3193 67.0996 104.2719 c
67.5996 103.5849 68.0332 102.83 68.6094 102.2221 c
69.1426 102.4091 69.6523 102.6171 70.0117 102.977 c
64.834 104.2719 m
64.293 103.684 65.0176 102.9111 65.5898 102.7612 c
65.7832 102.998 66.0098 103.204 66.1289 103.5161 c
65.7217 103.7929 65.4414 104.1962 64.834 104.2719 c
f
51.8877 110.7451 m
51.7441 109.0903 54.6426 109.7402 54.8008 108.0483 c
54.5996 107.7421 53.959 107.435 53.5059 107.7241 c
53.5605 108.3012 54.0664 108.0112 54.3691 108.1562 c
53.1504 109.0131 50.0732 109.0331 48.8672 108.1562 c
48.79 107.8622 49.376 108.2328 49.2993 107.9399 c
49.208 107.4081 48.6182 107.9799 48.3271 107.9399 c
48.5532 109.2602 49.9873 109.373 51.1318 109.7739 c
51.1621 110.162 50.9326 110.2939 50.917 110.6371 c
51.0967 110.8168 51.5498 110.7221 51.8877 110.7451 c
f
56.0957 110.7451 m
56.5859 108.6039 56.6123 104.8681 56.3105 102.6533 c
55.5898 103.3251 55.9131 104.5952 55.8799 105.5659 c
55.8271 107.103 55.7227 108.7841 55.7715 110.4208 c
55.7422 110.5961 55.874 110.6069 55.8799 110.7451 c
56.0957 110.7451 l
p
f
55.2324 110.6367 m
55.4316 108.3666 55.874 104.8188 55.3398 102.8686 c
55.3223 105.6264 55.2852 108.0248 55.2324 110.6367 c
f
56.7432 110.6367 m
57.2002 108.8798 56.8477 105.5317 56.958 103.0844 c
56.5371 104.9965 56.832 108.0869 56.7432 110.6367 c
f
62.8926 110.6367 m
63.2168 110.6367 l
63.4072 108.1938 63.5752 105.4536 63.3242 102.7617 c
62.5303 103.1796 62.9395 104.7958 62.8926 105.8896 c
62.8281 107.3535 62.7168 108.9496 62.7842 110.3134 c
62.7539 110.4877 62.8867 110.4994 62.8926 110.6367 c
f
62.2441 110.5292 m
62.5664 108.705 62.5723 105.33 62.4609 102.8691 c
61.9668 104.9999 62.3818 108.041 62.2441 110.5292 c
f
63.7559 110.4213 m
63.998 108.3593 64.0117 104.8461 63.9707 102.8691 c
63.6201 105.1411 63.8223 107.518 63.7559 110.4213 c
f
74.7598 107.7241 m
74.7598 107.0761 l
74.4063 106.9272 74.0068 106.8222 73.4648 106.8613 c
73.4678 107.1152 73.2793 107.1782 73.3574 107.5082 c
73.8691 107.537 74.1895 107.7553 74.7598 107.7241 c
f
54.2617 105.998 m
54.1406 105.436 53.375 105.5175 53.3984 104.811 c
53.7285 104.4877 53.832 105.3066 54.2617 105.2426 c
54.8936 104.9057 54.9082 103.6137 54.6924 102.7617 c
54.3672 102.6415 53.6006 102.5566 53.291 102.7617 c
53.3467 103.2807 53.6621 103.541 53.9385 103.8398 c
53.4844 104.3876 53.1338 103.1938 52.9668 102.7617 c
51.9033 102.6567 52.2119 104.3788 53.291 104.3798 c
52.7686 104.6816 52.126 104.1796 51.9951 103.7328 c
51.5459 103.7856 51.4385 104.1826 51.3486 104.5947 c
52.7256 104.5536 52.8799 106.748 54.2617 105.998 c
f
73.8965 105.998 m
75.1758 103.0175 71.3809 102.6469 71.8467 99.8486 c
71.3359 99.8925 71.1045 99.6557 70.5527 99.7407 c
70.666 100.5019 70.334 100.8168 70.2285 101.3588 c
71.5234 102.1298 73.1289 103.686 72.6016 105.5668 c
72.8154 105.9277 73.3477 105.9716 73.8965 105.998 c
f
61.8135 105.7822 m
61.6641 104.7084 60.2314 104.9194 60.1953 103.7324 c
59.4844 103.4721 59.0381 102.9472 58.3613 102.6533 c
58.2188 103.2621 58.7891 103.1601 58.793 103.6244 c
58.5586 104.3984 57.6055 104.4511 57.3906 105.2421 c
58.2129 105.7602 58.7451 104.3603 59.1162 103.7324 c
60.4219 103.9423 60.0059 106.4301 61.8135 105.7822 c
f
61.5977 104.811 m
62.125 104.1269 60.8926 103.4672 60.8418 102.6533 c
60.3164 102.7031 59.5801 102.541 59.2246 102.7612 c
59.291 103.1972 59.7988 103.1928 60.1953 103.3002 c
60.5332 103.933 60.8145 104.623 61.5977 104.811 c
f
57.498 104.2714 m
58.583 104.2768 58.4912 102.9116 57.7129 102.6528 c
57.2695 102.7817 57.3193 103.8676 57.498 104.2714 c
f
61.8135 103.5165 m
61.6494 103.2055 61.8174 103.1791 61.707 102.7612 c
61.2744 102.7612 l
61.2949 103.1723 61.4277 103.4711 61.8135 103.5165 c
f
75.1914 103.5165 m
76.1143 103.2621 77.2324 103.4946 78.2119 103.5165 c
78.5156 102.3452 78.5293 100.8842 79.0752 99.9565 c
78.8477 99.5986 78.7617 100.2792 78.4277 100.1723 c
78.0234 99.7851 77.5645 99.4526 77.6719 98.5541 c
77.3691 98.9604 77.0176 98.6122 76.7012 98.4462 c
76.5801 97.9565 76.6074 97.3173 76.4863 96.8286 c
75.584 95.9985 73.8369 96.1855 72.9258 96.8286 c
72.1445 97.3784 72.1992 98.5165 71.415 98.7695 c
71.8125 99.0195 72.6719 98.8076 73.249 98.8774 c
73.3145 99.5903 73.0605 99.9833 73.1406 100.7123 c
73.8398 101.6323 74.8516 102.2363 75.1914 103.5165 c
74.7598 99.0932 m
76.6016 99.1454 77.8652 101.3744 76.8086 102.9775 c
76.0645 101.8315 73.9883 101.0566 74.7598 99.0932 c
73.1406 98.5541 m
72.7656 96.2133 76.1914 96.0644 75.4072 98.5541 c
75.001 98.9125 73.5586 98.8574 73.1406 98.5541 c
f
64.7266 102.1142 m
64.6387 101.1332 63.2168 101.4672 62.3535 101.4672 c
59.4082 101.4672 55.4824 101.3803 52.751 101.5742 c
52.8174 101.8329 52.6162 102.3574 52.8584 102.4369 c
57.0723 102.3012 60.6387 102.5702 64.7266 102.1142 c
f
65.8047 101.0351 m
65.4111 100.7358 64.1504 100.873 63.7559 100.9267 c
64.4277 101.1869 65.1328 101.1347 65.8047 101.0351 c
f
66.9922 100.1718 m
66.7393 99.5678 65.8633 99.851 65.374 99.8491 c
61.3555 99.8271 56.2637 99.8452 52.8584 100.1718 c
52.876 100.2968 52.835 100.3642 52.751 100.3881 c
52.7998 100.4838 52.8447 100.581 52.9678 100.603 c
56.5254 100.5732 59.6406 100.496 63.6465 100.496 c
64.7881 100.496 66.0605 100.7612 66.9922 100.1718 c
f
81.6641 100.496 m
81.5059 99.935 81.5654 99.1581 81.5566 98.4457 c
80.2021 97.5351 78.7656 96.705 78.3203 94.8862 c
77.9082 94.665 77.4951 94.8637 77.0254 94.8862 c
77.0254 96.5038 l
78.5234 97.2612 80.0605 98.4692 80.0469 100.3881 c
80.7031 100.3061 81.0244 100.56 81.6641 100.496 c
f
65.1582 99.5248 m
66.1357 99.5937 67.0576 98.4809 67.8555 97.7988 c
69.3711 96.5029 70.5107 95.4389 71.9551 94.2387 c
72.6416 93.6679 73.5859 93.2709 73.8965 92.4037 c
72.1152 93.2079 70.7734 94.6547 69.3652 95.8569 c
67.9453 97.0688 66.3633 98.0995 65.1582 99.5248 c
f
55.3398 95.3173 m
55.668 97.664 57.0996 99.3163 59.8711 98.8774 c
60.3623 98.412 60.8691 97.8154 60.627 96.9355 c
60.1328 95.1401 56.2422 96.9721 55.3398 95.3173 c
59.332 96.3964 m
61.6406 96.9721 58.8633 100.0161 58.3613 97.3671 c
57.9902 97.4643 57.8926 97.8334 57.3906 97.7983 c
56.8291 97.5312 55.9609 97.0014 56.2031 96.288 c
56.8398 97.1513 58.3848 96.1591 59.332 96.3964 c
f
83.8223 98.7695 m
84.3867 98.6142 84.9951 98.5043 85.7637 98.5546 c
84.1113 96.8974 82.0234 95.6762 80.5859 93.8066 c
80.5098 93.4067 80.7695 93.3432 80.6934 92.9433 c
80.2109 92.7783 79.7031 92.6396 79.0752 92.6196 c
79.3398 93.0644 78.8389 93.9604 79.0752 94.3466 c
80.7285 95.7494 82.4668 97.0693 83.8223 98.7695 c
f
61.8135 97.9067 m
61.9053 97.9267 61.916 97.8647 61.9219 97.7988 c
63.7539 96.6357 63.6455 91.0873 60.3027 92.0805 c
58.2861 94.4145 62.5713 95.1655 61.8135 97.9067 c
60.1953 93.9145 m
59.4463 91.1933 63.7793 92.7368 61.5977 94.1303 c
61.9385 94.1835 61.9795 93.9355 62.3525 94.0224 c
63.0352 94.5424 62.8066 96.2187 62.1367 96.6118 c
62.4355 95.4545 60.4297 94.7665 60.1953 93.9145 c
f
87.9219 95.8564 m
86.4219 94.0126 83.7773 93.3124 82.3125 91.4335 c
82.3125 90.4623 l
81.8984 90.5536 81.4463 90.6035 80.9092 90.5707 c
80.6523 91.0737 81.0078 91.5253 80.9092 92.1884 c
82.6094 93.5453 84.6729 94.5375 86.0869 96.1806 c
86.584 95.9575 87.2598 95.9145 87.9219 95.8564 c
f
59.6563 91.2177 m
57.6016 90.8744 55.2617 92.3627 55.7715 94.2387 c
56.0859 95.3945 58.2754 95.3598 58.5762 94.1308 c
58.8574 92.9907 58.6777 91.8369 59.6563 91.2177 c
56.6348 93.0517 m
57.0176 92.8935 57.2813 93.3989 57.3906 93.1596 c
57.3848 92.8046 57.209 92.6215 57.2832 92.1884 c
57.6602 91.8476 58.084 91.5517 58.793 91.5405 c
58.2354 92.4228 58.3721 93.9985 57.6064 94.6699 c
56.1738 95.0844 55.8604 93.6225 56.6348 93.0517 c
f
78.6436 89.8149 m
76.3027 89.8051 74.3027 89.5468 72.0625 89.8149 c
71.9688 90.1801 72.9385 90.955 73.4648 91.433 c
74.0801 91.9911 74.8076 92.4628 75.1914 93.0512 c
76.5957 92.225 77.5254 90.9262 78.6436 89.8149 c
f
88.0303 92.9438 m
88.0078 92.2455 87.5938 91.9409 87.7061 91.1088 c
87.1875 90.3476 83.7432 89.7509 84.0381 88.4125 c
84.3457 87.0175 88.1426 89.0927 88.4609 90.1386 c
89.0781 90.2158 89.4258 90.0239 89.9727 90.0307 c
89.8457 89.4736 89.4902 89.1459 89.4316 88.5209 c
87.7852 87.8305 85.7842 87.4926 85.1172 85.8237 c
84.6328 85.7709 84.3086 85.8779 83.9297 85.9316 c
83.8945 86.5776 84.2715 86.8129 84.2539 87.4409 c
84.0303 87.9369 83.0762 87.7026 82.6348 87.9809 c
82.6094 88.6909 82.9297 89.0546 82.8516 89.8149 c
84.0176 90.8779 86.3223 90.8027 86.4111 92.9438 c
87.125 93.0097 87.2852 92.9716 88.0303 92.9438 c
f
51.4561 92.0805 m
52.9727 90.3964 55.4785 89.7026 57.1748 88.1967 c
57.2217 87.8495 57.3818 87.6118 57.3896 87.2265 c
59.0703 88.3286 62.3467 87.0405 62.0293 84.8525 c
61.5068 86.8886 58.5605 88.1796 57.0664 86.2543 c
57.7891 89.7817 52.1787 89.3173 51.4561 92.0805 c
f
79.291 89.2758 m
77.4141 88.9218 73.9453 88.9174 71.9551 89.2758 c
74.8008 89.1528 76.6211 89.5536 79.291 89.2758 c
f
75.1914 88.7358 m
75.2891 86.8798 75.293 85.5927 75.2988 83.3417 c
74.5811 83.3398 73.9355 83.2807 73.0332 83.2338 c
72.709 84.9667 72.752 87.1459 72.8184 88.7358 c
75.1914 88.7358 l
p
73.1406 88.0898 m
73.2344 86.4457 72.9824 85.0727 73.3574 83.666 c
73.8496 83.7119 74.5449 83.5556 74.8672 83.7739 c
74.7988 85.2158 75.0059 86.933 74.7598 88.1967 c
74.3125 88.4506 73.5732 88.1957 73.1406 88.0898 c
f
78.5352 88.6284 m
78.7627 86.9101 78.5801 84.9843 78.751 83.4501 c
77.9658 83.2485 76.8711 83.3383 76.1621 83.3422 c
76.251 85.3832 76.0059 87.1894 76.1621 88.7353 c
76.9287 88.6752 77.9453 88.8642 78.5352 88.6284 c
76.4863 88.0893 m
76.5684 86.6254 76.2646 84.7753 76.8086 83.7734 c
77.0107 84.8842 76.5801 86.8442 76.918 88.0893 c
76.9023 86.4101 77.0781 85.4692 77.0254 83.6655 c
78.3203 83.6655 l
78.5068 85.0263 78.3164 86.8823 78.2119 88.3041 c
77.7178 88.5424 76.8877 88.2934 76.4863 88.0893 c
f
72.2783 88.6284 m
72.709 87.0522 72.4395 84.9384 72.6016 83.3422 c
71.9785 84.3041 72.416 86.6635 72.2783 88.6284 c
f
75.623 88.6284 m
76.0508 87.3305 75.8408 84.8193 75.7305 83.3422 c
75.3008 84.6425 75.5156 87.1484 75.623 88.6284 c
f
79.1826 83.4501 m
78.6992 84.6918 79.0967 86.8159 78.9678 88.412 c
f
91.374 87.226 m
91.165 86.7162 90.7344 86.4272 90.6201 85.8232 c
90.8691 85.1752 91.8047 85.2109 92.4531 84.9599 c
92.2979 84.289 91.7598 83.999 91.5898 83.3422 c
91.8652 82.7538 92.7217 82.748 93.208 82.371 c
93.3271 81.7612 92.6172 81.1078 92.3447 80.537 c
90.6426 80.2612 88.7969 80.1288 88.2451 78.7031 c
87.8125 78.8823 87.3984 79.0781 86.8428 79.1342 c
87.2305 81.5161 90.9111 80.6039 91.8057 82.4789 c
90.3496 83.5038 87.8721 82.2001 86.9512 81.2919 c
86.4375 81.2812 86.1445 81.4931 85.7637 81.6161 c
86.0996 84.0849 90.0449 82.9443 90.9434 84.853 c
90.3799 85.8642 89.7168 85.2411 88.5684 84.853 c
87.4248 84.4653 86.4189 84.5702 85.9805 83.665 c
85.4766 83.5942 85.2871 83.8349 84.9004 83.8808 c
85.0469 84.4189 85.2031 84.9452 85.4395 85.3911 c
86.957 85.6611 89.1445 86.1288 89.8633 87.5493 c
90.5068 87.58 90.9336 87.3959 91.374 87.226 c
f
57.6064 82.4789 m
57.0547 81.9868 56.001 81.9975 55.125 81.832 c
54.5283 83.2138 53.8721 84.5346 52.2119 84.853 c
52.1377 85.8969 52.5332 86.4726 52.8594 87.1176 c
55.582 86.7128 56.8105 84.8129 57.6064 82.4789 c
f
73.4648 87.1176 m
73.7168 86.5058 73.502 85.4286 73.5732 84.6367 c
73.6172 84.2475 73.376 84.4887 73.4648 84.7446 c
73.4648 85.3915 l
73.4707 86.3237 73.3359 86.4096 73.4648 87.1176 c
f
51.9951 83.1259 m
51.3213 83.1889 51.8213 82.0781 51.1328 82.1552 c
51.1143 81.9208 51.5156 82.1059 51.6729 82.0468 c
51.3721 81.6122 50.5098 81.8832 50.4858 82.371 c
49.6816 81.5561 48.2075 81.412 47.4648 80.537 c
47.6274 80.3808 48.0117 80.9189 48.2197 81.0761 c
48.4136 80.5561 47.5044 80.2109 47.5728 79.4579 c
47.1846 79.5019 47.4048 80.1533 47.0327 80.2128 c
47.0947 80.9789 47.6084 81.291 48.1118 81.6161 c
47.7397 85.8681 55.1514 85.2802 54.584 81.6161 c
55.1016 81.1611 55.7539 80.8432 55.6641 79.7822 c
55.3262 79.7319 55.3203 80.0121 55.3408 80.3212 c
54.7813 81.2348 53.3672 81.2958 52.5361 81.9389 c
52.5117 82.4799 52.4971 82.8632 51.9951 83.1259 c
53.9385 81.832 m
53.5625 81.9599 53.2178 82.1181 52.8584 82.2631 c
53.0684 81.7529 53.7715 81.7372 54.3691 81.6161 c
54.373 81.978 54.2207 82.186 54.0449 82.371 c
53.9863 82.2138 54.1719 81.8129 53.9385 81.832 c
f
61.166 84.4208 m
61.9697 84.2538 63.4707 84.7836 63.7549 84.0966 c
63.3389 83.6699 61.7617 83.8837 61.166 83.9897 c
61.166 84.4208 l
p
f
63.7559 83.2338 m
62.7764 83.288 62.4219 83.0048 61.8135 83.3422 c
61.9502 83.8661 63.5879 83.6889 63.7559 83.2338 c
f
80.2617 82.8027 m
77.626 82.3056 74.0381 82.7255 70.9844 82.5869 c
70.9844 82.9106 l
71.0703 82.9306 71.0908 83.0185 71.1992 83.0175 c
74.0684 82.8764 77.5869 83.3017 80.2617 82.8027 c
f
72.3867 80.8608 m
72.0176 80.8154 71.7715 80.8935 71.8457 81.2914 c
72.1943 81.4677 72.4727 81.3857 72.3867 80.8608 c
f
72.8184 81.3998 m
72.9746 81.3061 73.1602 81.2387 73.1406 80.9692 c
73.0449 80.8847 72.8965 80.852 72.71 80.8608 c
72.6758 81.1098 72.7266 81.2748 72.8184 81.3998 c
f
74.0039 81.3998 m
74.2637 81.0952 74.6572 81.5488 74.8672 81.2919 c
74.8672 80.8608 l
73.7891 80.8608 l
73.7725 81.1288 73.959 81.1948 74.0039 81.3998 c
f
78.2119 81.3998 m
78.585 81.475 78.5996 81.0219 78.4277 80.8608 c
78.0537 80.7851 78.041 81.2387 78.2119 81.3998 c
f
79.9375 80.9687 m
79.6563 80.9384 79.4746 81.0077 79.5078 81.2914 c
79.6563 81.4516 80.0195 81.3486 79.9375 80.9687 c
f
71.3066 81.2919 m
71.5918 81.3251 71.585 81.0668 71.6309 80.8613 c
71.2715 80.7519 71.2773 81.0102 71.3066 81.2919 c
f
76.0547 81.2919 m
76.2051 80.6581 75.3379 80.8271 75.1914 81.0771 c
75.2148 81.412 75.7275 81.2592 76.0547 81.2919 c
f
77.2412 81.1845 m
77.2305 80.8784 76.498 80.7426 76.4863 81.0766 c
76.3535 81.4355 77.2148 81.3403 77.2412 81.1845 c
f
78.752 81.2919 m
79.291 81.2919 l
79.291 80.8613 l
78.9219 80.8159 78.6758 80.893 78.752 81.2919 c
f
54.3691 80.7529 m
55.4873 80.7187 55.3262 78.6396 54.1533 78.8105 c
54.1836 78.9994 53.8496 79.3486 54.1533 79.4575 c
54.3828 79.5087 54.3584 79.3036 54.3691 79.1347 c
55.1191 79.3857 54.7109 80.3906 54.3691 80.7529 c
f
73.1406 80.537 m
73.1943 80.1972 72.6465 80.456 72.6016 80.2133 c
72.6348 79.8491 73.0801 79.9003 73.1406 79.5663 c
73.1563 79.0829 72.6211 79.1513 72.2783 79.0263 c
72.2119 78.7343 72.416 78.1703 72.1699 78.0551 c
72.0195 78.6411 71.8125 79.205 71.1992 79.5663 c
71.124 79.9653 71.5771 79.8349 71.7383 79.997 c
71.6445 80.1552 71.5771 80.3393 71.3066 80.3212 c
71.8125 80.6703 72.4521 80.7221 73.1406 80.537 c
f
54.4766 80.4291 m
54.375 80.0112 54.8984 79.9853 54.585 79.6743 c
54.333 79.8173 54.2754 80.1562 54.1543 80.4291 c
54.4766 80.4291 l
p
f
92.0215 79.6738 m
92.9238 79.8969 93.1777 79.1279 92.8848 78.4868 c
92.1289 78.4868 l
91.7881 78.852 91.8311 79.1918 92.0215 79.6738 c
f
90.4033 78.1635 m
90.2773 78.1454 90.3125 77.9667 90.2949 77.8398 c
89.8535 77.6044 89.4297 77.5878 89.1074 77.9477 c
88.7676 79.0756 90.4844 79.0595 90.4033 78.1635 c
f
74.4355 77.8398 m
74.5742 78.1088 75.042 77.8076 75.083 77.624 c
75.041 77.0917 74.6055 76.9506 74.5439 76.4365 c
74.001 76.3613 73.833 76.6611 73.8965 77.1928 c
74.2676 77.145 74.502 77.2348 74.7598 77.3007 c
74.8105 77.6386 74.626 77.7407 74.4355 77.8398 c
f
76.2695 77.9477 m
76.5361 77.9619 76.79 77.9638 76.918 77.8398 c
76.7656 77.6679 76.5459 77.5639 76.2695 77.5165 c
76.2695 77.9477 l
p
f
54.3691 77.5165 m
53.7383 76.6005 52.7002 76.0917 52.2119 75.0341 c
52.8496 75.2978 53.3398 76.6386 54.3691 76.8691 c
54.6641 76.5888 55.1367 76.4853 55.3398 76.1132 c
54.1211 74.9589 53.0879 73.6191 52.751 71.582 c
51.7178 71.2841 51.0928 72.0829 51.4561 72.9843 c
51.7773 72.9902 52.0869 73.1679 52.6436 73.2011 c
52.7939 73.998 52.083 73.9345 52.1035 74.6035 c
51.7998 74.5829 51.9697 74.0908 51.5645 74.1718 c
51.7354 75.5185 52.8086 77.9091 54.3691 77.5165 c
f
94.6113 77.0844 m
94.1914 74.746 89.6445 76.787 88.7852 74.7119 c
89.7461 73.4667 92.6455 74.1161 93.9629 74.8183 c
94.457 74.7372 94.7627 74.4677 95.1494 74.2792 c
94.7656 73.8378 94.2852 73.4902 93.9629 72.9843 c
92.7871 73.2509 91.2441 72.9794 90.0801 72.8779 c
89.6367 72.6738 89.6152 72.0458 89.1084 71.9052 c
88.7744 72.1474 88.4355 72.3837 88.0293 72.5536 c
88.3242 73.0136 88.8125 73.2792 89.1084 73.7392 c
88.9492 74.4804 88.0518 74.4814 87.7051 75.0341 c
87.8057 75.6904 88.3984 75.8525 88.4609 76.5449 c
90.082 76.5781 91.3672 76.9472 92.8848 77.0844 c
93.3613 77.7275 94.0762 77.6332 94.6113 77.0844 c
f
76.4863 77.1923 m
76.8164 77.2704 76.8037 77.0063 77.1328 77.0844 c
77.2197 76.6015 76.9414 76.4853 76.5938 76.4374 c
76.4453 76.5761 76.4863 76.9052 76.4863 77.1923 c
f
56.5273 70.1796 m
56.0918 70.5517 56.248 70.9589 56.5273 71.3661 c
56.0156 71.3388 55.9199 70.8945 55.3398 70.9355 c
55.1631 71.4951 55.248 72.1835 55.4482 72.662 c
54.833 72.5214 55.2656 71.3329 54.585 71.2587 c
53.9414 72.5947 54.8203 74.2529 55.3398 75.1425 c
54.2227 74.4628 54.4277 72.4589 53.5059 71.5829 c
52.9287 72.1923 53.458 73.3857 53.8301 74.0634 c
54.2305 74.7939 55.0313 75.4658 55.5566 75.79 c
57.8516 74.454 58.3555 71.3242 58.6855 68.0214 c
58.4336 67.6835 58.2793 68.3115 57.9297 68.454 c
57.1768 68.7597 56.126 68.5175 55.4482 68.5615 c
55.5029 69.3349 55.3086 69.8593 55.125 70.3954 c
55.543 70.6513 56.1387 70.2978 56.5273 70.1796 c
f
95.4746 71.3671 m
95.1504 70.7187 94.4043 70.4941 94.0703 69.8554 c
94.4043 69.2548 95.0107 68.9257 95.582 68.5615 c
95.2578 67.9511 94.6074 67.6669 94.1787 67.1591 c
93.083 67.4374 90.2168 67.996 89.6484 66.8359 c
89.1777 67.0117 88.8125 67.2939 88.3535 67.4824 c
88.5273 67.9921 88.9697 68.2314 89.3242 68.5615 c
90.8408 68.5165 93.4277 68.0517 94.1787 69.1005 c
93.0039 70.9999 89.2188 68.7831 88.2451 70.1796 c
88.8906 72.2128 93.2383 69.7968 94.0703 71.9062 c
94.6758 71.8632 95.0977 71.6376 95.4746 71.3671 c
f
53.8301 67.1591 m
53.3984 68.0742 54.1201 70.8388 52.5352 70.9355 c
53.7949 71.706 55.6406 70.5107 55.0176 68.3456 c
54.7676 67.8027 54.1758 67.6044 53.8301 67.1591 c
f
82.2041 67.1591 m
82.3301 67.1415 82.2949 66.9619 82.3125 66.8359 c
80.6797 65.2304 79.4844 63.1894 77.7813 61.6572 c
79.124 63.622 80.7432 65.3115 82.2041 67.1591 c
f
67.748 67.0517 m
68.3945 67.0517 l
69.5684 66.4951 68.4902 64.0087 67.4238 65.2167 c
69.0059 65.0507 68.7285 66.789 67.748 67.0517 c
f
68.9336 66.9433 m
69.1992 67.2363 69.5889 66.7421 69.5811 66.4042 c
69.1504 66.3701 69.2891 66.9033 68.9336 66.9433 c
f
81.0176 66.1884 m
80.752 66.3896 80.459 66.5654 80.2617 66.8349 c
80.4316 67.2568 81.0176 66.6152 81.0176 66.1884 c
f
71.416 66.8349 m
71.9531 67.0341 72.625 66.9374 72.8184 66.4042 c
73.0693 65.707 72.5859 64.9052 72.1699 64.7851 c
71.0303 64.454 69.8535 66.2597 71.416 66.8349 c
72.4941 66.5117 m
71.957 66.9081 71.1758 66.6269 70.877 66.1884 c
70.7715 65.4365 71.2129 65.2304 71.5234 64.8935 c
72.3057 64.9863 72.7832 65.6699 72.4941 66.5117 c
f
80.3691 66.5117 m
80.748 65.3671 80.0703 64.7226 79.1826 64.8935 c
77.4648 65.2245 78.8418 68.1103 80.3691 66.5117 c
79.7227 65.1093 m
80.5449 65.3388 80.25 67.2128 79.0762 66.6191 c
78.1328 66.1445 78.916 64.8847 79.7227 65.1093 c
f
72.9258 66.7275 m
73.2617 67.1269 73.3848 66.4023 73.5732 66.2968 c
73.3252 65.9863 73.1094 66.6161 72.9258 66.7275 c
f
75.9463 66.6201 m
78.332 66.2314 75.0742 63.3495 74.543 65.4326 c
74.3555 66.1728 74.791 66.4619 75.1914 66.8349 c
75.5039 66.4667 74.6641 66.3906 74.7598 65.6494 c
74.9844 63.9091 77.7051 65.621 75.9463 66.6201 c
f
76.4863 64.1376 m
76.2236 64.3583 75.9697 63.6523 75.7305 63.4911 c
76.1582 62.8749 76.7998 62.4736 77.1328 61.7646 c
76.5156 62.1191 76.1113 62.6855 75.7305 63.2753 c
75.0078 62.955 74.749 62.1708 74.2207 61.6572 c
73.8516 61.9599 74.6504 62.7519 75.083 62.9521 c
76.0684 64.3408 77.1377 65.6445 78.3203 66.8349 c
77.9824 65.9492 77.1973 65.5117 76.8086 64.6777 c
78.5742 65.5859 79.3965 62.5175 77.5645 62.412 c
76.8799 62.373 76.0313 63.0595 76.4863 64.1376 c
77.457 62.6269 m
78.3184 62.6035 78.8262 63.8046 77.9961 64.4619 c
76.1484 64.8017 76.2871 62.6601 77.457 62.6269 c
f
74.4355 66.6201 m
73.0537 65.0165 71.8184 63.2665 70.2285 61.873 c
71.5361 63.4775 72.9277 65.5751 74.4355 66.6201 c
f
77.0254 66.6201 m
77.1855 66.9433 77.5098 66.54 77.4561 66.2958 c
77.1113 66.2011 77.2334 66.5761 77.0254 66.6201 c
f
97.0918 65.7568 m
97.1426 65.4179 96.8018 65.4706 96.7676 65.2167 c
96.2422 65.3017 96.1172 65.789 95.6895 65.9726 c
95.874 67.082 96.7637 66.0732 97.0918 65.7568 c
f
95.3652 65.541 m
94.5586 63.6689 90.9668 65.665 89.54 64.246 c
89.0547 64.4804 88.6855 64.831 88.3535 65.2167 c
88.4746 65.707 89.0518 65.7402 89.3242 66.08 c
90.5 65.8827 91.998 65.6279 93.208 65.8642 c
93.5498 65.9316 93.8857 66.3915 94.0703 66.4033 c
94.71 66.4452 94.7607 65.6259 95.3652 65.541 c
f
70.0117 65.7568 m
70.623 65.2519 71.082 64.5956 71.5234 63.9218 c
70.9922 64.4462 70.0596 65.1044 70.0117 65.7568 c
f
73.8965 65.6484 m
74.5469 65.1835 74.9492 64.4697 75.5146 63.9218 c
74.8301 63.9228 74.3008 65.0077 73.8965 65.6484 c
f
77.7803 65.6484 m
78.6006 65.4628 78.6211 64.4755 79.291 64.1376 c
78.7148 64.1396 78.1348 65.0663 77.7803 65.6484 c
f
70.5527 64.5693 m
71.0449 64.1269 70.9355 62.9765 70.4453 62.6279 c
69.7871 62.5458 69.3672 62.7011 69.042 62.9511 c
68.5352 64.0712 69.3965 65.1122 70.5527 64.5693 c
70.0117 62.8437 m
70.8809 62.999 70.9463 64.8925 69.5811 64.3544 c
68.4834 63.9199 69.3242 62.7197 70.0117 62.8437 c
f
72.71 64.246 m
73.3564 64.9003 74.5703 64.5195 74.7598 63.9218 c
75.416 61.8535 71.8438 61.8661 72.71 64.246 c
73.7881 62.5204 m
74.7285 62.6025 74.8193 64.7548 73.4648 64.3544 c
72.2764 64.0029 72.9395 62.4462 73.7881 62.5204 c
f
67.4238 64.4619 m
67.707 64.4951 67.7773 64.3134 67.748 64.0312 c
67.4238 64.0312 l
67.4238 64.4619 l
p
f
63.5391 64.246 m
63.5 63.8183 63.6387 63.2119 63.4316 62.9521 c
61.75 63.0077 60.0918 62.8622 58.793 62.8427 c
58.209 65.0488 61.7832 64.0214 63.5391 64.246 c
f
94.9346 62.7363 m
94.666 62.2499 94.0654 62.0937 93.748 61.6572 c
93.9297 61.0839 94.4922 60.8915 94.8262 60.4697 c
94.4961 59.9716 93.8994 59.7431 93.5313 59.2841 c
92.2793 59.6376 91.0303 59.8515 89.5391 59.7148 c
89.127 60.5244 88.4287 61.0488 87.8135 61.6572 c
88.2783 62.2353 88.791 62.7656 89.3242 63.2744 c
90.7461 63.288 92.8926 62.6181 93.8555 63.4911 c
94.4121 63.4355 94.6641 63.0781 94.9346 62.7363 c
88.7852 61.0097 m
90.0684 60.8788 92.4473 60.2802 93.5313 61.0097 c
93.5039 62.4999 89.0186 62.6982 88.7852 61.0097 c
f
68.2871 63.3827 m
68.8711 63.0312 69.2197 62.4462 69.6895 61.9804 c
69.0859 61.8827 68.5332 62.7656 68.2871 63.3827 c
f
71.9551 63.1669 m
72.4883 63.2314 72.9082 62.2519 73.3574 61.872 c
72.79 61.7744 72.4336 62.8173 71.9551 63.1669 c
f
68.7188 61.873 m
68.3086 62.039 68.1143 62.4199 67.4238 62.3046 c
67.7148 62.7744 68.8418 62.5048 68.7188 61.873 c
f
80.4775 61.873 m
79.8867 61.9931 79.0898 62.1259 78.4277 61.6572 c
78.6514 62.58 79.9932 62.4951 80.4775 61.873 c
f
58.9004 62.3046 m
59.291 62.4062 59.0508 61.8798 59.1152 61.6572 c
59.541 61.5927 59.0889 62.4033 59.5479 62.3046 c
59.5273 61.1396 59.6777 59.7714 59.6563 58.3124 c
59.1875 58.9941 59.498 60.457 59.2246 61.332 c
59.0234 60.7577 59.5479 58.8701 59.0078 58.3124 c
59.0332 59.9306 58.8691 60.6933 58.9004 62.3046 c
f
72.6016 61.873 m
72.4102 61.6826 71.4375 62.3886 70.876 61.7646 c
71.1113 62.4687 72.2227 62.3593 72.6016 61.873 c
f
76.4863 61.6572 m
76.0947 61.9423 75.2305 62.4052 74.9746 61.6572 c
74.3906 62.2792 76.457 62.5986 76.4863 61.6572 c
f
63.5391 57.5566 m
64.1797 55.8564 61.668 56.5829 60.8418 56.5859 c
54.8652 56.6122 45.7402 56.4306 39.1572 56.6943 c
39.2246 56.9872 39.0205 57.5497 39.2656 57.665 c
46.4854 57.8369 56.0576 57.956 63.5391 57.5566 c
f
53.1826 56.1552 m
56.5273 56.1552 l
57.5371 56.1552 58.7813 56.415 59.333 55.831 c
57.7607 56.0712 55.1279 55.4697 53.5059 55.831 c
53.3145 55.874 53.1875 55.7763 53.1826 56.1552 c
f
92.1289 54.5361 m
92.5664 54.3261 92.7676 53.8788 92.8848 53.3505 c
92.4521 53.207 91.9473 53.1367 91.5898 52.9179 c
91.6914 52.372 92.1123 52.1454 92.2373 51.623 c
91.6797 51.6425 91.3789 51.4023 90.9424 51.2988 c
90.8828 51.6699 90.6289 51.8486 90.4033 52.0556 c
90.5117 52.5566 91.2207 52.4599 91.374 52.9179 c
90.2148 53.6699 88.4688 55.0517 86.7354 54.2128 c
86.5977 54.6874 86.126 54.8271 86.0879 55.3994 c
86.6387 55.5322 86.9961 55.8583 87.3828 56.1552 c
88.5469 55.3408 90.0752 54.8925 91.374 54.2128 c
91.792 54.1542 91.8184 54.4872 92.1289 54.5361 c
f
59.6563 56.0468 m
61.2188 55.3447 62.6641 54.5253 63.4316 53.0263 c
62.1152 53.9755 60.6797 54.8046 59.6563 56.0468 c
f
63.3242 54.2128 m
62.5664 54.1894 61.9063 55.1581 61.2734 55.6161 c
62.0723 56.8095 64.3838 55.5722 63.3242 54.2128 c
f
81.8799 55.831 m
82.3066 56.0742 82.7461 55.4052 82.8516 54.9677 c
82.4316 55.1601 82.3232 55.662 81.8799 55.831 c
f
78.5352 55.7236 m
78.7871 55.9326 79.209 55.3935 79.291 55.0761 c
78.8652 55.1171 78.7939 55.5146 78.5352 55.7236 c
f
69.042 55.7236 m
68.8193 55.4052 68.7168 54.9706 68.2871 54.8603 c
68.332 55.3535 68.5215 55.704 69.042 55.7236 c
f
73.6807 55.6152 m
74.8691 55.8495 75.2461 53.872 74.2207 53.5654 c
72.8877 53.1689 72.0684 55.2968 73.6807 55.6152 c
73.0332 54.5361 m
73.0898 53.6523 74.4922 53.4628 74.7598 54.5361 c
74.5039 55.6992 72.9668 55.5771 73.0332 54.5361 c
f
77.9961 53.5654 m
77.0039 53.7187 76.5176 54.0331 76.4863 54.6445 c
76.3633 56.9599 80.3184 54.8007 77.9961 53.5654 c
78.4277 54.7529 m
78.3652 55.4296 77.7979 55.4863 77.457 55.3994 c
75.3711 54.873 78.625 52.6249 78.4277 54.7529 c
f
70.876 55.6152 m
71.25 55.5224 71.3623 55.1669 71.6309 54.9687 c
71.3398 54.7197 70.9355 55.2753 70.876 55.6152 c
f
74.8672 55.5077 m
75.0762 55.7431 75.4727 55.2558 75.5137 54.9687 c
75.2314 55.08 75.1514 55.3954 74.8672 55.5077 c
f
69.582 55.3994 m
71.373 55.9296 71.2051 53.2792 69.9043 53.2411 c
68.7578 53.2089 68.3252 55.0273 69.582 55.3994 c
70.1211 53.5654 m
70.5859 53.7001 70.8936 54.4931 70.4443 55.0761 c
68.6182 55.8954 68.6719 53.1435 70.1211 53.5654 c
f
61.2734 54.3212 m
61.0625 53.7607 61.0352 53.331 61.2734 52.8095 c
60.5859 52.7783 60.374 52.2714 59.6563 52.2704 c
59.2852 52.5488 59.666 52.8115 59.6563 53.1337 c
59.6523 53.2617 59.4082 53.3212 59.4395 53.4579 c
59.5723 54.0263 60.3086 54.3095 60.1953 54.9677 c
60.6855 54.8818 61.0625 54.6845 61.2734 54.3212 c
60.0879 53.8886 m
60.5195 53.8886 l
60.6133 54.2343 60.3535 54.2265 60.1953 54.3212 c
60.1621 54.1747 60.042 54.1152 60.0879 53.8886 c
f
53.3984 54.5361 m
55.6426 54.6591 57.4668 54.3622 59.5488 54.3212 c
59.1113 53.7636 59.2461 53.2568 59.0078 52.5947 c
58.1328 52.581 57.2578 52.5702 56.6348 52.8105 c
56.2725 52.5263 56.4785 51.6708 55.9883 51.5156 c
55.459 51.6699 55.0723 51.9677 54.9092 52.4863 c
55.4912 52.4941 55.4805 52.5351 55.8789 52.5947 c
56.1348 52.7353 56.0879 53.1777 56.2031 53.457 c
56.5879 53.6249 56.2676 53.0908 56.5273 53.1347 c
56.7656 53.1786 56.6309 53.7255 56.4199 53.6728 c
55.9453 53.7158 56.0469 53.1826 55.8789 52.9179 c
54.9746 52.873 53.5879 52.3808 52.9678 53.0263 c
53.0996 53.541 53.3232 53.9628 53.3984 54.5361 c
f
72.0625 54.3212 m
72.6787 53.8574 73.2109 53.3105 73.5723 52.5937 c
72.9043 53.0048 72.3926 53.5722 72.0625 54.3212 c
f
75.9463 54.3212 m
76.5938 53.9609 76.9082 53.2685 77.457 52.8095 c
76.9014 52.832 76.3057 53.7441 75.9463 54.3212 c
f
79.8301 54.3212 m
80.4199 53.9765 80.7559 53.3769 81.2324 52.9179 c
80.7373 52.9286 80.1445 53.7695 79.8301 54.3212 c
f
62.6768 53.0263 m
62.2217 52.705 61.7129 53.0976 61.2734 53.1337 c
60.8867 54.5624 62.5879 53.9951 62.6768 53.0263 c
f
75.7305 53.3505 m
77.2305 53.5175 76.9316 51.0644 75.623 51.1923 c
74.623 51.29 74.333 53.1943 75.7305 53.3505 c
75.083 51.8388 m
75.4375 51.496 76.2246 51.6035 76.4863 51.9472 c
76.8389 53.6826 74.4336 53.2294 75.083 51.8388 c
f
73.0332 52.3788 m
72.8555 51.9101 72.6592 51.4589 72.2783 51.1913 c
69.0508 51.1376 71.874 54.8886 73.0332 52.3788 c
70.9834 52.2704 m
70.9375 51.4296 72.2129 51.0087 72.71 51.9472 c
72.7373 53.3017 71.0391 53.2939 70.9834 52.2704 c
f
92.0215 50.6523 m
92.2861 50.0185 92.667 49.5009 92.9922 48.9257 c
92.7129 48.2695 92.6582 47.3906 92.0215 47.0927 c
91.3984 47.8984 92.4023 48.4531 92.2373 49.4658 c
91.8672 49.4042 91.5771 49.2626 91.374 49.0341 c
89.6162 49.9736 88.25 51.3046 85.7637 51.5156 c
85.6064 51.9697 85.2041 52.1786 85.1172 52.7031 c
85.4648 52.8945 85.8926 53.0048 86.1953 53.2411 c
87.8828 52.124 89.541 50.9765 92.0215 50.6523 c
f
53.6143 52.4863 m
54.1533 52.4863 l
54.125 52.0478 53.9502 51.7548 53.8301 51.4081 c
53.5791 51.6484 53.4688 52.1494 53.6143 52.4863 c
f
59.2246 52.3788 m
59.3984 52.4091 59.4102 52.2763 59.5479 52.2704 c
59.5996 51.832 59.0967 51.5888 58.9004 51.7314 c
58.9971 51.9579 59.0684 52.2109 59.2246 52.3788 c
f
53.0742 52.0556 m
53.8555 51.7997 53.666 50.5859 53.7217 49.3583 c
53.7686 48.3173 54.0947 47.2568 53.8301 46.7695 c
53.041 47.2636 53.043 49.412 52.9668 50.6523 c
52.9443 51.0087 52.9834 51.3818 52.9668 51.7314 c
52.9365 51.9062 53.0684 51.9169 53.0742 52.0556 c
f
61.5977 51.8398 m
62.3594 50.6552 61.752 48.206 61.4893 46.9853 c
61.2207 46.8935 60.9121 46.8437 60.5186 46.8759 c
60.584 48.288 61.3809 50.3144 61.0586 51.8398 c
61.3262 51.6982 61.5059 52.1562 61.5977 51.8398 c
f
62.1367 51.8398 m
62.3516 51.8398 l
63.3252 51.5634 63.666 46.9833 62.1367 46.8759 c
62.0586 48.3466 62.5059 50.2265 62.1367 51.8398 c
f
74.0039 51.7314 m
74.5391 51.7607 75.0859 50.872 75.4072 50.3281 c
74.8076 50.664 74.5488 51.3408 74.0039 51.7314 c
f
70.0117 51.7314 m
70.7129 51.4609 70.9795 50.7568 71.5234 50.3281 c
70.8945 50.2402 70.3438 51.1601 70.0117 51.7314 c
f
63.1074 51.623 m
63.3594 51.5146 63.4561 51.2529 63.4316 50.8681 c
63.1289 50.9257 63.2324 51.3886 63.1074 51.623 c
f
89.7559 48.9257 m
89.752 48.3115 90.251 48.1992 90.2949 47.6308 c
89.8809 47.4355 89.4023 47.3017 89 47.0917 c
87.5078 47.8818 86.3145 49.4911 84.2539 49.3583 c
84.3105 49.9169 83.8623 49.9736 83.9297 50.5449 c
84.4297 50.621 84.7246 50.9003 85.2246 50.9765 c
86.2559 50.0292 87.4727 49.2685 88.8926 48.7109 c
89.3438 48.6191 89.4023 48.9199 89.7559 48.9257 c
f
58.9004 48.3867 m
58.9609 46.9345 57.165 46.1943 56.5273 47.5234 c
56.1934 47.329 56.4697 47.1933 56.4199 46.7685 c
55.9922 46.8085 55.3848 46.6699 55.125 46.8769 c
55.1934 47.7079 55.4951 48.3046 55.7715 48.9257 c
57.0566 48.9892 58.0947 48.8046 58.9004 48.3867 c
f
88.7852 45.6904 m
88.8965 44.6152 89.665 44.1962 89.9727 43.3163 c
89.3984 43.4619 89.125 43.9081 88.5684 44.0712 c
88.0313 43.9619 88.0029 43.3437 87.7061 42.9921 c
87.2051 43.2665 87.2041 44.0224 87.5977 44.3945 c
86.4414 45.4921 85.1211 47.371 82.959 46.7695 c
82.7734 47.1952 82.5645 47.5976 82.4199 48.0634 c
83.04 48.1669 83.6445 48.5595 84.1465 48.4941 c
84.7471 48.4169 85.0527 47.7831 85.5488 47.416 c
86.5645 46.6611 87.7227 46.0576 88.7852 45.6904 c
f
54.2617 47.6318 m
54.5635 47.5732 54.4609 47.1122 54.584 46.8769 c
54.2168 46.8681 54.2656 47.2763 54.2617 47.6318 c
f
63.4316 46.3378 m
63.4375 45.8056 63.5176 44.3261 63.3242 43.6396 c
62.6621 44.6982 62.3203 45.956 60.8428 45.6904 c
59.5176 45.4531 60.041 43.8398 58.6855 43.5322 c
58.2285 44.9052 56.6611 46.4579 55.2324 45.0429 c
54.8223 44.6367 54.627 43.5976 54.1543 43.5322 c
53.332 43.4189 53.6055 44.1015 53.0742 44.8271 c
52.7646 45.2519 51.9033 45.8447 51.0244 45.6904 c
49.8188 45.4775 49.8691 43.499 48.436 43.748 c
47.8291 46.331 44.8618 46.1826 44.1201 43.748 c
43.689 43.748 l
43.1079 44.79 42.5557 46.0898 41.3149 46.0136 c
40.1357 45.9404 40.1001 44.5527 39.2651 43.8554 c
39.1177 44.5009 39.063 45.8085 39.2651 46.4443 c
39.248 46.5702 39.2891 46.6367 39.373 46.6611 c
47.2388 46.538 56.21 46.4003 63.4316 46.3378 c
f
91.374 45.2577 m
91.1729 45.1718 90.9785 45.0781 90.7266 45.0429 c
90.5918 45.5556 90.2217 45.832 90.1875 46.4452 c
91.0195 47.0995 90.9883 45.6923 91.374 45.2577 c
f
83.9297 45.2577 m
83.9297 44.1796 l
86.0762 45.0761 86.7168 42.1572 85.9805 40.4042 c
85.2793 40.4941 84.5381 40.5439 83.7139 40.5117 c
82.4688 41.4062 81.6641 43.1308 79.8301 43.0995 c
79.7598 43.4745 79.4766 44.0429 79.6152 44.287 c
80.1729 44.1122 80.877 44.1806 81.2324 44.5029 c
81.1592 45.2079 81.2383 45.4257 81.125 46.122 c
82.5176 46.6181 82.8418 45.3964 83.9297 45.2577 c
83.6074 42.2382 m
83.8574 43.4931 83.2578 45.0048 81.6641 45.0429 c
80.7734 43.6845 82.7803 42.9062 83.6074 42.2382 c
84.0381 41.5898 m
84.582 41.5917 85.6221 41.4365 86.0879 41.8046 c
86.4004 43.9658 83.04 43.999 84.0381 41.5898 c
f
35.9204 43.3163 m
46.3442 43.2158 56.5449 43.1738 66.7764 43.1005 c
66.7227 42.5077 66.8955 41.6874 66.668 41.2665 c
61.5205 41.3564 55.791 41.1386 51.0244 41.2665 c
45.9556 41.4023 41.0713 41.4033 35.8135 41.5908 c
35.6006 41.8818 35.7485 42.5331 35.7056 42.9921 c
35.7002 43.1777 35.7852 43.2714 35.9204 43.3163 c
f
67.3154 43.1005 m
72.4941 43.1005 l
72.7217 42.6796 72.5488 41.8603 72.6016 41.2656 c
70.7334 41.1816 68.8047 41.1132 67.3154 41.2656 c
67.25 41.9941 67.3281 42.2626 67.3154 43.1005 c
f
79.9375 41.3749 m
81.7227 40.6044 82.5254 38.8544 84.2539 38.0302 c
84.0352 37.3066 84.5049 36.6406 84.3613 36.0878 c
83.7949 36.2763 83.6836 36.9199 83.0664 37.0585 c
82.3613 37.082 82.4951 36.2636 81.8799 36.1962 c
81.7734 36.4501 81.6914 36.7255 81.6641 37.0585 c
81.6797 37.4755 82.1016 37.4833 82.2041 37.8134 c
81.5586 39.1464 80.2324 39.7988 79.3984 40.9423 c
78.8047 41.0869 78.5762 40.9267 77.8887 40.9423 c
77.9023 41.3876 77.7012 41.6191 77.7803 42.1298 c
78.7617 42.3232 80.0156 42.8183 79.9375 41.3749 c
f
54.0449 40.5117 m
54.1318 39.9579 53.8174 39.8036 53.8301 39.3242 c
51.7803 39.3242 l
51.7393 39.7285 51.46 40.3017 51.6729 40.6191 c
52.2041 40.6269 53.3945 40.706 54.0449 40.5117 c
f
56.8516 40.5117 m
56.9277 39.9667 56.7041 39.7236 56.6348 39.3242 c
55.9375 39.3827 55 39.1982 54.4766 39.4326 c
54.1035 40.915 55.8848 40.7177 56.8516 40.5117 c
f
59.6563 40.6191 m
59.7061 39.9941 59.3994 39.7236 59.2246 39.3242 c
58.8262 39.1513 57.7881 39.1513 57.3906 39.3242 c
56.9893 40.913 58.4521 40.6347 59.6563 40.6191 c
f
67.9629 40.4033 m
66.1875 39.7695 64.7744 38.7724 63.2168 37.9228 c
62.6348 37.2831 61.9072 36.7802 61.2744 36.1952 c
60.6514 35.6201 60.1309 34.9736 59.4404 34.4697 c
60.3555 37.0781 62.0488 38.9091 63.9707 40.5117 c
65.3008 40.4736 66.8008 40.6074 67.9629 40.4033 c
f
75.5146 40.1874 m
77.457 40.1874 l
78.2227 38.7236 78.8447 37.1161 80.6934 36.7343 c
80.9004 36.4023 80.9805 35.9423 81.0176 35.4404 c
80.3965 35.4492 79.7715 35.4638 79.291 35.3329 c
78.3711 36.581 77.8037 38.7245 75.8379 38.5693 c
75.8652 39.2431 75.5332 39.5585 75.5146 40.1874 c
f
74.7598 39.54 m
75.2227 38.7451 75.1035 37.3671 75.4063 36.4111 c
75.9189 36.332 76.1484 36.5331 76.5938 36.5195 c
76.9863 35.9404 77.3398 35.3242 77.8877 34.9013 c
77.7402 34.1894 77.5596 33.4238 77.7813 32.6357 c
76.7383 32.5624 75.9961 32.1894 75.8389 31.2333 c
75.4492 31.7421 75.6152 32.8076 75.4063 33.498 c
75.0068 33.9072 74.1729 33.624 73.5723 33.6064 c
73.2227 34.4433 72.75 35.1572 72.2793 35.872 c
72.4199 36.5214 72.6602 37.0722 72.6016 37.9218 c
73.7441 38.037 74.4453 38.5966 74.7598 39.54 c
72.9258 36.5195 m
73.6318 35.9091 73.7578 34.2177 75.2988 34.7929 c
75.1328 35.9931 75.374 37.6015 74.6523 38.2451 c
74.5195 37.2265 73.582 37.0146 72.9258 36.5195 c
75.7305 32.6357 m
76.2813 32.8388 76.3125 33.5634 77.1328 33.498 c
77.1016 34.2939 76.6523 34.6718 76.2695 35.1171 c
74.8613 35.2763 75.7754 33.372 75.7305 32.6357 c
f
52.8584 98.8774 m
53.2041 99.1264 52.6289 99.3583 52.751 99.7402 c
55.251 99.3823 60.4248 99.9985 63.7549 99.3085 c
63.6172 98.8364 62.627 99.2153 62.1367 99.0932 c
62.5703 98.4116 63.584 97.3754 63.8633 96.1801 c
64.0088 96.8852 64.0371 98.4023 63.9707 99.4174 c
65.333 98.6625 66.7676 97.5082 68.1787 96.3964 c
69.5645 95.3032 70.8721 94.0292 72.2773 93.0512 c
70.9844 93.3276 67.2998 94.3202 66.6689 92.7285 c
66.3887 92.0234 66.6016 90.9301 66.5605 89.8154 c
66.4492 86.8486 66.418 82.0693 66.4531 79.3505 c
65.6523 79.7372 65.0498 80.3212 64.2949 80.7524 c
66.3018 78.9833 68.5586 77.4653 70.6602 75.789 c
70.8223 76.9335 70.4707 79.5776 70.7676 81.4003 c
71.3516 79.4931 70.7041 76.8466 71.1992 75.2499 c
71.2422 75.6747 71.9805 75.4042 71.9551 75.8974 c
72.0996 76.5829 71.1426 76.165 71.1992 76.7607 c
71.124 77.1601 71.3711 77.2372 71.7383 77.1923 c
71.9189 77.5986 71.2363 77.6835 71.5234 77.8393 c
72.8184 77.8393 l
72.5039 77.3896 72.6211 77.1855 73.1406 77.0844 c
73.2471 76.3681 72.5547 76.4482 72.2773 76.1132 c
72.1914 75.5224 72.8672 75.6952 73.0332 75.3583 c
73.1279 74.7968 72.4316 75.0253 72.2773 74.7109 c
72.3848 74.0263 73.3672 74.2167 73.1406 73.2001 c
70.0332 75.4863 66.9043 77.7524 63.9707 80.2133 c
63.9922 80.6303 63.9746 81.0082 63.8633 81.2924 c
63.2188 81.1196 62.3125 80.3173 61.7061 81.0761 c
61.2031 80.6083 60.6602 80.1791 60.1953 79.6743 c
60.7383 79.6005 61.1582 80.5795 61.8125 80.7524 c
61.5352 79.1962 60.5254 78.3735 59.8711 77.1923 c
59.0078 77.1923 l
60.5859 76.0693 61.3291 79.4833 62.1367 80.4291 c
62.3057 76.6357 60.6758 71.9335 60.4111 68.0224 c
61.5293 70.8437 62.0156 74.8593 62.5684 78.4872 c
62.6895 79.2763 62.4229 80.6342 63.4316 80.8603 c
63.3223 75.829 63.2188 70.455 63.1074 65.7568 c
62.7627 65.2744 62.1602 65.0507 61.8125 64.5693 c
61.2285 65.0273 60.1309 64.9726 59.332 65.2167 c
59.2773 67.6533 59.0234 70.7001 58.0381 72.5536 c
58.3594 73.9999 57.1201 74.7939 56.6348 75.789 c
57.2676 76.5595 57.8164 77.4145 58.2529 78.3793 c
58.6797 78.2553 59.5098 77.2162 59.8711 78.0551 c
59.2891 77.9604 58.4844 78.5073 58.4688 79.0263 c
58.4336 80.2172 61.2754 80.5566 61.5967 81.6161 c
60.5742 81.1274 59.873 80.3193 58.6855 79.9975 c
58.6318 81.6323 61.1152 80.7314 61.166 82.2631 c
60.416 82.6572 59.5254 82.2621 58.4688 82.3705 c
58.6406 79.8022 57.834 76.7685 56.0947 76.1132 c
56.4863 77.3774 57.7109 77.8066 57.7129 79.4584 c
57.0996 78.3452 56.8262 76.8935 55.4473 76.5439 c
54.8711 76.9736 54.9336 78.0444 54.0459 78.1635 c
54.9229 78.6884 56.0254 78.9892 56.0947 80.3212 c
56.7285 80.1635 57.582 80.2255 57.7129 79.5663 c
59.0439 84.7602 54.2061 89.1005 48.436 87.2265 c
46.1519 86.0434 44.1787 83.4965 44.6587 80.2133 c
44.9229 78.4155 45.8721 77.4482 46.709 76.1132 c
44.9238 76.9223 44.0278 79.3452 44.1201 81.8315 c
44.271 85.9013 48.6831 88.9384 52.9668 88.0893 c
55.5391 87.5795 57.4961 85.4052 58.3613 82.9101 c
63.54 82.9101 l
63.6465 82.5541 62.8477 82.4985 63.54 82.4785 c
63.3945 81.8334 62.7158 81.7202 62.1367 81.5082 c
62.8018 81.1684 63.1582 82.0673 63.8633 82.0473 c
63.6973 83.7656 64.2754 85.5912 63.8633 87.1171 c
63.5156 88.4091 62.248 88.9452 61.2734 89.7075 c
62.6211 90.4443 64.373 91.6874 63.8633 93.5912 c
63.2383 91.4101 61.4141 90.4301 58.9004 90.1381 c
61.0273 88.9203 63.2871 87.8364 63.6465 84.8525 c
62.7852 84.8525 l
61.3467 89.7084 54.4063 89.0605 51.8877 92.8354 c
50.875 90.3613 47.7607 89.9863 46.062 88.1962 c
45.9468 87.7734 46.0391 87.1406 45.8457 86.7944 c
45.2329 86.5493 44.9751 87.2236 44.5518 87.3334 c
42.5879 87.8422 41.5137 85.7812 40.5601 84.6362 c
40.811 86.6962 43.2749 88.6513 45.3071 87.2265 c
46.2119 90.6113 51.6289 90.0224 51.5635 94.0224 c
52.0488 94.0751 52.373 93.9672 52.751 93.9145 c
53.4551 92.6054 54.4336 91.5693 55.9883 91.1093 c
55.5352 91.7875 54.376 93.2182 54.3701 94.3461 c
53.0195 94.4316 50.5 94.1933 48.9751 94.4545 c
50.6147 95.1254 52.6377 94.5483 54.2617 94.6703 c
54.2178 95.3964 54.3574 95.9404 54.4766 96.5043 c
54.5078 96.5786 53.0938 95.8105 53.0742 96.6122 c
52.6924 96.6005 52.6826 96.2133 52.2119 96.2885 c
52.5166 96.2553 52.6748 95.7924 52.4268 95.5331 c
51.9971 95.4633 51.7686 95.5922 51.7803 95.9643 c
51.5303 95.2372 51.2002 95.8906 50.7002 95.5331 c
50.208 95.5434 50.2871 96.1244 49.9458 96.2885 c
49.3901 96.3085 48.6611 96.1533 48.5439 96.6122 c
49.251 94.5663 48.374 92.5702 47.3569 91.3251 c
48.6968 91.8202 49.5059 92.8442 50.1621 94.0224 c
51.1318 94.0224 l
49.4297 88.8212 41.311 90.0351 39.8047 84.6362 c
39.0498 84.6362 l
38.9478 87.6533 41.564 88.8823 43.7959 89.9233 c
41.2959 90.4062 39.7637 91.8593 38.9419 94.0224 c
38.127 91.9072 39.8047 90.6264 40.9917 89.8154 c
39.457 88.6913 38.2979 86.9765 38.7261 84.2055 c
39.1548 84.1215 40.8257 84.7001 41.3149 84.2055 c
40.8237 83.5502 39.9268 83.9526 38.9419 83.7734 c
38.6997 82.9721 38.8979 81.7314 38.834 80.7524 c
38.019 80.3085 37.4727 79.5952 36.5679 79.2421 c
36.27 81.7563 36.5859 85.1952 36.46 88.3041 c
36.3848 90.1713 36.6128 92.9365 35.5967 93.6992 c
33.7241 95.1054 30.8867 93.9033 29.124 92.9433 c
31.9941 95.3242 35.0381 97.5312 38.0781 99.7402 c
41.1479 99.6181 45.0439 100.0864 48.3281 99.7402 c
48.3857 98.9643 47.3979 99.2324 46.8179 99.0932 c
47.0938 98.5053 48.1079 97.7236 48.436 96.8276 c
48.272 97.7221 49.5391 97.8945 49.9458 98.5541 c
51.001 98.4345 51.5596 97.8315 52.5361 98.4462 c
50.6943 98.4804 49.7637 99.0082 48.436 99.0932 c
48.3579 99.4233 48.5459 99.4863 48.5439 99.7402 c
49.3809 99.9252 49.4971 99.3325 49.8379 99.3085 c
50.0557 99.0634 50.1968 99.8076 50.5938 99.7402 c
51.333 99.0034 52.8096 100.3041 52.8584 98.8774 c
38.9419 95.5331 m
39.123 97.3295 40.312 98.1181 41.208 99.2011 c
38.834 99.2011 l
38.7217 98.1982 38.5381 96.3622 38.9419 95.5331 c
53.1836 98.4462 m
53.5479 97.8041 54.6582 97.9081 54.585 96.8276 c
54.8848 97.8935 55.6992 98.4472 56.3125 99.2011 c
54.8125 99.2363 53.9561 99.2065 53.1836 98.4462 c
56.7422 95.9643 m
57.6777 96.2104 58.7178 95.6083 59.4395 95.7494 c
61.6563 96.1816 60.96 99.1181 59.0078 99.2011 c
56.9004 99.2905 54.751 96.8354 55.125 94.6703 c
55.8857 95.2465 55.8906 95.7392 56.7422 95.9643 c
43.689 98.8774 m
43.0029 98.6952 42.4517 97.7924 42.502 97.1513 c
42.645 95.3163 44.6997 96.2133 46.1699 95.5331 c
47.2847 95.0175 46.9927 94.2211 47.5728 93.1591 c
48.7598 95.6894 46.6768 99.6723 43.689 98.8774 c
39.5889 94.8852 m
39.603 93.5341 40.9971 91.5292 42.394 92.7285 c
44.2988 94.3622 40.333 96.8002 42.1777 98.7695 c
41.104 98.3022 39.5688 96.8295 39.5889 94.8852 c
59.4395 93.9145 m
59.3906 92.6035 60.2383 91.3593 61.5967 91.7563 c
64.0898 92.4872 63.6074 98.1445 61.166 98.3383 c
62.4512 96.4711 60.4082 94.8881 59.4395 93.9145 c
59.332 91.9721 m
58.501 93.0092 59.041 94.9892 57.7129 95.3173 c
56.4287 95.6352 55.5293 94.8325 55.4473 93.8066 c
55.2979 91.9194 57.792 90.5615 60.3027 91.1093 c
59.9023 91.6093 59.6992 91.5146 59.332 91.9721 c
45.9541 94.8852 m
43.062 95.1161 43.8447 91.6723 41.208 91.6494 c
43.4341 89.3705 49.0439 92.0121 45.9541 94.8852 c
60.4111 72.5536 m
60.4492 74.1327 60.7969 75.9785 61.0586 76.9765 c
60.3779 76.0966 59.7754 74.0361 60.4111 72.5536 c
59.8711 67.914 m
59.2285 70.7607 60.1484 75.1679 58.0381 76.5439 c
59.5352 74.5556 58.9746 70.5058 59.8711 67.914 c
60.5195 67.5908 m
61.373 67.1855 60.9609 65.5146 61.7061 65.0009 c
61.9238 65.4999 61.042 66.329 61.3818 66.9433 c
62.0469 66.7812 62.1543 66.0615 62.5684 65.6484 c
63.041 66.5732 61.3008 67.9452 60.5195 67.5908 c
f
66.3438 43.747 m
65.8223 43.4306 64.5293 43.4716 63.8633 43.6406 c
63.8711 55.9013 63.9082 67.0683 64.0791 79.3505 c
66.7949 77.6425 69.1738 75.5986 71.8457 73.8486 c
72.2734 73.0527 72.9023 72.4579 73.1406 71.4745 c
73.5957 74.247 73.1631 78.6303 73.3574 81.1845 c
73.8574 78.4482 73.4316 74.7851 73.5732 71.6904 c
74.5156 72.1083 73.8994 73.623 74.6523 74.0634 c
75.1045 74.1035 74.7285 73.7119 74.7598 73.5244 c
75.2754 73.6201 75.3564 74.1503 75.4072 74.7109 c
75.207 75.2158 74.3887 74.4648 74.3281 75.1425 c
74.2744 75.7724 75.4219 75.2001 75.4072 75.789 c
75.5586 76.373 75.043 76.289 74.8672 76.5439 c
75.084 77.2641 75.7539 78.4365 75.1914 79.2421 c
74.668 79.0825 73.9531 79.0776 73.8965 79.6743 c
73.9395 80.1703 74.5615 80.0883 75.084 80.1054 c
75.1572 80.3954 74.8604 80.3134 74.7598 80.4291 c
75.2061 80.7934 75.9102 80.5502 76.3789 80.5375 c
76.4814 80.1464 75.9121 80.4272 75.8379 80.2133 c
75.9238 79.7211 77.041 80.2656 77.1328 79.7822 c
77.1201 79.1826 76.541 79.1523 75.9463 79.1342 c
75.8623 78.8954 75.7207 78.7133 75.7314 78.3793 c
76.2637 77.6845 75.8584 77.2534 76.3789 76.5439 c
76.2129 76.3495 75.6387 76.5654 75.7314 76.1132 c
75.6289 75.1357 76.75 75.9345 76.7012 75.1425 c
76.7676 74.7177 76.1094 75.0156 75.8379 74.9267 c
75.8252 74.1952 76.127 73.7763 76.3789 73.3095 c
76.6523 73.5175 75.8682 73.9745 76.3789 74.1718 c
77.1758 73.6074 76.8994 72.3242 77.3496 71.2587 c
77.6904 74.7851 77.332 78.3652 77.5645 81.2924 c
78.2617 78.3915 77.4922 75.1015 77.8887 71.2587 c
78.1221 72.1845 78.6963 73.2929 78.752 74.7109 c
78.6406 74.9599 78.0293 74.7079 78.1045 75.1425 c
78.1182 75.7031 79.1133 75.2841 78.9668 76.0058 c
78.959 76.4648 78.2803 76.2529 78.1045 76.5439 c
78.0527 77.4164 78.9775 77.1391 78.3203 77.8393 c
78.7539 77.9452 79.0996 78.1391 78.9668 78.8105 c
78.9434 79.2905 78.2871 79.1381 78.1045 79.4584 c
78.1855 80.0903 78.7852 80.0312 78.2129 80.5375 c
78.8711 80.4692 79.3955 80.8095 79.9385 80.5375 c
79.1201 80.1381 80.041 80.0502 79.9385 79.2421 c
79.8105 79.1181 79.5566 79.1205 79.291 79.1342 c
79.207 78.7553 79.1797 77.8085 79.8301 77.8393 c
79.2539 77.3681 80.0645 77.2895 80.0469 76.7607 c
79.877 76.3906 79.3066 76.4218 79.1816 76.0058 c
79.168 75.415 79.9648 75.6367 80.1543 75.2499 c
80.0918 74.8827 79.8008 74.7402 79.291 74.8193 c
79.2715 73.54 79.5547 72.5663 80.1543 71.9052 c
80.3955 75.0107 80.2363 78.9682 80.1543 81.5082 c
76.7705 81.5234 73.0684 81.4843 70.0117 81.5082 c
70.0117 82.1552 l
73.5039 82.2641 78.0293 82.4765 81.3398 82.0473 c
81.4434 81.4423 80.7773 81.6035 80.4775 81.4003 c
80.834 77.9394 80.6309 73.8613 80.6934 70.3954 c
79.6924 70.7255 79.5938 71.957 79.291 72.9843 c
78.0635 72.7021 78.4727 70.7822 77.4561 70.288 c
77.8066 69.3349 79.125 68.8017 79.1816 67.914 c
77.4668 68.8945 76.9473 71.0722 75.5137 72.3369 c
74.207 71.163 73.8652 69.0244 72.3867 68.0224 c
73.4014 69.7031 74.3457 71.456 75.5137 72.9843 c
76.2832 72.5673 76.3281 71.4247 77.0254 70.9355 c
76.7393 71.9433 76.2109 72.7089 75.7314 73.5244 c
74.668 72.789 74.3047 71.3544 73.4648 70.3954 c
72.8809 71.0712 72.6387 72.0869 72.0635 72.7695 c
71.5215 72.124 71.5205 70.9384 70.877 70.3954 c
70.3809 71.4794 70.8955 72.3974 70.6602 73.7392 c
71.0635 73.2802 70.832 72.1865 70.9834 71.4745 c
71.5098 71.9179 71.582 72.8183 71.9551 73.416 c
70.9531 74.0175 67.375 75.0322 66.668 73.5244 c
66.2314 72.5898 66.3994 70.2695 66.3438 69.1015 c
66.127 64.4042 66.4316 60.705 66.4521 57.0175 c
66.4766 52.7519 66.2168 47.7577 66.3438 43.747 c
f
42.9331 70.8271 m
43.6563 70.4755 43.376 68.6523 43.4731 68.0224 c
46.1904 69.6103 47.9243 66.3339 50.917 66.6201 c
51.291 66.6552 51.6709 67.0234 52.1025 66.8349 c
51.6299 66.374 50.8701 66.1982 49.9463 66.1884 c
50.1602 65.4951 51.5068 66.0185 52.1025 65.9726 c
51.1709 64.9619 49.4302 65.2275 48.4351 65.9726 c
48.688 65.4843 49.6304 64.5712 50.4854 64.5702 c
53.1191 64.5673 55.4004 70.4433 58.6855 67.3749 c
60.1309 64.3603 56.0244 60.5361 57.7129 58.4199 c
57.5996 58.1747 57.0352 58.3788 56.7432 58.3115 c
56.3828 58.8505 56.2461 59.6142 56.0957 60.3622 c
55.7363 59.7968 56.2334 58.663 55.9883 58.204 c
55.4482 58.204 l
55.2207 58.6249 55.3945 59.4452 55.3398 60.039 c
54.7617 59.8261 55.208 58.5888 54.6934 58.3115 c
54.2744 60.2529 56.1953 62.1786 56.5273 64.246 c
55.5566 62.3378 54.335 60.6835 53.8301 58.3115 c
53.376 58.2079 52.8975 58.3681 52.2119 58.3115 c
53.4336 60.5429 54.8154 62.6142 55.7715 65.1093 c
54.4238 62.789 53.1367 60.4081 51.5635 58.3115 c
50.7588 58.1337 50.2642 58.2577 49.5142 58.3115 c
48.459 60.5654 47.313 62.7275 46.062 64.7851 c
46.6084 62.7783 48.2061 60.8876 48.543 58.3115 c
47.6421 58.1298 47.8804 59.0869 47.6802 59.6074 c
47.4341 59.164 47.709 58.8652 47.5723 58.3115 c
47.27 58.1884 47.0122 58.1884 46.709 58.3115 c
46.6943 59.041 47.1963 59.8017 46.709 60.3622 c
46.5293 59.5712 46.4722 58.6572 45.9541 58.204 c
44.7671 58.204 l
45.0273 59.1064 46.0742 59.7607 45.6304 61.0097 c
45.3384 61.0859 45.708 60.5009 45.4141 60.5781 c
44.835 60.7275 44.9722 61.3212 44.7671 61.873 c
44.123 63.6113 42.376 65.956 43.4731 67.914 c
42.8882 68.4199 42.7363 69.8964 42.9331 70.8271 c
50.8096 61.0097 m
50.3394 61.1152 50.1812 61.5331 49.73 61.6572 c
51.2139 58.207 54.2207 64.7812 54.4766 65.7568 c
53.3477 64.082 52.5068 62.1181 50.8096 61.0097 c
50.917 62.1972 m
51.7607 62.3369 52.4287 63.7958 52.751 64.3544 c
51.9834 63.8632 51.4932 63.0937 50.7012 62.6269 c
49.2974 63.3095 48.4243 64.5234 47.248 65.4326 c
48.1221 64.4775 49.3501 61.9355 50.917 62.1972 c
50.5933 59.0683 m
51.373 59.3661 51.8193 59.999 52.1025 60.7939 c
51.5234 60.5478 51.3076 59.9355 50.7012 59.7148 c
49.0732 61.0722 48.2471 63.2314 46.8184 64.7851 c
47.9902 62.7939 48.8364 60.4745 50.5933 59.0683 c
56.7432 59.9306 m
57.0566 59.8935 57.1074 61.0615 56.8516 60.9013 c
56.9082 60.4853 56.6582 60.3749 56.7432 59.9306 c
f
48.3276 72.122 m
50.3867 72.1308 51.5498 71.2441 52.9658 70.6103 c
53.0703 70.1386 53.1543 69.6474 53.1826 69.1005 c
52.0088 69.2216 51.0234 69.8222 50.1626 69.2089 c
49.8223 69.4443 49.5757 69.7734 49.2983 70.0712 c
49.2305 70.6806 49.5884 70.8613 49.7305 71.2587 c
49.5537 71.8378 48.3677 71.4052 48.3276 72.122 c
f
89.54 57.0175 m
89.0527 56.9765 89.6602 56.5097 89.3242 56.371 c
88.9375 56.3085 88.9961 56.6894 89.001 57.0175 c
90.1113 57.832 90.9648 56.6679 91.5898 56.0468 c
92.0469 56.3085 92.7578 56.3173 92.8848 56.9101 c
91.4199 57.1367 88.9434 58.6865 87.8145 57.2333 c
87.4238 57.4189 87.2246 57.7949 86.9512 58.0976 c
87.1543 58.7206 87.917 58.7841 88.2441 59.2831 c
89.6621 58.9384 90.7578 58.2724 92.5605 58.3124 c
92.8203 57.4579 93.3594 56.8798 93.9629 56.371 c
93.373 55.7744 92.5098 55.4511 91.5898 55.1835 c
91.3047 56.1933 90.8613 57.0439 89.54 57.0175 c
f
59.4395 33.499 m
64.5957 35.248 69.4375 37.3105 73.3574 40.2958 c
76.875 43.6826 80.4453 47.0165 82.6357 51.7314 c
80.8857 49.704 78.2969 47.7812 75.083 47.8476 c
66.4746 48.0253 65.7266 59.54 67.208 68.3456 c
70.9375 68.0204 74.6992 67.4033 78.3203 67.5908 c
78.6934 67.6093 79.0352 67.8915 79.3984 67.914 c
80.2715 67.9677 81.2871 67.7285 82.2031 67.8056 c
83.7051 67.9335 85.1826 68.3388 86.6279 68.5615 c
86.9453 72.2245 85.8887 75.8173 84.9004 78.9189 c
81.8691 88.4345 75.7588 95.3769 67.5313 99.6327 c
67.4434 99.6537 67.4238 99.7407 67.3164 99.7407 c
67.3633 99.8369 67.4102 99.9335 67.5313 99.957 c
67.623 99.9765 67.6338 99.915 67.6387 99.8486 c
73.9609 96.7856 78.7793 92.0317 82.3125 85.9316 c
85.8652 79.7919 87.9697 72.0869 86.7363 63.0595 c
85.6582 55.1884 82.0332 48.622 77.457 43.748 c
72.7734 38.7607 66.8848 34.9023 59.4395 33.499 c
79.3984 49.79 m
80.5781 49.787 80.3633 51.6669 81.4492 51.4081 c
81.6543 51.6728 81.8857 51.9765 81.6641 52.3788 c
82.3672 52.1425 82.4492 53.2695 82.7422 53.7822 c
81.4141 52.665 80.4189 51.2148 79.3984 49.79 c
83.6074 56.4785 m
78.7031 55.9931 72.8711 55.8886 67.748 56.2626 c
67.4277 55.4296 67.9824 54.5224 68.2871 53.7822 c
68.5957 53.0283 68.8379 51.9374 69.582 51.9472 c
69.9805 52.3994 68.6875 52.5234 69.042 52.9179 c
69.4336 52.8427 69.4922 52.4345 69.9043 52.3788 c
70.8984 53.4345 71.5645 54.8193 72.8184 55.6161 c
71.8467 54.1767 70.6758 52.9374 69.582 51.624 c
69.8926 50.7119 70.6191 50.2167 71.416 49.79 c
73.3047 51.6044 74.6777 53.9345 76.5938 55.7236 c
75.165 53.4833 73.2607 51.7197 71.7383 49.5742 c
72.3281 49.6708 72.3486 49.0009 73.0332 48.9257 c
73.0938 49.2275 72.5723 49.455 72.6016 49.8974 c
72.7529 52.1747 76.4453 49.7607 73.8965 48.7109 c
74.791 48.5273 75.292 49.5663 75.7305 50.1142 c
77.3389 52.1181 78.8037 54.3076 80.5859 55.9384 c
79.791 54.54 78.5293 53.6074 77.7813 52.163 c
78.3486 51.6171 79.0781 51.2304 79.3984 50.4365 c
80.9961 52.4521 83.1543 53.5097 83.6074 56.4785 c
85.7637 67.5908 m
85.752 67.7216 85.7324 67.8466 85.5488 67.8056 c
80.083 66.706 73.2461 66.8115 67.748 67.5908 c
67.1621 66.5214 67.417 64.6132 67.208 63.1679 c
68.4082 64.2324 69.3867 66.0937 70.5518 66.8359 c
70.0801 66.1171 69.5527 65.4335 68.9336 64.6777 c
68.25 63.8417 67.1436 63.1025 67.208 61.873 c
69.7246 61.4257 72.8076 61.2197 75.7305 61.2255 c
77.5908 61.2285 79.4248 61.3437 81.125 61.5497 c
80.8818 62.2773 79.8203 62.7587 79.8301 63.3827 c
80.3438 62.9609 80.6309 62.3134 81.2324 61.9794 c
81.3506 62.1581 81.8184 62.537 81.5557 62.7353 c
78.9883 62.2929 81.0498 66.2441 82.3125 64.0312 c
82.5449 64.6699 81.5664 64.8095 81.5557 65.541 c
82.0547 65.3554 82.0557 64.6728 82.6357 64.5693 c
82.6172 64.8749 82.959 64.8212 82.959 65.1093 c
80.9414 65.1718 83.0586 68.1279 84.1465 66.2958 c
84.3242 66.8036 83.5684 66.9335 83.8223 67.1591 c
84.1602 67.1747 84.1934 66.8827 84.2539 66.6201 c
84.8438 66.8554 85.1377 67.3886 85.7637 67.5908 c
86.6279 67.5908 m
83.0371 66.037 79.1406 58.9286 84.7939 56.6943 c
85.7422 59.916 86.7695 63.6357 86.6279 67.5908 c
83.1748 65.2167 m
83.2617 65.6699 83.7529 65.7187 83.8223 66.1874 c
82.9277 67.6992 81.2158 65.3642 83.1748 65.2167 c
81.8799 63.0595 m
81.9922 63.3427 82.0088 63.7216 81.9883 64.1376 c
80.3125 65.537 79.792 61.9413 81.8799 63.0595 c
67.3164 61.1181 m
67.1797 61.0732 67.0947 60.9775 67.0996 60.7939 c
67.0293 59.1777 67.2305 57.8329 67.5313 56.5869 c
72.4717 56.2382 78.2852 56.2216 83.1748 56.8017 c
82.6377 57.8837 81.0498 58.8486 81.2324 61.0097 c
76.7461 60.8515 71.6621 60.8945 67.3164 61.1181 c
77.5645 52.0556 m
76.668 50.9023 75.6289 49.8915 74.8672 48.6025 c
75.3965 48.6816 75.874 48.7695 76.3779 48.6025 c
76.7178 48.996 75.6738 49.3691 75.9473 49.6816 c
76.3477 49.4716 76.5977 49.1093 76.8086 48.7109 c
77.3262 48.662 77.667 48.789 77.8877 49.0341 c
76.127 48.8134 76.1855 50.8427 77.2402 51.0839 c
78.498 51.371 78.9961 49.7997 78.2119 49.0341 c
78.8594 49.2148 79.1855 49.7148 79.3984 50.329 c
78.7129 50.83 78.3799 51.6826 77.5645 52.0556 c
76.7012 49.8974 m
76.9678 49.2451 77.8281 49.122 78.3203 49.6816 c
78.3984 50.2275 78.2012 50.498 77.9961 50.7607 c
77.1641 50.874 76.8447 50.4736 76.7012 49.8974 c
72.8184 49.79 m
72.8613 49.1718 73.8398 48.8134 74.4355 49.3574 c
75.0371 50.957 72.7363 50.9628 72.8184 49.79 c
f
82.2041 55.2919 m
82.2969 54.872 82.3945 54.2861 82.2041 53.8886 c
79.9863 52.2841 79.9004 56.9247 82.2041 55.2919 c
81.4492 55.3994 m
81.0049 55.4531 81.2363 55.1728 80.6934 55.1835 c
79.957 52.0644 83.585 55.1406 81.4492 55.3994 c
f
79.9375 53.2411 m
80.8633 52.7968 80.6914 51.3984 79.7227 51.2997 c
78.2207 51.1464 78.2754 54.041 79.9375 53.2411 c
78.751 52.163 m
79.2012 50.4667 81.2656 52.7812 79.9375 53.2411 c
79.25 53.4794 78.5752 52.832 78.751 52.163 c
f
62.8926 52.163 m
62.0117 52.3749 60.7529 52.2831 60.1963 51.8398 c
60.2715 51.7372 60.7012 51.9091 60.8418 51.624 c
60.7939 49.7656 60.4336 48.2197 59.8711 46.8769 c
59.5156 46.7001 59.0469 46.7675 58.793 46.9853 c
59.3711 48.205 59.8779 49.4951 59.9785 51.1923 c
59.5566 51.3398 59.7285 50.5478 59.6563 50.1132 c
58.5684 48.4863 56.5449 49.7665 55.9883 51.0839 c
56.165 51.5283 56.5449 52.0654 57.0664 51.8398 c
57.3379 51.537 56.7539 51.4345 56.7432 51.0839 c
56.9844 51.33 57.9893 51.247 58.2529 50.6533 c
59.7207 51.2714 60.1855 52.8915 62.4609 52.7031 c
62.5332 52.4521 63.0273 52.621 62.8926 52.163 c
f
61.166 38.8925 m
61.0947 39.3251 60.4717 39.206 59.9785 39.2167 c
59.9111 40.9277 61.3418 40.498 62.8926 40.5117 c
62.3066 39.5507 61.3262 38.9843 60.8428 37.9218 c
60.6289 38.1425 61.1289 38.5663 61.166 38.8925 c
f
49.6221 107.4003 m
50.2012 107.2172 49.7871 108.0273 50.0532 108.1552 c
50.751 108.3412 52.7334 108.9892 52.8594 107.8315 c
53.251 107.7275 52.9092 108.3574 53.3984 108.1552 c
53.5625 107.5234 53.0273 107.5903 52.8594 107.2924 c
52.9824 106.1987 52.5889 105.6205 52.2119 105.0273 c
50.394 104.8632 50.2041 106.3276 49.6221 107.4003 c
50.4854 107.7245 m
50.3301 107.3876 51.2871 107.3876 51.1318 107.7245 c
51.0869 107.9643 50.5601 107.8085 50.4854 107.7245 c
51.5635 106.2133 m
52.2627 106.2626 52.2324 107.0986 51.8877 107.4003 c
52.0557 107.5566 52.3916 107.5444 52.5352 107.7245 c
52.4082 107.8486 52.1543 107.8466 51.8877 107.8315 c
51.6182 107.4545 52.0068 106.4184 51.5635 106.2133 c
51.9951 105.8896 m
51.6543 105.7416 51.6357 105.8666 51.2412 105.8896 c
51.1025 105.5493 52.1357 105.5493 51.9951 105.8896 c
f
57.3896 107.832 m
57.7461 110.2099 61.7627 109.9926 61.5977 107.6157 c
61.0762 108.4789 58.7344 108.4389 57.8223 107.9399 c
58.4707 107.8608 59.5195 108.1479 60.3027 107.9399 c
60.7197 107.83 60.834 107.3969 61.166 107.5087 c
60.6211 106.3749 60.3711 104.4887 59.0078 104.7031 c
57.7773 104.8969 58.125 106.8837 57.3896 107.832 c
59.1172 107.185 m
59.5703 107.3217 60.0195 106.9028 60.0879 107.2929 c
59.7969 107.559 59.3838 107.4619 59.1172 107.185 c
58.6846 107.2929 m
58.4082 107.35 58.3066 107.436 58.1445 107.185 c
58.666 107.1596 58.1152 106.8427 58.0371 106.7529 c
58.3779 106.7338 58.4023 106.3989 58.3613 105.998 c
f
48.8672 81.1845 m
50.3662 82.0795 52.4434 81.8276 53.9385 81.0766 c
53.9873 79.0493 53.1035 75.7216 51.0254 76.1132 c
49.3843 76.4238 48.5801 78.7685 48.8672 81.1845 c
49.5142 80.5375 m
49.8564 80.6874 50.4673 80.6874 50.8096 80.5375 c
50.9424 80.8857 50.4604 80.6196 50.5933 80.9682 c
50.0181 81.0395 49.6494 80.9052 49.5142 80.5375 c
51.9951 80.2133 m
52.2158 80.6855 52.9863 80.3842 53.291 80.5375 c
53.1084 81.1284 51.5713 80.8124 51.9951 80.2133 c
49.6221 79.7817 m
49.9912 79.8622 49.7593 79.3432 50.1621 79.4575 c
50.4365 79.4716 50.5801 79.6157 50.5933 79.8896 c
50.1392 79.7514 49.6914 80.1703 49.6221 79.7817 c
52.2119 79.6733 m
52.4023 79.5766 52.5264 79.4135 52.751 79.3495 c
52.7852 79.6035 53.0859 79.5912 53.1816 79.7817 c
52.96 79.9745 52.4453 79.8027 52.2119 79.6733 c
51.1318 78.0556 m
51.8877 78.0556 l
51.8242 78.2783 52.0215 78.7646 51.7803 78.8105 c
51.9102 78.2133 51.249 78.4052 51.1318 78.0556 c
52.1035 77.3002 m
52.0684 77.7006 50.9082 77.5375 50.7012 77.4077 c
50.9756 77.2314 51.7041 77.5722 52.1035 77.3002 c
f
63.5391 62.3046 m
63.7109 60.2451 63.5137 57.497 60.8418 58.3124 c
60.0625 59.0781 60.1641 60.7265 60.1953 62.3046 c
61.0801 62.7353 62.1982 62.3593 63.5391 62.3046 c
60.9502 60.7939 m
60.8135 60.6435 60.4219 60.747 60.4121 60.4697 c
61.2539 60.6816 60.8691 58.705 61.5977 59.499 c
60.7793 59.6025 61.377 60.457 61.166 61.1171 c
61.0264 61.2665 60.6973 61.2236 60.4121 61.2255 c
60.3066 60.7968 61.0137 61.1816 60.9502 60.7939 c
61.8135 60.7939 m
62.082 60.8847 62.3916 60.9355 62.7842 60.9013 c
62.709 61.3622 61.7842 61.3017 61.8135 60.7939 c
61.9219 60.4697 m
61.916 60.3212 61.9727 60.2333 62.0293 60.1464 c
62.3809 60.1181 62.5488 60.2744 62.5684 60.5771 c
62.3027 60.5927 62.0488 60.5947 61.9219 60.4697 c
61.166 58.8515 m
61.5957 58.9111 61.4912 58.9111 61.9219 58.8515 c
62.0605 59.1923 61.0273 59.1923 61.166 58.8515 c
f
grestore
gsave
0 .002 m
104.967 .002 l
104.967 119.414 l
0 119.414 l
0 .002 l
clp
38.2275 9.027 m
35.4717 9.027 l
35.4717 .433 l
49.6606 .433 l
49.6606 3.952 l
44.0127 3.952 l
44.0127 8.755 l
41.3105 8.755 l
41.3105 3.952 l
38.2275 3.952 l
p
49.6606 22.54 m
45.0767 19.401 l
44.4756 18.991 43.9023 18.609 43.5205 18.338 c
43.0293 20.3837 41.6655 21.7753 39.4824 21.7753 c
36.7266 21.7753 35.3896 19.7011 35.3896 16.209 c
35.3896 14.407 35.4175 12.253 35.4717 11.106 c
49.6606 11.106 l
49.6606 14.627 l
44.1216 14.627 l
44.1216 14.763 l
49.6606 18.256 l
49.6606 22.54 l
p
39.8374 18.036 m
41.0107 18.036 41.8013 17.164 41.8013 15.8 c
41.8013 15.418 41.8013 14.98 41.7476 14.627 c
38.1187 14.627 l
38.0913 14.953 38.0635 15.309 38.0635 15.69 c
38.0635 17.137 38.7183 18.036 39.8374 18.036 c
49.6606 32.9423 m
46.8496 32.9423 l
46.8496 27.7314 l
43.7393 27.7314 l
43.7393 32.6972 l
41.0654 32.6972 l
41.0654 27.7314 l
38.2275 27.7314 l
38.2275 32.9423 l
35.4717 32.9423 l
35.4717 24.2119 l
49.6606 24.2119 l
p
49.7236 39.1708 m
35.4185 39.166 l
35.4185 35.4892 l
49.7236 35.4853 l
p
45.2393 53.3798 m
43.7114 53.3798 42.5117 52.5888 42.0747 51.0058 c
42.0474 51.0058 l
41.5015 52.4247 40.3013 53.1884 38.9365 53.1884 c
36.6997 53.1884 35.3896 51.6337 35.3896 47.8134 c
35.3896 45.9306 35.4717 43.6113 35.4717 42.166 c
49.6606 42.166 l
49.6606 44.3486 49.7144 46.2031 49.7144 47.2402 c
49.7144 51.9062 47.3687 53.3798 45.2393 53.3798 c
39.4556 49.4501 m
40.6836 49.4501 41.2837 48.332 41.2837 46.6679 c
41.2837 46.4765 41.2837 46.0673 41.2563 45.6572 c
37.8726 45.6572 l
37.8726 46.122 37.8457 46.6943 37.8457 47.1318 c
37.8457 48.9042 38.5005 49.4501 39.4556 49.4501 c
45.2393 49.6689 m
46.4136 49.6689 47.2046 48.8779 47.2046 47.1581 c
47.2046 46.6122 47.1777 46.0673 47.1226 45.6572 c
43.4937 45.6572 l
43.4663 46.0126 43.4663 46.5585 43.4663 46.8583 c
43.4663 48.6318 43.9844 49.6689 45.2393 49.6689 c
44.1753 68.7577 m
35.4717 68.7577 l
35.4717 65.2929 l
43.7393 65.2929 l
45.7856 65.2929 46.9863 64.4462 46.9863 62.291 c
46.9863 60.2988 46.0586 59.2626 43.8755 59.2626 c
35.4717 59.2626 l
35.4717 55.7421 l
44.6665 55.7421 l
47.8867 55.7421 49.9053 57.789 49.9053 62.0995 c
49.9053 66.7656 47.3403 68.7577 44.1753 68.7577 c
49.6606 83.1376 m
45.0767 79.9994 l
44.4756 79.5898 43.9023 79.2075 43.5205 78.9355 c
43.0293 80.9814 41.6655 82.3735 39.4824 82.3735 c
36.7266 82.3735 35.3896 80.2997 35.3896 76.8066 c
35.3896 75.0058 35.4175 72.8505 35.4717 71.705 c
49.6606 71.705 l
49.6606 75.2245 l
44.1216 75.2245 l
44.1216 75.3603 l
49.6606 78.8535 l
49.6606 83.1376 l
p
39.8374 78.6347 m
41.0107 78.6347 41.8013 77.7617 41.8013 76.3974 c
41.8013 76.0156 41.8013 75.5781 41.7476 75.2245 c
38.1187 75.2245 l
38.0913 75.5517 38.0635 75.9062 38.0635 76.289 c
38.0635 77.7343 38.7183 78.6347 39.8374 78.6347 c
48.8687 96.4306 m
42.1025 96.4306 l
42.1025 92.9106 l
46.5493 92.9106 l
46.7134 92.4194 46.7954 91.8198 46.7954 91.2187 c
46.7954 88.8994 45.2944 87.3173 42.5654 87.3173 c
39.7554 87.3173 38.1724 89.1454 38.1724 91.6284 c
38.1724 92.9926 38.4453 94.2475 38.9644 95.5024 c
35.9355 96.1577 l
35.4443 94.6293 35.2266 93.0746 35.2266 91.5463 c
35.2266 86.5253 38.6094 83.5786 42.8384 83.5786 c
47.5317 83.5786 49.9053 86.7167 49.9053 90.9184 c
49.9053 92.9374 49.5234 94.7387 48.8687 96.4306 c
false s
1 .75 0 0 k
f
26.4531 13.125 m
17.6753 13.125 l
17.6753 9.63 l
26.0132 9.63 l
28.0762 9.63 29.2871 8.777 29.2871 6.604 c
29.2871 4.596 28.3525 3.549 26.1504 3.549 c
17.6753 3.549 l
17.6753 0 l
26.9482 0 l
30.1953 0 32.2314 2.063 32.2314 6.411 c
32.2314 11.116 29.6455 13.125 26.4531 13.125 c
31.9844 30.9179 m
17.6753 30.9179 l
17.6753 27.4785 l
23.7012 27.5058 l
25.1875 27.5058 26.3701 27.5341 27.2231 27.5888 c
27.2231 27.5615 l
26.2603 27.121 25.3525 26.6249 24.4995 26.0751 c
17.6753 21.9199 l
17.6753 17.16 l
31.9844 17.16 l
31.9844 20.5722 l
24.9121 20.5722 l
23.7842 20.5722 23.0684 20.5439 22.3813 20.4892 c
22.3813 20.5175 l
23.1792 20.8749 24.1973 21.3701 24.9951 21.8652 c
31.9844 26.1581 l
31.9844 30.9179 l
p
32.0151 39.165 m
17.7085 39.165 l
17.7085 35.4853 l
32.0151 35.4853 l
p
f
0 1 .8 .2 k
53.127 35.48 14.301 3.681 rectfill
0 35.48 14.328 3.681 rectfill
grestore
grestore
grestore
grestore
end
restore
showpage
%%EOF
