%!PS-Adobe-3.0 EPSF-3.0
%%BoundingBox: 0 0 140 165
%%HiResBoundingBox: 0 0 139.536 164.376
%%Title: ufcd-logo-e1-left-a4-color
%%CreationDate: 2009-12-08T12:58+0100
%%Creator: Project ufcd
%%LanguageLevel: 2
%%DocumentData: Clean7Bit
%%Pages: 1
%%EndComments
%%Page: 1 1
save
0 0 139.536 164.376 rectclip
9 dict begin
/k{setcmykcolor}bind def
/p{closepath}bind def
/c{curveto}bind def
/f{fill}bind def
/l{lineto}bind def
/m{moveto}bind def
/s{setoverprint}bind def
/np{newpath}bind def
/clp{clip np}bind def
gsave
np
gsave
-19.782 171.732 m
-19.782 0 l
139.532 0 l
139.532 171.732 l
p
clp
gsave
-19.782 .003 m
139.536 .003 l
139.536 171.732 l
-19.782 171.732 l
-19.782 .003 l
clp
gsave
-19.782 54.984 m
64.485 54.984 l
64.485 171.732 l
-19.782 171.732 l
-19.782 54.984 l
clp
65.5774 164.4293 m
86.919 165.358 103.989 156.8931 115.177 146.0591 c
126.614 134.982 135.375 120.025 136.607 99.3702 c
137.265 88.3321 134.914 78.6299 131.556 70.439 c
128.185 62.218 123.741 55.133 118.238 49.465 c
106.824 37.712 92.489 28.883 71.2414 28.034 c
50.1643 27.191 33.1033 35.395 21.6433 46.403 c
15.7331 52.081 11.0823 58.385 7.1003 66.152 c
3.2283 73.7032 .4021 82.7423 .0593 93.2462 c
-0.6565 115.1363 7.4963 131.2872 18.2751 142.9981 c
26.3562 151.7784 36.9304 158.272 50.4221 162.2862 c
55.1125 163.6812 60.1887 164.1944 65.5774 164.4293 c
18.5813 141.9273 m
13.3122 136.232 8.5681 129.4219 5.4162 121.4141 c
4.6413 119.442 4.1521 117.1964 3.4265 114.984 c
2.7234 112.8389 2.0784 110.4674 1.7434 108.2491 c
-2.3587 81.127 7.8054 60.305 22.4084 46.863 c
33.6101 36.553 50.1184 27.631 71.3938 28.799 c
92.765 29.972 106.374 38.661 117.624 50.077 c
120.451 52.946 123.017 56.065 125.126 59.416 c
131.716 69.883 136.419 82.7393 135.689 99.3702 c
135.238 109.629 132.611 118.1163 128.799 126.1592 c
126.953 130.0562 125.023 133.5762 122.523 136.7213 c
120.033 139.855 117.58 143.086 114.564 145.753 c
102.857 156.1031 86.861 164.9219 64.8118 163.5103 c
43.2453 162.13 29.3904 153.608 18.5813 141.9273 c
false s
0.7 .45 0 0 k
f
89.917 158.9185 m
76.3694 158.1778 62.2278 159.0548 47.5134 159.0718 c
59.8733 163.7095 77.7112 163.3975 89.917 158.9185 c
f
47.0549 158.4595 m
29.6638 152.3775 17.3586 141.2095 9.55 125.5465 c
9.7707 125.1055 10.4607 125.8819 10.7746 125.3936 c
10.7849 124.5909 11.2429 123.6807 10.3147 123.5557 c
9.6828 123.7408 10.1409 125.0157 9.3967 125.0875 c
7.2468 121.6236 5.8337 117.4239 4.8049 112.8419 c
5.9519 112.0489 7.6726 111.8316 9.3967 111.6168 c
9.2287 112.7755 8.2937 113.1675 8.0188 114.2188 c
8.7009 114.7095 9.4797 115.1046 10.1618 115.5967 c
11.7649 114.7305 14.4797 114.2257 16.592 114.3716 c
16.5427 112.9976 17.1399 111.7598 17.8157 110.6978 c
16.8738 109.9556 15.9118 109.2344 14.9079 108.5548 c
12.529 109.5435 9.4118 110.0836 6.3347 109.9327 c
6.0476 110.8697 5.779 111.8257 4.8049 112.0757 c
3.9128 110.7457 3.718 108.8536 3.426 107.1768 c
3.1199 105.4146 2.7898 103.5787 2.6609 101.8184 c
0.949 78.295 10.3967 61.971 21.3367 50.231 c
22.6667 51.095 23.927 52.029 24.7048 53.445 c
24.322 54.083 22.821 53.603 21.9499 53.752 c
21.9719 54.592 21.9656 55.401 21.7956 56.049 c
24.009 57.146 25.0867 58.456 26.5417 60.335 c
27.6907 60.141 29.3469 60.22 30.2156 60.182 c
30.2649 58.904 30.6726 57.985 30.9817 56.967 c
28.4739 54.831 25.7849 52.876 24.3987 49.618 c
23.7536 49.943 23.032 50.191 21.9499 50.077 c
22.448 48.455 24.0847 47.49 25.3166 46.403 c
34.2087 38.564 46.4866 32.988 60.9846 30.637 c
44.9978 32.153 32.573 39.242 22.7146 48.088 c
15.448 54.608 9.845 63.576 6.029 73.4991 c
4.5857 77.2501 3.344 81.586 2.6609 85.7462 c
-0.3714 104.2134 5.6926 120.4078 11.9988 131.6695 c
18.1789 139.7589 24.946 148.3257 34.655 153.5606 c
36.1706 154.3775 37.9866 155.1387 39.7068 156.0098 c
42.1286 157.2369 43.7326 158.5118 47.0549 158.4595 c
9.3967 113.1466 m
9.53 110.4239 15.3059 109.9107 16.2849 112.0757 c
14.552 112.8775 11.5359 113.7379 9.3967 113.1466 c
23.7859 54.977 m
23.7248 54.048 24.7776 54.232 25.47 54.058 c
26.6208 55.152 27.7346 56.282 28.8376 57.426 c
28.8157 58.169 28.5959 58.716 28.3786 59.263 c
26.4289 58.254 25.2668 56.456 23.7859 54.977 c
f
50.5759 158.4595 m
62.2209 157.7955 77.1633 158.5377 87.315 157.8467 c
86.694 156.7247 84.997 157.2344 83.947 157.2344 c
72.1496 157.2344 63.7082 156.8887 52.4118 157.3878 c
51.7439 157.4166 50.2248 157.2037 49.9626 158.1539 c
50.1897 158.2325 50.3489 158.3795 50.5759 158.4595 c
f
51.9534 156.775 m
52.4123 156.775 l
52.697 153.0513 52.9031 149.7549 52.5652 145.6002 c
51.5393 145.7364 51.8371 147.4229 51.8 148.356 c
51.7024 150.795 51.8743 153.9522 51.8 156.316 c
51.7571 156.5631 51.9451 156.5792 51.9534 156.775 c
f
62.5149 156.6226 m
63.0168 153.7545 63.0227 148.6265 62.5149 145.6007 c
61.4797 145.6856 61.9104 147.1924 61.9035 147.8966 c
61.8772 150.3746 61.9231 153.6597 61.9035 156.1627 c
61.9035 156.6226 l
62.5149 156.6226 l
p
f
69.2512 156.6226 m
69.0481 154.2735 73.1594 155.1968 73.384 152.7955 c
73.0989 152.3609 72.1887 151.9268 71.5481 152.3365 c
71.6252 153.1558 72.341 152.7437 72.7727 152.9488 c
71.0432 154.1646 66.677 154.1934 64.966 152.9488 c
64.8547 152.5328 65.6868 153.0577 65.5774 152.6417 c
65.4494 151.8887 64.6116 152.6988 64.1994 152.6417 c
64.5188 154.5157 66.5539 154.6758 68.1789 155.2447 c
68.22 155.7955 67.8957 155.9825 67.8733 156.4688 c
68.1272 156.7257 68.7727 156.5909 69.2512 156.6226 c
f
61.1379 156.3165 m
61.7785 153.1583 61.2659 149.8072 61.4446 145.7535 c
60.7317 148.6651 61.3401 152.8951 61.1379 156.3165 c
f
63.2815 156.3165 m
63.4592 156.3414 63.5539 156.2823 63.5871 156.1632 c
63.3508 152.1544 63.8723 149.7632 63.1282 146.0591 c
63.3899 149.5841 63.0364 152.8614 63.2815 156.3165 c
f
41.8493 155.3975 m
41.8005 154.5884 41.3782 153.4766 40.4724 154.0196 c
40.7092 154.6417 40.9861 155.8966 41.8493 155.3975 c
f
50.2693 153.7139 m
49.5862 152.9678 49.0764 152.0499 48.5852 151.1119 c
48.6931 151.7676 48.8352 152.3917 49.1975 152.795 c
48.7541 153.4737 47.9573 153.7989 47.2082 154.1729 c
47.1604 151.9737 48.2112 149.5699 48.8923 147.5909 c
49.2502 147.5421 49.4665 147.3487 49.9631 147.4371 c
49.8923 146.6407 49.3923 146.274 49.1975 145.5997 c
48.6023 145.9747 47.9104 146.252 47.2082 146.5186 c
47.4841 148.7447 46.2121 150.7217 45.6765 152.6417 c
46.2253 153.5738 46.7483 154.5308 47.2082 155.5499 c
48.5842 155.295 49.3992 154.4757 50.2693 153.7139 c
f
60.5266 152.9483 m
60.1233 152.5904 59.9455 153.3863 59.4543 153.4073 c
57.9426 153.5855 56.3586 153.6124 55.0144 153.2545 c
54.4421 153.2764 54.3513 152.3116 53.9431 152.6426 c
54.3992 155.3555 59.9817 156.0694 60.5266 152.9483 c
f
54.7087 152.6422 m
55.2375 152.7491 55.258 152.105 55.0149 151.877 c
54.4846 151.7701 54.466 152.4132 54.7087 152.6422 c
f
40.3186 151.1114 m
41.3225 148.1553 44.8806 145.6236 42.6155 142.0806 c
41.5217 142.1592 40.6316 142.4434 39.4006 142.3863 c
38.3069 143.9966 37.4446 145.8394 36.0329 147.1314 c
36.0989 148.2383 36.4597 149.0513 36.4919 150.1924 c
36.2468 150.7632 35.4617 150.7955 34.6545 150.8052 c
34.6047 151.5186 34.7737 152.0123 34.9617 152.4883 c
36.7717 152.0543 38.5525 151.5914 40.3186 151.1114 c
37.2576 149.8863 m
38.2449 147.3526 39.4016 144.9903 41.3909 143.4576 c
41.6726 145.8443 39.6155 150.1675 37.2576 149.8863 c
f
48.5852 150.9581 m
49.1296 150.7374 48.7834 149.6251 49.1975 149.2745 c
49.7903 149.1041 49.7424 149.8155 50.1164 149.4273 c
50.0364 149.2012 49.8894 149.0421 49.8093 148.8155 c
48.8816 148.9844 48.2903 150.0455 48.5852 150.9581 c
f
54.2493 149.2745 m
55.7922 148.7774 56.6184 147.5616 56.8528 145.7535 c
55.9612 146.5972 55.6662 148.0372 54.0964 148.2022 c
54.0984 148.6094 54.0383 149.0762 54.2493 149.2745 c
f
60.3723 148.9678 m
59.9602 147.6968 58.5364 147.4371 58.2297 146.0591 c
58.0559 147.3072 58.9104 148.8477 60.3723 148.9678 c
f
67.5676 145.6002 m
67.345 145.3633 66.7834 145.4654 66.343 145.4473 c
65.9866 145.8062 65.9348 146.4683 65.425 146.6724 c
65.3996 146.1993 65.7864 145.8062 65.425 145.4473 c
64.927 145.3594 64.7121 145.5513 64.3528 145.6002 c
63.8918 147.1412 64.6321 148.5074 65.884 148.8145 c
66.1213 147.4215 67.6467 147.3121 67.5676 145.6002 c
f
34.0427 147.4371 m
34.967 145.2491 36.134 143.3033 37.5637 141.6202 c
38.1409 141.4903 38.282 142.1285 38.636 141.7735 c
38.4636 140.9263 38.9338 140.1192 38.636 139.6304 c
37.6316 139.5963 37.052 139.9864 36.1858 140.0894 c
35.8318 139.5753 36.1316 138.4083 36.0329 137.6402 c
34.8557 137.5352 34.1487 137.8995 32.9709 137.793 c
32.2917 139.9722 30.552 141.0904 29.2966 142.6915 c
28.8137 142.7672 28.7566 142.4161 28.2258 142.5391 c
28.2649 143.418 28.1106 144.4903 28.3786 145.1402 c
29.2937 145.1382 29.718 144.6431 30.675 144.6812 c
31.3816 142.5821 33.0627 141.4561 34.0427 139.6304 c
34.6047 139.6793 35.092 139.1944 35.4197 139.4771 c
36.0788 142.3824 33.5676 143.4415 32.8176 145.4473 c
32.3498 145.5582 32.3679 145.1832 31.8996 145.294 c
31.8279 147.1841 32.303 148.4761 34.0427 147.4371 c
f
60.3723 147.5904 m
60.3723 145.7535 l
60.0598 145.5167 59.0012 145.5167 58.6897 145.7535 c
58.9104 146.7047 59.4192 147.3697 60.3723 147.5904 c
f
54.2493 147.4371 m
55.511 147.5264 55.6008 146.4415 56.0862 145.7535 c
55.8254 145.4034 54.9182 145.6973 54.4021 145.6002 c
54.2673 146.0972 53.9021 146.9405 54.2493 147.4371 c
f
67.261 144.376 m
67.0481 143.524 65.8293 143.9341 65.2707 143.9161 c
61.4895 143.796 56.9817 143.9161 53.6369 144.0699 c
52.2883 144.1319 50.6931 143.6588 49.656 144.5289 c
49.6311 144.9122 49.8923 145.0079 50.1169 145.1412 c
55.1941 144.817 60.1643 145.4268 65.7297 144.9879 c
66.1535 144.9551 67.3381 145.3419 67.261 144.376 c
f
66.4953 142.2325 m
66.095 140.7676 64.0647 141.5797 62.9739 141.6207 c
57.8703 141.8106 51.6936 141.1133 46.136 141.6207 c
45.9558 142.6993 46.5989 142.2457 47.0549 142.3863 c
49.2077 143.0474 53.1916 142.5386 56.6985 142.5386 c
60.3332 142.5386 63.9387 142.7794 66.4953 142.2325 c
f
24.5515 141.6202 m
25.7785 141.4703 26.5847 140.8985 28.0725 141.0084 c
29.2698 139.3482 29.9597 137.1812 32.5115 136.8756 c
32.6706 136.4424 32.8049 135.4424 32.5115 135.0382 c
31.9499 134.9883 31.1555 135.1685 30.8279 134.8843 c
30.5266 134.4722 30.7366 133.5474 30.6745 132.8946 c
28.0769 131.4732 27.5159 134.0225 25.7766 134.7315 c
25.7429 135.2242 26.0466 135.3795 25.9289 135.9561 c
25.0266 135.7515 24.0578 135.7632 23.3269 136.1094 c
21.9875 138.2564 24.1648 139.7882 24.5515 141.6202 c
24.2458 137.0274 m
24.7576 136.8106 25.7239 136.8106 26.2356 137.0274 c
28.8835 140.1602 21.9148 141.1812 24.2458 137.0274 c
26.5417 136.4156 m
27.5647 135.5103 28.2019 133.4366 30.2156 134.4254 c
30.0945 136.7535 28.4597 137.5694 27.3078 138.8643 c
27.0427 138.0572 26.8689 137.1602 26.5417 136.4156 c
f
47.9729 140.8546 m
44.8347 137.8697 41.3357 135.2457 37.7165 132.7413 c
37.3186 132.3223 37.0959 131.7296 36.1868 131.8233 c
39.4426 135.1993 43.5198 137.7554 47.0549 140.8546 c
47.9729 140.8546 l
p
f
63.2815 133.3541 m
62.2541 134.0572 61.8254 135.1763 60.22 135.4971 c
58.4143 135.8575 56.9553 135.3272 56.3918 136.7213 c
55.8284 138.1182 56.9368 139.4424 58.2297 139.6304 c
61.2493 140.0704 63.7239 136.9625 63.2815 133.3541 c
56.8528 137.793 m
56.595 135.5372 59.9182 136.4532 61.5969 135.6505 c
62.4309 135.251 62.0852 134.6832 62.9739 134.7315 c
62.8059 136.4703 61.3723 138.4512 59.6067 137.1812 c
59.4739 137.5093 59.6545 137.9962 59.4543 138.5591 c
58.5246 139.3375 56.9758 138.8824 56.8528 137.793 c
f
54.8611 138.7115 m
53.8083 136.8106 58.4836 130.9664 54.4021 130.9044 c
50.9055 130.8516 51.8215 138.2554 54.8611 138.7115 c
54.0964 133.9654 m
53.5183 133.9835 53.2732 133.6666 53.1775 133.2007 c
53.0735 131.9986 54.0671 131.3404 55.1672 131.8223 c
56.1809 134.0054 54.1511 135.5338 53.7903 137.3345 c
52.5525 136.4444 53.1384 134.6744 54.0964 133.9654 c
f
61.7512 130.752 m
60.7922 128.9918 57.4289 127.8257 55.1677 129.2208 c
56.4973 130.1881 57.8723 131.109 58.2287 133.0479 c
59.7307 134.4927 62.4465 133.6607 61.7512 130.752 c
60.9846 132.8951 m
58.1028 134.0211 58.0188 130.0308 56.0871 129.2208 c
57.1789 128.8731 58.9582 129.0806 59.302 129.9859 c
59.509 130.5157 58.6125 130.7081 59.1477 131.0577 c
59.7854 131.1348 59.8225 130.6099 60.5266 130.752 c
61.2405 131.1119 61.4953 132.1168 60.9846 132.8951 c
f
13.8357 131.9766 m
14.1887 132.0225 14.0056 131.5338 14.2956 131.5167 c
14.0779 130.2598 12.5149 129.2989 13.53 128.149 c
14.1799 128.3658 14.5578 128.857 15.0608 129.2208 c
17.2639 128.1299 19.6296 125.3707 22.4079 126.3116 c
22.9216 125.7027 23.3186 124.9776 23.633 124.17 c
22.4958 124.234 21.8308 123.8277 21.031 123.5557 c
18.9206 125.1719 16.6448 126.6207 13.53 127.2305 c
13.2019 127.9747 12.7898 128.6339 12.3049 129.2208 c
12.5857 130.3697 13.5779 130.8057 13.8357 131.9766 c
f
40.1653 126.772 m
29.2966 126.772 l
29.1462 127.5919 30.6872 128.2691 31.5935 129.067 c
32.6316 129.983 33.4885 131.0938 34.5012 131.8228 c
36.6472 130.397 38.3132 128.4908 40.1653 126.772 c
f
39.7063 125.8536 m
36.8977 125.2432 32.3606 125.5445 29.2966 125.6993 c
31.3923 126.5284 36.5793 126.2955 39.7063 125.8536 c
f
20.4182 122.7916 m
21.0051 122.2554 21.4621 121.5904 21.6433 120.6485 c
20.8103 120.4615 19.843 120.4073 19.3459 119.8834 c
17.47 120.7623 15.8039 122.9625 13.2239 122.1793 c
12.904 123.0323 12.2273 123.5303 12.1521 124.6275 c
12.8601 124.7374 13.4763 124.9376 13.989 125.2403 c
15.4783 123.8223 17.3191 122.7545 19.4993 122.0255 c
20.0349 122.0523 20.2702 122.3785 20.4182 122.7916 c
f
38.6355 124.9341 m
38.5842 122.5875 38.9055 120.6133 38.7883 118.1993 c
37.9524 118.0323 36.3835 117.8931 35.5735 118.1993 c
35.5832 120.5045 35.3113 122.5284 35.4206 124.9341 c
36.4695 125.2115 37.6462 125.2784 38.6355 124.9341 c
36.0325 124.4761 m
35.7234 122.7232 36.0515 120.3194 36.1863 118.5054 c
37.0232 118.4835 37.7102 118.6133 38.3293 118.8111 c
38.2932 120.7652 38.2522 122.7154 38.0232 124.4761 c
37.5305 124.8184 36.5813 124.5591 36.0325 124.4761 c
f
30.675 125.0875 m
31.7131 125.0035 33.0989 125.2676 33.8899 124.9346 c
33.7981 122.5474 34.0041 120.4556 34.0432 118.1983 c
33.2409 117.9493 31.4758 117.9493 30.675 118.1983 c
30.8821 120.6236 30.2488 122.9464 30.675 125.0875 c
31.134 124.4766 m
30.9172 123.0377 31.1951 120.2476 31.2868 118.6583 c
31.9011 118.3194 32.948 118.6802 33.5832 118.8106 c
33.6301 120.7965 33.5588 122.6646 33.4309 124.4766 c
32.8669 124.8067 31.7419 124.5875 31.134 124.4766 c
f
34.5017 125.0875 m
34.7497 125.1314 34.7659 124.9434 34.9617 124.9346 c
34.6887 122.5196 35.8508 119.2632 34.5017 118.0465 c
34.2488 120.0455 34.2488 123.0884 34.5017 125.0875 c
f
29.9089 124.9341 m
30.4719 123.2432 30.1472 119.876 30.2151 118.1993 c
29.2429 119.5821 29.9001 123.4903 29.9089 124.9341 c
f
39.0945 124.9341 m
39.7942 123.377 39.5076 119.8272 39.5544 118.1993 c
38.7766 119.9615 39.3435 122.2774 39.0945 124.9341 c
f
67.4143 120.0357 m
65.1155 119.4268 63.7766 117.857 63.1282 115.5967 c
61.8264 115.1837 60.2688 115.6451 59.4543 116.2091 c
59.4436 119.588 63.1379 122.1739 65.5774 123.251 c
66.8713 123.8218 67.2785 121.376 67.4143 120.0357 c
f
12.9172 121.107 m
12.821 120.4888 11.9953 120.6011 11.8464 120.0362 c
12.3904 119.0821 15.988 117.2838 17.3572 117.8931 c
17.7532 118.0689 18.2214 118.504 18.1223 119.1168 c
18.7493 118.3668 19.4353 117.6749 19.8064 116.668 c
18.7502 116.4991 18.0251 116.0001 17.3572 115.4429 c
15.6492 116.1212 12.2424 118.463 10.7742 116.5152 c
10.261 117.1251 9.841 117.8272 9.5491 118.6578 c
10.2893 118.8878 10.9914 119.1558 11.5403 119.5772 c
11.4592 120.4151 10.8752 120.7491 10.7742 121.567 c
11.425 122.564 12.925 122.7427 12.9172 121.107 c
f
69.4035 117.4337 m
68.4465 117.5235 69.1555 115.9473 68.1789 116.0567 c
68.1535 115.7237 68.7219 115.9864 68.9446 115.9024 c
68.5188 115.2852 67.2961 115.6695 67.261 116.3614 c
66.1203 115.2056 64.0285 115.0025 62.9739 113.7603 c
63.2063 113.5386 63.7522 114.3023 64.0461 114.5255 c
64.3215 113.7867 63.0325 113.2974 63.1282 112.2286 c
62.5774 112.2906 62.8889 113.2144 62.3625 113.3004 c
62.4504 114.3873 63.1789 114.8306 63.8928 115.2906 c
63.3664 121.3243 73.883 120.4893 73.0774 115.2906 c
73.8108 114.6456 74.7375 114.1934 74.6086 112.6885 c
74.1311 112.6182 74.1203 113.0147 74.1496 113.4537 c
73.3547 114.7506 71.3489 114.8365 70.1701 115.7496 c
70.136 116.5176 70.1145 117.0596 69.4035 117.4337 c
72.1594 115.5972 m
71.6282 115.7784 71.1369 116.0035 70.6291 116.2095 c
70.926 115.4854 71.9231 115.4625 72.7727 115.2906 c
72.7766 115.8043 72.5608 116.1007 72.3137 116.3614 c
72.2297 116.1397 72.4914 115.5714 72.1594 115.5972 c
f
53.4846 117.7398 m
53.2956 117.1671 50.6164 116.5709 50.8816 117.8926 c
51.5276 117.9678 53.1125 118.3658 53.4846 117.7398 c
f
40.4724 117.2803 m
38.7903 117.0001 37.1926 117.0533 35.5735 117.127 c
33.4177 117.2261 30.7195 116.4493 28.8376 117.2803 c
29.7375 117.9073 31.0246 117.5552 32.2053 117.5865 c
34.8074 117.6553 38.1545 118.2213 40.4724 117.2803 c
f
57.9231 116.8214 m
57.4582 115.8902 54.7551 116.4424 53.7903 116.5152 c
53.7903 116.9742 l
54.7844 117.1246 57.1848 117.4283 57.9231 116.8214 c
f
53.4846 116.8214 m
53.8093 114.9014 55.841 114.6885 57.7688 114.3721 c
57.6828 113.6744 58.0412 113.4185 57.9231 112.6885 c
56.2326 113.1915 55.0115 114.1641 53.7903 115.1373 c
53.4783 115.0924 53.4895 114.7232 53.1775 114.6783 c
53.3923 113.8721 53.9602 113.4195 54.5554 112.9942 c
54.7185 113.4683 53.5862 113.9605 53.6374 114.8311 c
55.0173 112.9962 58.2805 113.0445 58.6887 110.2383 c
58.1692 111.5455 56.177 111.7325 55.0144 110.8511 c
53.7605 111.6373 53.6662 113.5845 52.7185 114.6783 c
51.9455 113.0274 53.2195 110.4122 52.7185 108.5552 c
52.3586 108.5054 52.1433 108.3126 51.6472 108.4014 c
51.5163 111.0772 52.0862 114.4551 50.8816 116.0562 c
51.4812 116.0435 51.8362 115.7862 52.2595 115.5972 c
52.6404 115.9874 51.4206 116.0772 51.4934 116.6685 c
51.9065 116.9693 52.8313 116.7593 53.4846 116.8214 c
f
42.4621 116.668 m
42.7131 114.8463 39.4822 115.6109 38.176 115.5972 c
36.6321 115.5792 34.9939 115.2911 33.5832 115.4429 c
33.2903 115.4268 33.7639 114.9312 33.5832 114.525 c
32.4802 114.2891 32.1282 114.8043 31.7463 115.2911 c
31.093 110.001 32.281 103.6573 31.2873 99.6758 c
31.1062 104.4132 30.8293 110.2232 31.134 115.2911 c
30.822 115.6422 29.863 115.3463 29.2971 115.4429 c
29.487 115.022 30.7151 115.6373 30.5222 114.8311 c
30.3723 114.1641 29.0251 114.6939 28.3782 114.525 c
28.3782 110.3922 l
28.8362 110.0841 29.823 110.3052 30.5222 110.2379 c
29.9372 109.4049 30.6721 109.129 30.5222 107.942 c
30.1579 107.8472 29.8093 107.7369 29.7561 107.3301 c
29.551 107.6861 29.2092 107.9058 28.8381 108.0953 c
28.6072 108.9903 29.2209 109.0391 29.4499 109.4742 c
29.4353 109.8653 28.8801 109.7193 28.6853 109.9332 c
28.1052 107.147 28.551 104.6182 28.532 102.1251 c
28.5271 101.502 28.615 100.1602 27.9192 99.6758 c
27.7761 104.6861 27.8303 109.8882 27.7663 115.1373 c
27.5569 115.5401 26.613 115.2091 26.6951 115.9029 c
28.05 117.0352 32.0803 116.4258 33.8889 116.5152 c
36.7209 116.6529 39.6189 116.7291 42.4621 116.668 c
f
34.9612 115.2906 m
34.9411 115.0157 35.1482 114.9678 35.1145 114.6788 c
34.8913 114.4537 34.1125 114.4537 33.8894 114.6788 c
33.8371 115.2906 34.3274 115.3629 34.9612 115.2906 c
f
36.4919 115.2906 m
36.4729 115.0157 36.6789 114.9678 36.6448 114.6788 c
36.4221 114.4537 35.6428 114.4537 35.4197 114.6788 c
35.4197 115.1378 l
35.6179 115.3487 36.0857 115.2886 36.4919 115.2906 c
f
37.1047 115.2906 m
37.5637 115.2906 l
37.719 110.0499 38.0168 104.4737 37.5637 99.8297 c
36.738 100.2916 37.1047 101.5948 37.1047 102.4317 c
37.1047 106.2247 37.0056 111.4566 37.1047 114.8306 c
37.1047 115.2906 l
p
f
39.7063 115.2906 m
39.6814 115.1129 39.7405 115.0176 39.8596 114.9844 c
39.8547 114.4786 39.4245 114.3995 38.9416 114.3726 c
38.8127 114.5499 38.7395 114.7828 38.7873 115.1378 c
38.9695 115.3135 39.3293 115.3106 39.7063 115.2906 c
f
40.1653 115.2906 m
40.6452 115.1846 40.3655 114.8819 40.3186 114.5255 c
39.9294 114.5406 39.9573 115.0948 40.1653 115.2906 c
f
38.3288 100.5943 m
37.843 101.442 38.7649 102.1954 38.7878 103.043 c
36.9939 104.338 39.1741 105.1744 39.094 107.1763 c
39.113 107.7559 38.199 107.4053 38.176 107.942 c
38.011 108.7203 38.4582 108.8843 38.7878 109.1671 c
38.9089 109.7984 38.0559 109.4551 38.176 110.086 c
38.886 110.191 39.1648 110.7291 39.094 111.6163 c
39.0891 112.1719 38.3699 112.0142 38.176 112.3824 c
38.1672 113.546 39.1379 113.316 38.3288 114.2193 c
38.9822 114.1573 39.906 114.3673 40.3191 114.066 c
40.219 113.8599 39.9919 113.7813 39.7058 113.7603 c
39.6238 113.064 40.5222 113.3511 40.4719 112.6881 c
40.591 111.9063 39.5349 112.2984 39.4011 111.7701 c
39.3181 111.1783 39.6741 111.023 39.5539 110.3922 c
39.529 109.9581 40.4968 110.5191 40.4719 110.086 c
40.6628 109.4361 39.9631 109.6763 39.8601 109.3204 c
40.01 108.7559 40.7409 108.773 40.6252 107.942 c
40.406 107.4981 39.6199 107.6212 39.4011 107.1763 c
39.3249 106.6944 39.676 106.6363 39.5539 106.105 c
42.1111 107.0694 40.0432 112.6573 40.9309 115.2901 c
41.5212 115.2403 41.5012 114.5313 41.5442 114.2193 c
41.8352 112.1143 41.1941 109.878 41.3909 107.3301 c
44.7522 109.1744 47.3928 111.7364 50.7278 113.607 c
50.6169 112.1124 48.9509 111.5714 47.9729 110.8511 c
44.9079 108.5953 41.5749 106.2994 38.4822 103.962 c
42.7502 106.2271 46.5251 109.796 50.7278 111.6163 c
50.7278 108.0953 l
49.8669 107.171 48.6379 106.6133 48.1262 105.3404 c
48.9719 103.5001 50.8972 102.4009 50.7278 99.8292 c
50.3782 94.4713 51.0471 86.3419 50.7278 79.9298 c
50.4441 74.2071 50.654 67.322 50.5759 61.712 c
49.7502 61.44 48.0422 61.495 47.2082 61.712 c
46.5759 73.1085 48.0471 86.9239 47.2082 97.9923 c
46.947 101.4244 45.7932 104.5001 41.697 103.962 c
41.1389 102.7632 41.7971 100.9171 41.0842 99.6754 c
39.8601 103.8091 m
39.9148 102.6373 40.6999 101.3863 40.7781 100.7481 c
40.5832 101.8389 41.1282 103.5523 40.6252 103.962 c
40.6511 103.6299 40.0832 103.8931 39.8601 103.8091 c
f
38.176 115.1373 m
38.5798 115.1837 38.571 114.8174 38.636 114.5255 c
38.1238 114.3716 38.133 114.7374 38.176 115.1373 c
f
28.8381 113.9127 m
29.0012 114.2608 29.8 113.9708 30.2151 114.0655 c
29.9392 113.3336 30.2551 113.2047 30.675 112.8414 c
30.4748 111.8585 29.4641 111.9883 29.9089 110.6973 c
29.3469 111.0548 29.6941 112.3194 28.6848 112.2286 c
28.4109 113.0694 29.7502 113.3858 28.8381 113.9127 c
f
64.1994 113.7598 m
64.925 113.2481 63.7336 112.6002 64.6594 112.3819 c
64.7483 111.8341 64.2053 111.9161 63.7395 111.9229 c
63.2014 112.4879 63.6477 113.4249 64.1994 113.7598 c
f
61.9035 113.147 m
62.1887 112.0543 63.0598 111.5494 64.1994 111.3101 c
64.1741 110.8262 64.6067 110.7984 64.5051 110.2383 c
63.8723 109.4942 63.427 108.5631 62.5149 108.0953 c
60.9211 108.8472 60.2131 110.4883 59.76 112.3824 c
60.2034 112.9083 60.8303 113.2501 61.9035 113.147 c
f
53.1775 112.0753 m
53.7693 111.7486 54.1023 111.1636 54.4026 110.5445 c
54.2732 110.1124 53.9763 109.8487 53.4846 109.7794 c
53.2576 110.4215 53.2883 111.3194 53.1775 112.0753 c
f
53.0251 108.0948 m
53.781 109.3292 54.9548 110.1451 56.2395 110.8511 c
57.427 109.7408 58.3293 108.3492 58.9934 106.7178 c
58.1594 106.481 57.6868 105.8829 57.0051 105.4927 c
55.5207 106.2032 53.4529 106.3301 53.0251 108.0948 c
f
57.1575 110.8511 m
58.5207 109.8673 59.636 107.8194 60.22 106.565 c
59.4739 105.627 58.1164 105.2994 57.3118 104.4219 c
56.8977 105.816 58.9368 105.9132 59.4543 106.8712 c
58.8489 108.359 57.6662 109.2681 57.1575 110.8511 c
f
64.0461 108.8609 m
64.1907 108.9742 64.2785 109.1402 64.3518 109.3199 c
66.3811 108.6451 67.2707 106.8301 67.8723 104.7271 c
66.8489 106.357 65.3723 107.5338 64.0461 108.8609 c
f
33.1243 109.1675 m
33.6833 109.3043 33.3284 108.3023 32.9714 108.4014 c
32.844 108.8345 33.1872 108.7984 33.1243 109.1675 c
f
67.261 104.8804 m
67.3069 104.4776 66.9407 104.4864 66.6477 104.4224 c
66.6477 103.3507 l
66.7092 102.7466 68.011 103.3853 67.72 102.4317 c
67.928 102.4786 67.8469 102.8145 67.8733 103.0435 c
68.2297 102.8897 68.3664 102.5167 68.3332 101.9713 c
67.8957 101.8804 67.7073 102.1085 66.802 101.9713 c
65.9143 103.6363 65.1868 105.4595 63.2805 106.1055 c
64.0188 105.2105 65.7746 104.0084 66.0364 102.1256 c
64.9895 102.1837 64.717 102.1075 63.8938 102.4317 c
63.7825 102.8995 64.05 102.9893 64.0461 103.3507 c
63.1926 101.4483 63.2395 98.6456 63.1282 96.0025 c
61.6946 96.3287 62.0871 99.3453 62.2092 101.2076 c
62.2844 102.3575 62.6614 103.5733 62.6682 104.7276 c
61.4524 102.9337 61.9114 99.4634 61.4426 96.9205 c
60.5813 97.0274 59.7551 97.1695 58.9934 97.3804 c
58.9016 99.3824 58.8938 101.1866 57.7688 102.4317 c
57.9055 101.6133 58.4387 100.4947 58.2297 99.8297 c
56.8957 100.5377 54.718 101.2144 54.0959 102.1256 c
54.279 102.8585 55.5149 102.5665 55.9348 102.2784 c
55.8352 104.1705 54.6853 105.0103 53.9431 106.2584 c
56.0344 106.0543 56.8332 104.5552 57.6164 103.0435 c
58.551 103.1617 58.6887 102.4815 58.9934 101.9713 c
58.9465 102.2984 59.3235 102.5904 59.1477 103.0435 c
59.592 103.2423 60.2336 103.2423 60.678 103.0435 c
61.1731 103.3546 59.9836 103.2545 60.0657 103.6563 c
60.5774 104.7774 61.1047 105.8834 62.5149 106.1055 c
62.3664 106.3135 62.0002 106.3043 61.9035 106.5645 c
62.9709 109.6646 66.7825 106.9073 67.261 104.8804 c
60.9836 100.1353 m
61.1799 101.6065 60.4446 102.1456 59.6067 102.5855 c
60.2668 101.9693 60.55 100.9757 60.9836 100.1353 c
f
6.6413 105.7989 m
5.9231 108.2559 8.6291 108.3648 8.9372 107.024 c
9.1682 106.0172 8.0461 105.2188 6.6413 105.7989 c
f
55.0144 104.4219 m
53.8816 103.3101 51.9167 103.0289 51.0344 101.6661 c
50.1286 102.7501 49.4597 104.0718 48.7385 105.3409 c
49.2497 106.8702 50.9587 107.2022 52.2595 107.942 c
53.9397 107.5308 53.2146 104.7139 55.0144 104.4219 c
f
13.0705 107.1763 m
13.6072 107.2593 14.4416 106.9302 14.2956 105.9527 c
13.9045 103.3287 10.1994 106.7403 13.0705 107.1763 c
f
29.6033 107.1763 m
29.7815 106.5396 30.6662 106.6075 30.5222 105.6466 c
29.3591 104.4566 30.8664 102.7237 30.6755 101.0543 c
30.0832 101.5333 30.4001 102.9224 29.7561 103.3507 c
29.0432 103.0425 29.3821 101.6837 28.8381 101.2066 c
28.1672 102.4263 30.1594 104.5484 28.8381 105.9527 c
28.7175 106.6334 29.6594 106.2545 29.6033 106.8707 c
29.6033 107.1763 l
p
f
34.5017 103.8087 m
35.9206 101.7579 36.7385 99.107 38.0237 96.921 c
36.2258 98.1348 35.9045 100.8248 34.6545 102.5845 c
32.6999 101.0699 32.5847 97.7159 30.2156 96.6148 c
31.7449 98.9117 33.2068 101.2769 34.5017 103.8087 c
f
51.3406 101.3599 m
52.2063 102.5362 53.3874 103.3961 55.3215 103.503 c
54.6184 102.5132 52.5403 101.4381 51.3406 101.3599 c
f
9.5495 100.2886 m
9.1887 99.5323 7.8664 99.9903 7.1003 100.1353 c
7.2844 101.0855 6.7746 101.9844 7.1003 102.5855 c
8.0774 101.9796 9.1604 101.4805 9.5495 100.2886 c
f
53.9436 101.5128 m
53.4284 99.2725 54.8274 97.6168 54.5554 96.1558 c
54.2912 94.7388 52.4973 94.8487 52.2595 93.2466 c
52.2702 92.6978 52.8523 92.7159 53.0246 92.3277 c
53.5334 92.6519 52.5652 92.7725 52.7185 93.2466 c
53.2136 94.4366 54.5412 94.7916 55.1672 95.8487 c
54.8303 97.4507 54.7234 99.2828 54.4026 100.9009 c
54.7785 101.1998 55.2102 100.5748 55.7805 100.5938 c
56.1682 98.8897 55.55 96.1807 56.6985 95.2369 c
56.3938 94.4649 56.0461 93.463 56.3918 92.4805 c
54.8244 91.6138 52.4055 91.4786 51.6472 93.0938 c
52.6003 96.0396 50.0325 101.878 53.9436 101.5128 c
54.2493 92.4805 m
55.0622 92.2808 55.3938 94.024 54.8616 94.1646 c
54.8723 93.3887 54.3205 93.1758 54.2493 92.4805 c
f
65.2717 100.441 m
64.7668 99.1309 65.3137 96.734 64.6584 95.2369 c
63.8938 95.2369 l
63.5666 96.9981 63.6399 99.0289 63.8938 100.9009 c
64.55 100.9459 64.9045 100.6881 65.2717 100.441 c
f
3.5793 98.1456 m
4.1653 97.9156 4.5793 97.5108 4.9563 97.0738 c
5.0696 96.6553 4.6535 96.7657 4.6516 96.4615 c
3.9514 96.5777 3.6306 97.0738 3.1194 97.3804 c
3.2102 97.6988 3.4426 97.8746 3.5793 98.1456 c
f
15.5202 96.462 m
15.1921 95.6148 14.1125 95.5216 13.9895 94.4708 c
12.5505 95.2847 8.2434 95.609 7.2532 94.1646 c
6.4075 94.2379 6.0945 94.8428 5.5691 95.2369 c
5.8894 96.0909 6.6853 96.4678 7.1003 97.2266 c
8.3083 96.3936 10.5925 96.6368 12.6111 96.6148 c
13.4773 97.7999 14.5163 97.3345 15.5202 96.462 c
f
28.9914 95.0836 m
29.593 94.4029 29.1843 93.6514 29.6033 92.7877 c
31.1394 93.0196 32.01 94.6207 33.7361 94.1646 c
34.0622 92.7037 33.718 90.5748 34.0432 89.1133 c
32.9641 89.6675 33.7414 92.0767 33.2771 93.2466 c
32.4333 92.4986 33.425 90.4249 32.9714 89.5728 c
32.2663 90.0919 32.7253 91.7755 32.3591 92.6348 c
31.7292 92.2945 32.197 90.8575 32.052 90.0318 c
31.2302 90.2305 31.9812 92.0015 31.2873 92.3277 c
30.9353 91.9659 31.2331 90.9547 31.134 90.3384 c
30.5134 90.4317 30.758 91.3907 30.5222 91.8687 c
29.987 91.7896 30.2971 90.8687 30.2151 90.3384 c
29.9914 90.4717 29.7302 90.5674 29.7561 90.9507 c
29.551 90.8497 29.4714 90.6226 29.4504 90.3384 c
29.6013 89.5186 30.5891 89.5386 31.134 89.1133 c
30.8811 88.1563 32.176 87.6719 33.4304 87.7364 c
33.5823 86.9717 32.904 87.0372 32.5124 86.8174 c
32.3513 87.5176 32.071 87.1026 31.593 86.9708 c
31.4812 87.3887 31.8972 87.2794 31.8992 87.5821 c
31.3093 88.2686 30.0661 88.2999 29.6033 89.1133 c
29.4021 89.0596 29.363 88.8438 29.1443 88.8077 c
29.3352 88.0294 29.739 87.463 30.3684 87.1231 c
29.7073 86.6212 29.2292 87.6114 28.8381 87.8897 c
28.1501 87.8116 27.9123 87.2833 27.4602 86.9708 c
27.2151 87.627 28.6462 87.9239 28.2263 89.2657 c
26.8161 88.8907 26.4211 87.0294 24.7043 87.4288 c
24.842 87.877 24.842 87.8995 24.7043 88.3477 c
26.5652 87.8477 26.8791 89.8526 28.2263 90.3384 c
28.3523 90.7716 28.01 90.7344 28.072 91.1036 c
27.6604 91.2095 27.7771 90.7877 27.613 90.6446 c
27.2283 90.7696 27.4001 91.4517 27.154 91.7159 c
26.636 91.6216 26.9602 90.6856 26.6951 90.3384 c
25.99 90.3985 26.7873 91.9615 26.0823 92.0216 c
25.716 91.4708 25.969 90.2989 25.3171 90.0318 c
25.323 90.9068 25.259 91.7086 25.01 92.3277 c
24.3171 92.0015 24.9582 90.3409 24.552 89.7257 c
23.7361 90.0836 24.7541 92.2755 23.9392 92.6348 c
23.6213 92.5948 23.8982 91.9625 23.633 91.8687 c
23.0603 92.0108 23.4333 93.0987 23.3274 93.7066 c
25.0432 94.9879 25.968 92.3946 28.2263 92.7877 c
28.3684 92.8995 28.4573 93.0665 28.531 93.2466 c
28.5671 93.8956 28.2141 94.1529 27.7663 94.3184 c
28.1174 94.6304 28.3454 95.0665 28.9914 95.0836 c
f
3.1199 94.1651 m
4.9558 94.9283 3.3918 90.9683 4.9568 90.9503 c
5.5637 91.211 5.4407 92.2012 5.8757 92.6343 c
8.5198 92.3463 12.446 92.1763 14.1418 94.0123 c
14.8196 93.772 15.4099 93.4429 15.8259 92.941 c
15.5398 92.1041 14.7146 91.8072 14.2956 91.1031 c
11.3977 91.7501 7.3396 91.0601 5.4167 89.7261 c
4.9187 90.4522 4.2087 90.9674 3.426 91.4092 c
3.258 92.2491 3.1379 93.648 3.1199 94.1651 c
f
56.8528 90.9507 m
57.094 90.3765 57.4895 89.9547 57.4641 89.1133 c
55.47 88.9737 53.7322 89.1915 51.6472 88.961 c
50.4372 91.9654 54.7942 90.7037 56.8528 90.9507 c
f
14.1423 90.1846 m
15.0051 90.1295 15.4851 89.6915 16.1321 89.4195 c
15.9993 88.5333 14.9519 88.5587 15.0613 87.4288 c
12.9221 88.0391 9.344 87.5684 8.1721 86.2051 c
8.7561 84.2374 14.2942 84.9591 14.907 86.8184 c
15.3249 86.2657 16.2141 86.1846 16.8982 85.8985 c
16.7009 84.9219 15.8323 84.6173 15.6731 83.6026 c
13.8503 84.2325 9.3899 83.9874 8.9372 81.7657 c
8.074 81.8204 7.595 82.2579 6.947 82.5303 c
7.1662 83.6387 8.2732 83.8585 8.4783 84.9796 c
8.008 85.7344 7.1023 86.0538 6.3352 86.5108 c
6.8743 87.4512 7.3591 88.4464 8.1721 89.1133 c
10.1262 88.9835 13.3513 88.6661 14.1423 90.1846 c
f
56.3928 88.1954 m
57.0989 86.8087 56.5012 84.1192 56.6985 82.2247 c
55.677 83.4415 56.4582 86.8594 56.3928 88.1954 c
f
57.0051 88.1954 m
57.2512 88.2383 57.2678 88.0508 57.4641 88.0421 c
57.2961 85.9903 57.4729 84.9561 57.4641 82.2247 c
56.8606 84.0557 57.176 86.1807 57.0051 88.1954 c
f
37.1047 88.0411 m
36.8337 87.7188 36.759 87.5899 36.9509 87.1231 c
35.7707 86.6329 35.9148 87.2794 35.114 86.8184 c
34.5149 87.0889 35.8669 87.4649 35.2678 87.7364 c
35.718 87.9249 36.5808 87.6133 37.1047 88.0411 c
f
15.9792 82.5313 m
16.8284 82.461 17.2434 81.9571 17.8161 81.6114 c
17.802 80.5557 17.0862 80.2012 17.2034 79.0108 c
15.093 78.4669 12.6321 78.2755 11.5403 76.7149 c
10.2063 77.2188 9.0154 77.8633 8.0193 78.7032 c
8.344 79.8575 9.3703 80.3126 9.5491 81.6114 c
10.2263 81.42 10.5764 80.9044 11.2331 80.6954 c
10.5954 80.1075 9.9143 79.5635 9.8562 78.3985 c
10.6174 78.4747 14.3811 79.2579 15.6731 80.0821 c
16.8362 80.8243 16.2893 81.6895 15.9792 82.5313 c
f
85.784 81.1534 m
86.693 78.7393 83.128 79.7696 81.956 79.7755 c
73.4758 79.8126 60.5285 79.5567 51.1877 79.9298 c
51.2825 80.3438 50.9939 81.1426 51.3406 81.3067 c
61.5852 81.5508 75.1672 81.7208 85.784 81.1534 c
f
14.1423 80.8477 m
14.5119 80.4669 13.6872 79.9835 13.0701 80.0821 c
13.2942 80.4708 13.9983 80.379 14.1423 80.8477 c
f
31.4402 79.4698 m
31.9065 79.3223 32.0564 78.8614 32.8176 79.0098 c
33.0784 78.2911 32.0984 78.8106 32.3596 78.0919 c
31.9363 78.3331 31.9075 78.9669 31.1345 78.8575 c
31.1994 79.0977 31.6155 78.9883 31.4402 79.4698 c
f
53.7903 78.5508 m
53.1853 77.6758 52.406 76.9747 51.3401 76.5616 c
51.0232 77.1104 51.261 78.2169 51.1882 79.0098 c
51.9324 79.2969 53.6062 79.3214 53.7903 78.5508 c
f
66.343 79.0098 m
63.6633 78.2745 59.2248 78.9952 56.6985 78.5508 c
56.6174 78.6739 56.5383 78.7989 56.5461 79.0098 c
59.4582 79.2618 63.4309 79.2657 66.343 79.0098 c
f
55.7805 79.0098 m
55.4719 78.0489 54.4236 77.3546 53.6374 76.7139 c
52.9016 76.1153 52.0886 75.1319 51.1877 75.1837 c
52.3484 76.8301 53.9455 78.0372 55.7805 79.0098 c
f
59.761 75.9483 m
59.2844 75.8126 59.6067 74.878 59.302 74.5714 c
57.3118 74.5714 l
57.4543 75.7354 56.7483 76.0489 56.5461 76.8673 c
60.0325 76.9913 62.6907 77.3809 65.884 77.0206 c
65.9778 76.2471 66.3059 75.7071 66.343 74.877 c
66.0412 74.5733 65.468 74.7794 65.1184 74.877 c
65.2258 75.545 64.8586 75.7383 64.966 76.4083 c
63.9914 76.5147 64.22 75.4171 63.8938 74.877 c
62.9231 74.9766 61.5481 74.6758 60.8313 75.0294 c
60.1848 75.0469 60.5715 76.0967 59.761 75.9483 c
f
54.0964 76.4083 m
54.3044 75.7383 54.1155 75.6212 53.9436 75.0303 c
53.3767 74.9649 52.6677 74.4649 52.2595 74.7237 c
52.2966 75.2852 53.0364 76.3673 54.0964 76.4083 c
f
60.5266 74.5714 m
62.0578 74.5714 l
61.7219 73.8848 61.2131 73.3741 60.5266 73.0401 c
59.3225 73.294 59.7834 74.3653 59.761 75.6426 c
60.4328 75.7032 60.2883 74.9464 60.5266 74.5714 c
f
52.7185 74.5714 m
53.6374 74.5714 l
53.7825 74.0176 53.0344 74.3575 52.7185 74.2647 c
52.7185 74.5714 l
p
f
56.3928 74.1114 m
56.8528 74.1114 l
57.1008 73.6466 57.302 73.1319 57.3118 72.4278 c
56.5608 72.544 56.2707 73.1231 56.3928 74.1114 c
f
52.5652 73.6524 m
53.0251 73.6524 l
52.9333 71.523 52.9485 68.469 53.6374 66.305 c
52.5652 66.305 l
51.6272 68.577 51.7014 71.225 52.5652 73.6524 c
f
59.302 72.1221 m
59.6672 72.3985 58.4387 72.3731 58.6887 73.0411 c
59.3645 73.3956 60.1028 73.0743 60.3723 72.5811 c
59.8762 71.239 59.0256 70.255 58.0754 69.365 c
56.5705 69.545 55.925 70.582 54.7082 71.05 c
54.2532 69.367 55.1604 67.727 55.4739 66.305 c
55.1335 65.982 54.7366 66.466 54.0964 66.305 c
53.6824 68.33 52.9743 71.664 53.9436 73.6524 c
55.6623 73.586 55.9504 72.088 57.3118 71.661 c
58.095 71.8633 58.4817 72.7696 59.302 72.1221 c
f
20.1125 71.05 m
21.0471 71.168 21.5451 70.85 22.4084 70.897 c
22.6233 70.149 22.1072 69.145 22.1023 68.141 c
19.8713 67.464 18.1091 66.317 16.4392 65.08 c
16.3572 64.521 17.1101 64.392 16.7444 64.009 c
15.8694 64.103 14.8874 64.09 14.1423 64.315 c
14.3254 65.151 14.7551 65.742 14.9075 66.611 c
14.4675 67.089 13.2761 66.815 12.6111 67.07 c
12.5183 68.03 12.8352 68.581 13.0705 69.213 c
13.6233 69.153 14.0974 69.015 14.6013 68.907 c
14.6311 68.315 14.6072 67.779 14.4485 67.376 c
17.1223 66.897 18.8733 68.665 20.4182 69.825 c
20.5862 70.503 20.1594 70.587 20.1125 71.05 c
f
55.3215 69.825 m
56.7453 69.362 56.7434 67.472 57.3118 66.152 c
56.2395 66.152 l
55.6789 67.066 55.2424 68.765 55.3215 69.825 c
f
51.1877 69.52 m
51.5618 68.819 51.7756 67.151 51.6477 66.457 c
50.7048 66.689 51.4026 68.562 51.1877 69.52 c
f
61.5969 68.294 m
61.8606 67.69 62.0383 66.999 62.0578 66.152 c
61.6594 65.774 61.3059 66.3 60.6789 66.152 c
60.6789 66.764 l
60.0715 66.406 59.216 65.812 58.2297 66.305 c
58.2502 67.091 57.6301 67.235 57.6174 67.988 c
58.3879 68.598 60.4407 68.563 61.5969 68.294 c
f
65.2717 68.141 m
65.2815 67.366 65.0071 66.874 65.1184 65.998 c
64.511 66.055 63.6506 65.858 63.2815 66.152 c
63.2981 67.381 63.8576 68.811 65.2717 68.141 c
f
24.5515 67.224 m
24.4768 66.379 24.1985 65.739 24.0915 64.927 c
24.4685 64.333 25.5998 64.495 26.5417 64.467 c
26.3279 63.712 26.3928 62.677 26.3889 61.712 c
24.3108 60.881 22.6755 59.607 21.1838 58.192 c
21.0368 57.532 22.0705 57.592 21.6428 57.119 c
19.0408 57.119 l
19.0549 58.024 19.4866 58.511 19.3469 59.568 c
21.7449 60.334 23.8557 61.387 24.5515 63.856 c
23.3469 65.087 19.4197 62.038 18.5818 60.487 c
17.8249 60.599 16.9275 60.568 16.2849 60.793 c
16.3557 61.488 16.5608 62.049 16.5915 62.783 c
19.0115 62.747 20.4509 64.78 22.4089 65.692 c
22.6228 66.353 22.3757 66.87 22.4089 67.069 c
23.0237 67.22 23.7517 67.257 24.5515 67.224 c
f
85.631 65.233 m
85.639 64.479 85.751 62.38 85.478 61.405 c
84.538 62.908 84.053 64.69 81.957 64.315 c
80.0774 63.978 80.82 61.69 78.8957 61.253 c
78.2473 63.201 76.0227 65.403 73.9963 63.397 c
73.4153 62.819 73.1379 61.347 72.466 61.253 c
71.3 61.092 71.6868 62.061 70.9348 63.091 c
70.4963 63.692 69.2746 64.533 68.0266 64.315 c
66.3157 64.014 66.386 61.205 64.3528 61.559 c
63.4914 65.224 59.2825 65.014 58.2297 61.559 c
57.6164 61.559 l
56.7932 63.038 56.01 64.883 54.2493 64.774 c
52.5769 64.671 52.5251 62.7 51.3401 61.712 c
51.1311 62.627 51.0539 64.483 51.3401 65.387 c
51.3161 65.564 51.3743 65.658 51.4929 65.691 c
62.6555 65.518 75.383 65.322 85.631 65.233 c
f
45.5237 60.794 m
45.5554 59.844 45.5354 58.945 45.2175 58.345 c
42.8786 58.39 39.6365 58.223 38.0237 58.497 c
38.1223 59.266 37.8225 60.433 38.1755 60.946 c
40.3147 61.148 43.6145 61.32 45.5237 60.794 c
f
46.5945 60.946 m
61.384 60.804 75.8606 60.744 90.376 60.64 c
90.3 59.799 90.546 58.635 90.224 58.038 c
82.919 58.166 74.7903 57.857 68.0266 58.038 c
60.8332 58.231 53.9026 58.232 46.4426 58.498 c
46.1404 58.911 46.3503 59.835 46.2883 60.486 c
46.2825 60.75 46.4026 60.884 46.5945 60.946 c
f
42.921 57.27 m
44.091 57.495 45.522 57.459 46.953 57.432 c
47.817 57.414 48.69 57.387 49.5 57.423 c
52.128 54.849 55.323 52.842 56.088 48.396 c
52.596 52.257 48.402 55.407 42.921 57.27 c
f
50.886 57.423 m
54.558 57.423 l
55.08 56.883 55.683 56.406 55.782 55.434 c
54.945 55.461 54.324 55.263 53.64 55.128 c
53.982 53.994 54.792 53.319 55.17 52.221 c
54.45 52.725 53.739 53.778 53.028 54.669 c
52.281 55.605 51.498 56.532 50.886 57.423 c
f
55.9338 57.426 m
57.1692 57.539 57.9299 57.177 59.1477 57.273 c
59.4504 56.708 59.9319 56.32 59.9133 55.436 c
57.0051 55.436 l
56.5998 56.052 56.0159 56.486 55.9338 57.426 c
f
60.3723 57.273 m
63.4348 57.273 l
63.8118 56.783 64.2278 56.331 64.1994 55.436 c
63.1711 55.205 62.5989 55.464 61.1379 55.436 c
60.9192 56.026 60.136 56.719 60.3723 57.273 c
f
33.7366 56.507 m
33.7453 55.5 33.1804 54.878 33.5832 53.905 c
31.9324 52.748 30.5095 51.366 29.2976 49.772 c
29.1335 49.2 29.6775 49.335 29.6033 48.854 c
28.9944 48.595 27.9885 48.733 27.1545 48.7 c
27.1062 49.565 27.4255 50.062 27.3074 50.996 c
29.3342 51.776 30.3054 53.61 31.5935 55.13 c
31.6184 55.614 31.1863 55.642 31.2873 56.201 c
32.1243 56.282 32.7576 56.567 33.7366 56.507 c
f
47.2082 146.2125 m
47.1868 145.5181 46.8332 145.1583 46.7478 144.5284 c
45.9768 144.6763 45.6941 145.3126 44.758 145.2945 c
43.8738 147.5733 43.2312 150.0943 41.697 151.7232 c
41.947 152.3404 42.1228 153.0323 42.4621 153.5606 c
44.4631 153.4175 44.157 150.1544 45.0652 149.4273 c
45.3528 148.4932 45.6858 146.4102 47.2082 146.2125 c
f
70.6291 139.7833 m
71.1184 140.1363 70.303 140.4654 70.4758 141.0084 c
74.0227 140.5001 81.364 141.3731 86.09 140.3951 c
85.895 139.7242 84.489 140.2623 83.794 140.0894 c
84.409 139.1212 85.846 137.6524 86.243 135.9561 c
86.45 136.9571 86.489 139.1094 86.396 140.5494 c
88.327 139.4771 90.364 137.8414 92.366 136.2632 c
94.333 134.7125 96.188 132.9044 98.184 131.5162 c
96.347 131.9083 91.12 133.3174 90.224 131.0582 c
89.825 130.0572 90.129 128.5074 90.072 126.9244 c
89.913 122.7154 89.868 115.9341 89.917 112.0753 c
88.782 112.6251 87.927 113.4532 86.856 114.0655 c
89.702 111.5552 92.906 109.4014 95.888 107.0245 c
96.116 108.647 95.618 112.397 96.04 114.9844 c
96.868 112.2794 95.95 108.5235 96.652 106.2584 c
96.714 106.8604 97.76 106.4771 97.725 107.1763 c
97.931 108.1495 96.573 107.5562 96.652 108.4014 c
96.546 108.9683 96.895 109.0782 97.417 109.0142 c
97.674 109.5904 96.706 109.7115 97.113 109.9322 c
98.95 109.9322 l
98.504 109.2945 98.669 109.0045 99.407 108.8614 c
99.558 107.8453 98.575 107.9581 98.184 107.4835 c
98.059 106.6441 99.019 106.8892 99.255 106.4112 c
99.389 105.6143 98.402 105.939 98.184 105.4932 c
98.335 104.522 99.728 104.7921 99.407 103.3502 c
94.997 106.5933 90.557 109.8082 86.396 113.3004 c
86.427 113.8912 86.402 114.4283 86.243 114.8311 c
85.329 114.585 84.042 113.4483 83.182 114.5255 c
82.468 113.8614 81.698 113.2535 81.038 112.5352 c
81.809 112.4302 82.406 113.8204 83.335 114.0655 c
82.94 111.8575 81.506 110.689 80.579 109.0142 c
79.3537 109.0142 l
81.592 107.4205 82.647 112.2642 83.794 113.6075 c
84.032 108.2242 81.721 101.5523 81.345 96.0025 c
82.933 100.0054 83.62 105.7032 84.406 110.8511 c
84.577 111.9713 84.2 113.897 85.631 114.2193 c
85.475 107.0792 85.329 99.4551 85.172 92.7872 c
84.682 92.1031 83.825 91.7852 83.335 91.1031 c
82.505 91.7535 80.947 91.6754 79.8137 92.0211 c
79.7356 95.4791 79.3762 99.8023 77.9768 102.4322 c
78.4348 104.4844 76.675 105.6114 75.9856 107.0245 c
76.885 108.1163 77.6633 109.3282 78.2825 110.6983 c
78.8889 110.522 80.0676 109.0474 80.579 110.2383 c
79.7532 110.1041 78.6106 110.8795 78.5891 111.6163 c
78.5403 113.3062 82.57 113.7872 83.029 115.2901 c
81.577 114.5982 80.581 113.4512 78.8957 112.9942 c
78.8215 115.3131 82.345 114.0352 82.415 116.2091 c
81.352 116.7681 80.0881 116.2081 78.5891 116.3614 c
78.8313 112.7174 77.6877 108.4122 75.2209 107.4835 c
75.7766 109.2764 77.5139 109.8853 77.5168 112.2281 c
76.6467 110.6505 76.2571 108.5904 74.303 108.0953 c
73.4826 108.7042 73.5735 110.2232 72.3127 110.3922 c
73.5569 111.1373 75.1223 111.5631 75.2209 113.4532 c
76.1203 113.2291 77.3313 113.3184 77.5168 112.3824 c
79.4055 119.7535 72.5403 125.9112 64.3518 123.251 c
61.1125 121.5733 58.3127 117.9591 58.9934 113.3004 c
59.3684 110.7491 60.7151 109.3775 61.9035 107.4835 c
59.3703 108.6304 58.0989 112.0684 58.2287 115.5972 c
58.4446 121.3712 64.7024 125.6802 70.7825 124.4761 c
74.4319 123.751 77.2082 120.6671 78.4358 117.1275 c
85.784 117.1275 l
85.936 116.6221 84.802 116.5421 85.784 116.5152 c
85.577 115.5992 84.614 115.439 83.794 115.1373 c
84.738 114.6563 85.243 115.9312 86.243 115.9034 c
86.007 118.3414 86.829 120.9312 86.243 123.0972 c
85.747 124.9302 83.95 125.6905 82.57 126.772 c
84.481 127.8174 86.966 129.5811 86.243 132.2823 c
85.356 129.1895 82.768 127.7974 79.2024 127.3834 c
82.219 125.6553 85.425 124.1163 85.937 119.8834 c
84.713 119.8834 l
82.672 126.772 72.8235 125.8541 69.2512 131.21 c
67.8127 127.6993 63.3957 127.1671 60.9856 124.6285 c
60.8215 124.0274 60.9524 123.1304 60.678 122.6392 c
59.8088 122.2901 59.4426 123.2481 58.842 123.4034 c
56.0549 124.126 54.532 121.2003 53.178 119.5772 c
53.5339 122.4991 57.0305 125.2735 59.9133 123.251 c
61.1965 128.0552 68.883 127.2193 68.7922 132.8941 c
69.4787 132.9703 69.9387 132.8174 70.4758 132.7413 c
71.4748 130.8834 72.8625 129.4132 75.0696 128.7613 c
74.426 129.7222 72.7825 131.7535 72.7717 133.3541 c
70.8557 133.4742 67.2825 133.1363 65.1184 133.5074 c
67.4446 134.4591 70.3147 133.6412 72.6184 133.8131 c
72.5578 134.8443 72.7551 135.6163 72.925 136.4151 c
72.969 136.5201 70.9621 135.4312 70.9348 136.5684 c
70.3918 136.5513 70.3791 136.0035 69.7102 136.1104 c
70.1418 136.0631 70.3684 135.4063 70.0159 135.0382 c
69.4075 134.9381 69.0813 135.1212 69.0979 135.6505 c
68.7434 134.6192 68.2766 135.5455 67.5676 135.0382 c
66.8664 135.0523 66.9787 135.877 66.4953 136.1104 c
65.7063 136.1373 64.6721 135.918 64.5061 136.5684 c
65.509 133.6661 64.2649 130.8341 62.8215 129.0674 c
64.7229 129.7691 65.8703 131.2232 66.802 132.8941 c
68.1789 132.8941 l
65.7629 125.5142 54.2429 127.2374 52.1057 119.5772 c
51.0349 119.5772 l
50.8899 123.8575 54.6018 125.6011 57.7698 127.0772 c
54.2209 127.7642 52.0481 129.8253 50.8821 132.8941 c
49.7248 129.8922 52.1057 128.0753 53.7898 126.9244 c
51.613 125.3301 49.969 122.8961 50.5759 118.9644 c
51.1828 118.8453 53.5549 119.6661 54.2488 118.9644 c
53.553 118.0362 52.279 118.6065 50.8821 118.3521 c
50.5388 117.2154 50.8201 115.4542 50.7278 114.0655 c
49.572 113.4361 48.7981 112.4244 47.5139 111.9234 c
47.091 115.4893 47.5388 120.3702 47.3611 124.7813 c
47.2541 127.4302 47.5769 131.3541 46.136 132.4351 c
43.4778 134.4312 39.4519 132.7252 36.9509 131.3643 c
41.0227 134.7423 45.343 137.8731 49.657 141.0084 c
54.0129 140.8341 59.5383 141.4991 64.1985 141.0084 c
64.2825 139.9063 62.8801 140.2862 62.0569 140.0894 c
62.4485 139.2554 63.8879 138.1461 64.3518 136.8751 c
64.1203 138.1431 65.9192 138.3882 66.4953 139.3243 c
67.9914 139.1553 68.7844 138.2994 70.1692 139.1715 c
67.5578 139.2203 66.2375 139.9693 64.3518 140.0894 c
64.2414 140.5572 64.509 140.647 64.5061 141.0084 c
65.6946 141.2701 65.8576 140.4293 66.343 140.3951 c
66.6516 140.0474 66.8518 141.1031 67.4133 141.0084 c
68.4641 139.9625 70.5578 141.8072 70.6291 139.7833 c
50.8821 135.0382 m
51.1389 137.5865 52.8259 138.7061 54.0969 140.2432 c
50.7278 140.2432 l
50.5701 138.8194 50.3088 136.2144 50.8821 135.0382 c
71.0891 139.1715 m
71.6057 138.2613 73.1828 138.4073 73.0774 136.8751 c
73.5041 138.3873 74.6594 139.1734 75.5285 140.2432 c
73.4016 140.2921 72.1858 140.2501 71.0891 139.1715 c
76.1399 135.6505 m
77.466 135.9991 78.9426 135.1441 79.967 135.3443 c
83.113 135.9571 82.124 140.1251 79.3537 140.2432 c
76.3625 140.3692 73.3137 136.8853 73.844 133.8131 c
74.9241 134.6314 74.9309 135.3311 76.1399 135.6505 c
57.6184 139.7833 m
56.6438 139.5245 55.8625 138.2442 55.9338 137.3341 c
56.136 134.73 59.052 136.0035 61.1379 135.0382 c
62.719 134.3052 62.3059 133.1763 63.1282 131.6695 c
64.8127 135.2593 61.8567 140.9112 57.6184 139.7833 c
51.8 134.1192 m
51.8201 132.2022 53.7981 129.3565 55.7805 131.0582 c
58.4817 133.376 52.8557 136.8365 55.4739 139.6304 c
53.9499 138.9683 51.7707 136.877 51.8 134.1192 c
79.967 132.7413 m
79.8977 130.8814 81.101 129.1153 83.029 129.6793 c
86.566 130.7154 85.881 138.7442 82.415 139.0181 c
84.239 136.3692 81.342 134.1231 79.967 132.7413 c
79.8137 129.9864 m
78.635 131.4561 79.3996 134.2662 77.5168 134.7315 c
75.6946 135.1822 74.4192 134.0445 74.303 132.5884 c
74.0901 129.9112 77.6282 127.9844 81.191 128.7613 c
80.624 129.4703 80.335 129.3365 79.8137 129.9864 c
60.8313 134.1192 m
56.7278 134.4473 57.8391 129.5601 54.0969 129.5274 c
57.2561 126.2945 65.216 130.043 60.8313 134.1192 c
81.345 102.4322 m
81.4 104.6734 81.892 107.2911 82.263 108.7071 c
81.298 107.4581 80.443 104.5352 81.345 102.4322 c
80.579 95.8492 m
79.6672 99.8873 80.973 106.1422 77.9768 108.0953 c
80.1018 105.2711 79.3069 99.5255 80.579 95.8492 c
81.497 95.3892 m
82.708 94.814 82.124 92.4444 83.182 91.7164 c
83.491 92.4234 82.239 93.5992 82.722 94.4713 c
83.665 94.2413 83.818 93.2203 84.406 92.6343 c
85.075 93.9464 82.607 95.8931 81.497 95.3892 c
f
57.7688 103.6563 m
57.7727 105.3892 59.5149 105.3809 60.5266 106.105 c
60.6926 107.65 59.6545 107.9893 59.302 109.0142 c
59.6936 109.2261 60.7903 107.5631 61.2922 106.8712 c
60.9026 105.6754 59.6594 103.4742 57.7688 103.6563 c
f
8.6311 101.9717 m
9.489 102.1358 9.5549 103.0909 9.8562 103.8087 c
10.8591 103.1285 12.2312 103.6959 13.3772 103.3507 c
14.4968 103.0118 14.8982 101.7115 15.8259 101.3594 c
15.5701 100.1856 15.301 98.6397 15.8259 97.5328 c
13.8669 97.8697 12.8772 99.1768 11.2331 99.8297 c
10.8049 99.5435 10.6428 98.9908 10.468 98.4517 c
9.6648 98.6539 8.2761 98.7716 7.8659 98.1456 c
7.0598 98.9224 6.1199 99.5635 5.5701 100.5948 c
5.8342 101.3829 6.2268 102.5767 5.8752 103.5035 c
7.0608 103.2598 7.6091 102.3775 8.6311 101.9717 c
14.448 98.2989 m
14.3811 98.9678 13.8479 100.6168 14.448 101.6666 c
13.0071 101.4825 11.6208 102.1636 10.6208 101.5128 c
11.0119 99.5557 13.0759 99.2725 14.448 98.2989 c
f
56.5451 99.982 m
57.5715 99.484 57.1741 96.8951 57.3118 96.002 c
61.1662 98.2559 63.6272 93.607 67.8733 94.0132 c
68.4055 94.0631 68.9446 94.5841 69.5578 94.3179 c
68.886 93.6632 67.8078 93.4141 66.4963 93.4 c
66.7991 92.4171 68.7102 93.1592 69.5578 93.0943 c
68.2336 91.6602 65.7629 92.0372 64.3528 93.0943 c
64.7112 92.4 66.0471 91.105 67.261 91.1031 c
70.9983 91.1002 74.2336 99.4371 78.8957 95.0841 c
80.947 90.8062 75.1194 85.3799 77.5168 82.378 c
77.3547 82.0294 76.5559 82.3204 76.1399 82.2247 c
75.6282 82.9883 75.4348 84.0723 75.2219 85.1339 c
74.7121 84.3321 75.4162 82.7227 75.0696 82.0723 c
74.303 82.0723 l
73.9817 82.669 74.2258 83.8321 74.1496 84.6749 c
73.3293 84.3731 73.9621 82.6173 73.2317 82.2247 c
72.6379 84.9786 75.3625 87.711 75.8342 90.6441 c
74.4582 87.9376 72.7239 85.5899 72.0071 82.2247 c
71.3625 82.0762 70.6828 82.3048 69.7102 82.2247 c
71.4426 85.3907 73.4055 88.3282 74.7629 91.8692 c
72.8508 88.5762 71.0246 85.1983 68.7922 82.2247 c
67.6496 81.9727 66.9485 82.1485 65.883 82.2247 c
64.386 85.4219 62.759 88.4903 60.9836 91.4092 c
61.76 88.5606 64.0266 85.879 64.5051 82.2247 c
63.2258 81.9659 63.5637 83.3243 63.2805 84.0606 c
62.9328 83.4337 63.3215 83.0089 63.1282 82.2247 c
62.6994 82.0489 62.3332 82.0489 61.9035 82.2247 c
61.8811 83.2589 62.594 84.338 61.9035 85.1339 c
61.6477 84.0118 61.5676 82.7139 60.8313 82.0723 c
59.1477 82.0723 l
59.5168 83.3516 61.0022 84.2794 60.3723 86.0518 c
59.9573 86.1612 60.4817 85.3301 60.0657 85.4395 c
59.2444 85.6524 59.4387 86.4942 59.1477 87.2755 c
58.2336 89.7432 55.7551 93.0709 57.3118 95.8492 c
56.4817 96.566 56.2649 98.6612 56.5451 99.982 c
67.72 86.0518 m
67.0539 86.2022 66.8303 86.794 66.1887 86.9708 c
68.2942 82.0753 72.5618 91.4029 72.925 92.7882 c
71.3215 90.4112 70.1282 87.6251 67.72 86.0518 c
67.8733 87.7364 m
69.0696 87.9356 70.0188 90.0049 70.4758 90.7969 c
69.3879 90.1011 68.6907 89.0098 67.5676 88.3477 c
65.5754 89.315 64.3362 91.0372 62.6682 92.3282 c
63.9084 90.9732 65.6516 87.3663 67.8733 87.7364 c
67.4143 83.2969 m
68.5207 83.7208 69.1535 84.6182 69.5578 85.7462 c
68.7336 85.3966 68.428 84.5274 67.5676 84.2149 c
65.2571 86.1407 64.0862 89.2042 62.0578 91.4092 c
63.72 88.5841 64.9211 85.293 67.4143 83.2969 c
76.1399 84.5216 m
76.5862 84.4678 76.6555 86.127 76.2932 85.8985 c
76.3752 85.3067 76.0207 85.1524 76.1399 84.5216 c
f
64.1994 101.8189 m
67.1213 101.8321 68.7707 100.5743 70.7825 99.6758 c
70.9289 99.0059 71.0481 98.3091 71.0881 97.5333 c
69.4241 97.7042 68.0246 98.5562 66.802 97.6861 c
66.3196 98.0211 65.97 98.4869 65.5774 98.9112 c
65.4797 99.774 65.9875 100.0308 66.1887 100.5943 c
65.9387 101.4161 64.2561 100.8043 64.1994 101.8189 c
f
44.2991 86.6641 m
43.2341 87.8702 42.0593 88.1407 40.7781 88.96 c
40.427 88.1973 41.469 87.5098 41.8493 86.9708 c
40.905 87.1485 40.4363 87.8028 40.0134 88.501 c
39.365 88.129 39.3943 87.0792 38.3293 87.1231 c
38.4211 87.8995 39.4704 87.7188 39.2473 88.8067 c
38.4783 88.9132 38.5364 88.1924 37.717 88.3477 c
37.7292 88.5655 37.7424 88.7813 37.5642 88.8067 c
37.8791 89.5631 38.904 89.6094 39.7063 89.8795 c
39.842 91.4722 38.7571 90.9962 38.635 92.1754 c
38.1824 91.9644 38.4162 91.0674 38.176 90.6441 c
37.6413 90.8741 38.1711 92.1695 37.5642 92.3282 c
37.2312 91.8443 37.4011 90.8585 37.1052 90.3384 c
36.552 90.8072 37.0154 92.2901 36.4924 92.7872 c
35.8044 92.3531 36.3703 90.6632 36.1863 89.7252 c
35.634 90.6031 35.9582 92.355 35.4201 93.2462 c
35.0642 92.1734 35.3684 90.4415 35.2683 89.1133 c
34.4822 90.0142 34.4543 92.9512 34.9612 94.1651 c
36.9553 94.3785 38.6233 92.1182 39.8601 93.8585 c
40.0422 94.7051 39.0671 94.3931 39.094 95.0831 c
39.5412 95.4005 39.6701 95.5762 40.3191 95.3892 c
40.6672 94.9732 40.7571 94.2965 40.7781 93.5533 c
42.4641 92.6495 43.2112 95.0142 45.0642 94.9302 c
45.7883 93.2252 45.3342 91.2134 45.676 89.2662 c
44.9094 90.2344 45.2771 92.3375 45.0642 93.8585 c
44.4201 92.9732 44.6794 91.1822 44.6052 89.7252 c
43.9343 90.4835 44.5852 92.5631 44.1462 93.5533 c
43.5823 92.8404 43.7063 91.4405 43.6863 90.1841 c
43.1614 90.7315 43.3992 92.0411 43.0744 92.7872 c
42.4802 92.1724 42.7043 91.6505 42.615 90.4913 c
42.0002 90.6924 42.1794 91.6881 42.156 92.4815 c
41.407 92.5665 41.7903 91.5201 41.697 90.9503 c
41.2991 90.8585 41.1452 91.0123 41.237 91.4092 c
40.8054 91.2291 40.7722 90.6505 40.6252 90.1841 c
42.0544 89.3682 42.6804 87.7501 44.9114 87.7364 c
44.7361 87.2872 44.821 87.1671 45.218 86.9708 c
45.1833 86.586 44.1301 87.713 44.2991 86.6641 c
f
59.761 152.6422 m
59.8 150.7589 59.4797 147.73 57.6174 147.5899 c
55.6633 147.4449 54.0984 150.9561 55.6272 152.795 c
57.1955 153.0963 58.4504 152.9112 59.761 152.6422 c
56.0862 152.0299 m
55.968 151.4923 57.3489 151.6729 57.4641 151.877 c
57.261 152.1861 56.4407 152.3389 56.0862 152.0299 c
58.2297 149.8863 m
58.7727 150.0572 58.6789 150.8653 59.4543 150.8052 c
59.636 151.4468 58.8098 151.0782 58.6887 151.4171 c
58.7522 151.7623 59.5285 151.3941 59.4543 151.877 c
58.3137 152.441 58.4553 150.713 58.2297 149.8863 c
56.5461 151.1109 m
56.8166 150.9771 56.9924 150.626 57.3118 150.9581 c
57.4582 151.5201 56.5598 151.567 56.5461 151.1109 c
58.5354 149.1212 m
58.3137 149.358 57.7512 149.2559 57.3118 149.274 c
57.1555 148.7501 58.4602 148.9102 58.5354 149.1212 c
f
35.8796 114.066 m
35.7449 113.691 35.0246 113.9 35.114 113.3008 c
35.3386 112.7608 36.5979 113.253 36.6448 112.5347 c
36.51 111.6998 35.217 112.024 34.655 111.6168 c
34.655 110.545 l
34.6936 110.2266 35.3269 110.504 35.4197 110.2388 c
35.0139 109.338 35.6916 109.108 35.574 108.0948 c
36.0427 108.9996 35.0129 109.8336 36.0329 110.3917 c
36.4446 109.9937 35.8459 109.9298 35.8796 109.4737 c
36.3 109.128 36.8298 108.8917 36.6448 107.9429 c
36.2156 107.7598 35.5886 107.774 34.9607 107.7886 c
34.6228 107.7706 34.8957 107.1397 34.8078 106.8707 c
35.0456 106.3428 36.1887 106.7217 36.1858 105.9517 c
36.1589 105.4688 35.5808 105.5367 35.114 105.4927 c
35.0476 104.9669 35.175 104.6358 35.2678 104.2686 c
35.6999 104.1417 35.6638 104.4849 36.0329 104.4219 c
35.9577 103.7847 36.2136 103.4805 36.6448 103.3507 c
35.7678 102.5425 36.5339 101.524 36.7986 100.5938 c
35.7737 101.5098 35.4387 103.1138 34.8078 104.4219 c
33.5139 103.6739 33.2776 101.8687 32.3586 100.7476 c
31.6028 101.546 33.5466 102.4639 32.5119 103.0435 c
32.5896 103.5279 32.9617 103.7159 32.9709 104.2686 c
33.3889 104.3809 33.28 103.9639 33.5827 103.963 c
33.8157 104.3428 34.1848 104.586 34.196 105.1876 c
34.1618 105.6636 33.4328 105.4459 32.9709 105.4927 c
32.9968 105.671 32.9368 105.7657 32.8176 105.7989 c
32.7986 106.0748 33.0046 106.1226 32.9709 106.4117 c
33.8899 106.4117 l
34.3967 106.4659 34.1296 107.2935 34.196 107.7886 c
33.5437 108.107 32.698 107.2349 32.053 107.9429 c
32.053 109.0137 l
32.3728 109.1016 32.489 109.3936 32.9709 109.3199 c
33.1159 109.9127 32.3738 109.9507 32.8176 110.3917 c
33.468 110.2037 33.6418 110.336 34.3489 110.3917 c
34.9617 112.4346 32.595 111.4957 32.053 112.3819 c
32.0818 113.2696 33.3738 112.8975 33.7366 113.4537 c
33.5979 113.8756 32.8596 113.6998 32.8176 114.2188 c
33.6189 114.3507 34.9758 114.2789 35.8796 114.066 c
f
55.1677 88.3477 m
55.4953 87.8585 55.5051 87.0528 55.4739 86.2051 c
54.7659 86.4493 54.4216 86.1016 54.0969 85.5919 c
54.1335 85.0606 54.6907 83.5958 53.6369 83.7559 c
55.2019 82.9434 53.9905 85.2989 55.4739 84.9796 c
55.6545 83.5225 54.8909 83.0128 54.4026 82.2247 c
52.7185 82.2247 l
51.4275 83.1212 50.8747 86.0645 51.6477 88.0411 c
52.6086 88.3555 54.1775 88.0635 55.1677 88.3477 c
52.2595 85.7462 m
52.4216 86.0938 53.2219 85.8038 53.6369 85.8985 c
53.6257 86.7803 51.6599 86.5108 52.2595 85.7462 c
52.7185 84.8282 m
53.1838 84.8204 53.7258 84.7383 53.6369 85.2872 c
53.4138 85.7579 52.4988 85.6368 52.7185 84.8282 c
54.2488 82.838 m
54.4377 83.3467 53.2136 83.211 53.1775 82.9903 c
53.4729 82.7872 53.7937 83.1026 54.2488 82.838 c
f
55.0144 77.4796 m
55.8596 77.2032 56.0578 76.2774 56.6985 75.796 c
56.4973 75.5274 55.845 74.9239 56.6985 74.878 c
56.5276 74.3341 56.0393 74.1075 56.2395 73.1924 c
54.9846 73.1632 55.3274 74.7305 54.0964 74.7237 c
54.4607 75.3253 54.7224 76.0147 54.0964 76.5606 c
54.2497 77.0206 54.5544 77.3262 55.0144 77.4796 c
f
22.8674 73.6524 m
20.3132 78.9405 18.386 84.668 17.8161 91.7164 c
16.6252 106.4205 21.6721 118.9542 27.7663 127.2315 c
26.4114 126.8511 25.9504 125.5772 25.6233 124.1695 c
24.5842 124.9166 24.0232 126.1402 23.633 127.5362 c
21.4714 126.9224 20.1164 129.6656 17.969 129.5274 c
18.0222 131.0591 17.844 132.3614 17.6623 133.6602 c
19.2351 134.4356 20.9841 135.0333 22.7141 135.6505 c
22.8093 134.9952 22.216 135.0264 22.2551 134.4254 c
22.718 133.6002 23.8694 133.5855 25.01 133.8135 c
25.0671 133.1446 24.344 133.2545 24.551 132.4356 c
25.1194 131.7325 25.9192 132.6905 26.5412 132.2823 c
28.4162 131.7764 27.218 129.1256 28.2263 127.8433 c
30.7302 130.5435 33.0373 133.4415 36.032 135.6505 c
38.9114 137.7745 42.196 140.3013 45.5232 141.4674 c
42.2771 139.1954 38.9812 137.4464 36.032 135.1915 c
33.1633 132.9952 30.5993 130.1583 28.3782 127.2315 c
22.5681 119.5753 18.6091 110.4141 18.1223 97.0743 c
27.4001 95.5274 36.9944 96.4586 45.9831 97.2276 c
48.2971 85.4366 45.9983 68.844 34.5012 67.988 c
25.862 67.345 23.0193 74.4874 20.8772 81.0001 c
25.4944 84.5264 23.2453 94.1363 18.428 95.6954 c
18.0754 88.4835 19.4241 81.293 22.4084 75.6426 c
23.5412 73.4962 24.8132 71.376 26.0823 69.366 c
32.1052 59.828 41.5364 51.924 53.177 48.24 c
54.2121 47.913 55.5461 48.015 56.2395 47.017 c
40.4343 51.111 29.9211 60.498 23.0212 73.4991 c
22.0002 73.0303 20.9602 73.7559 19.8064 73.6524 c
19.2331 73.5108 19.6062 72.4229 19.4993 71.8155 c
17.9392 71.387 16.3484 70.986 15.6731 69.672 c
13.9392 69.93 12.572 70.553 10.7742 70.743 c
10.9812 72.6807 11.9402 73.8653 11.9983 75.9483 c
12.5173 75.8546 12.5442 75.2696 12.9172 75.0294 c
13.801 75.2188 14.3694 75.7227 14.448 76.7139 c
15.1262 76.7803 14.781 75.8223 15.3664 75.795 c
16.9514 76.2852 16.5803 78.1895 18.428 78.2452 c
19.7414 78.2842 20.9914 77.3555 21.49 76.254 c
21.864 75.4298 21.5222 73.8985 22.8674 73.6524 c
18.5813 131.9761 m
20.0163 131.4073 22.0984 128.3233 23.7864 130.4454 c
22.6833 131.7833 20.3791 133.9634 18.5813 131.9761 c
27.3074 129.0674 m
27.4123 130.4932 25.3362 130.8555 24.092 129.8336 c
23.9983 128.2613 23.947 126.6173 25.01 125.8536 c
24.7312 127.3384 27.2253 127.9595 27.3074 129.0674 c
19.8064 96.0025 m
22.363 93.4752 24.9324 90.2525 24.3982 85.1329 c
25.4631 86.504 28.1833 82.4239 28.9914 85.2862 c
28.8181 85.6758 28.2224 85.6407 28.072 86.0528 c
29.1091 87.213 30.0681 85.8966 29.9094 84.5216 c
31.4631 83.9971 32.428 85.2247 33.7361 85.4395 c
34.3791 84.1133 34.2263 82.1221 34.0432 80.5411 c
33.7283 80.5841 33.737 80.9503 33.5832 81.1534 c
33.5852 81.8194 33.634 82.5303 33.4304 82.9903 c
33.1374 84.9669 33.5364 81.1348 32.9714 81.0001 c
32.5564 81.6065 33.008 83.0792 32.3591 83.4493 c
32.2951 82.7471 32.5564 81.7208 32.052 81.4591 c
31.7561 81.9278 32.0022 82.9405 31.593 83.2969 c
31.4543 82.8751 31.5451 82.2208 31.2873 81.92 c
31.0442 82.1876 31.0823 82.7344 30.9812 83.1426 c
30.2942 83.2676 31.0144 81.9874 30.3684 82.0714 c
30.2844 82.3438 30.2893 82.7071 30.0632 82.838 c
29.8884 82.502 29.6672 82.211 29.7561 81.6124 c
30.3303 81.127 31.8303 80.5997 31.134 79.7755 c
30.4114 79.92 30.0564 80.4317 29.6033 80.8477 c
29.3572 79.377 30.3992 79.1944 30.675 78.2452 c
29.7424 78.3321 29.8303 79.4405 28.9914 79.6221 c
28.4441 79.4044 28.3533 78.7305 27.7663 78.5508 c
27.9372 79.1964 28.5862 79.3633 28.3782 80.3868 c
27.7414 79.9532 26.9201 79.7032 26.0823 79.4708 c
25.7951 79.1778 26.1731 79.1924 26.0823 78.7042 c
25.4402 79.1954 24.9094 78.5206 24.551 78.2452 c
24.7644 78.9669 23.863 78.5772 23.7864 79.0098 c
24.3552 78.8477 24.0862 79.5264 24.3982 79.6221 c
26.487 78.9024 26.7834 81.1876 28.3782 81.4591 c
28.5432 82.0792 28.5432 82.5235 28.3782 83.1426 c
27.739 83.2227 27.9582 82.4405 27.613 82.2247 c
27.2302 82.3536 27.7893 83.4219 27.154 83.2969 c
26.9153 82.7501 27.2351 82.3262 26.8474 81.7657 c
26.1614 81.8438 26.8581 83.3067 26.3894 83.6036 c
25.7351 83.2872 26.5583 81.4942 25.6233 81.4591 c
25.4792 82.2842 25.947 83.7227 25.3171 84.0616 c
24.8572 83.2969 25.6164 81.3135 24.7043 81.0001 c
24.4851 82.0059 24.6701 83.4161 24.3982 84.3673 c
23.8591 84.3458 23.9621 83.6817 23.7864 83.2969 c
24.7131 83.0118 24.1701 80.5528 23.633 80.2344 c
23.6413 81.1612 23.677 82.1153 23.3274 82.6837 c
22.9641 81.7188 21.9582 81.3985 21.49 80.5411 c
23.029 75.4835 25.6184 70.085 31.2873 68.906 c
33.5412 68.439 37.1052 68.788 38.4822 70.438 c
36.843 70.093 36.258 71.53 34.8083 71.8155 c
34.717 70.499 35.487 70.045 36.032 69.366 c
34.8694 69.325 34.6072 70.186 34.3493 71.051 c
33.6023 70.794 33.3562 69.332 32.5124 69.672 c
33.0632 70.347 33.6682 70.964 33.5832 72.2745 c
33.1042 71.426 30.7082 71.39 31.4402 70.284 c
30.4983 70.564 30.842 69.557 30.2151 69.52 c
30.4573 70.355 29.5803 69.682 29.6033 69.979 c
29.6213 70.582 30.2683 70.446 29.9094 71.051 c
31.364 70.939 32.2541 72.6729 33.2771 73.4991 c
32.8713 73.6544 32.9753 74.3194 32.6643 74.5714 c
32.4021 74.3223 32.6062 73.6104 32.052 73.6524 c
32.0862 74.1456 31.781 74.3008 31.8992 74.877 c
31.2654 74.8477 31.6711 73.7784 30.9812 73.8057 c
30.8703 74.1534 31.2571 74.9991 30.675 74.877 c
30.4934 74.293 30.7243 73.2969 30.2151 73.0401 c
29.969 73.7637 30.009 74.7725 29.6033 75.336 c
29.4861 74.4337 29.9231 72.9757 29.1443 72.7335 c
29.0451 73.7071 29.1643 74.8975 28.531 75.336 c
28.4392 74.2032 28.7082 72.71 27.9192 72.2745 c
28.0242 73.7559 27.7722 74.8819 27.7663 76.254 c
29.466 77.3975 31.7663 74.7842 33.8894 75.9483 c
34.1311 76.9551 33.448 77.0372 33.2771 77.6329 c
35.1511 78.6114 34.6511 76.6807 35.114 75.4893 c
37.3103 75.129 37.7571 76.5206 39.7063 76.4083 c
40.6433 75.2471 39.9011 73.0245 40.0134 71.8155 c
39.24 72.7813 39.7424 74.3165 39.4001 75.4893 c
38.967 74.8008 39.5334 73.1114 39.094 72.4288 c
38.593 72.8975 38.8503 74.1231 38.7883 75.0294 c
37.885 74.963 38.758 73.1212 38.0232 72.8878 c
37.6701 73.3008 38.1701 74.5645 37.5642 74.7247 c
37.1824 74.4913 37.657 73.4053 37.2571 73.1924 c
36.5774 73.2276 37.3244 74.6895 36.6452 74.7247 c
36.2942 74.5645 36.717 73.6299 36.3391 73.4991 c
35.7654 73.4874 36.3 74.5831 35.7263 74.5714 c
35.8713 73.9483 35.614 73.3233 35.114 73.8057 c
34.5564 72.2657 36.5701 72.5557 36.7981 71.357 c
37.4363 71.193 37.4734 71.316 38.176 71.357 c
37.8503 70.774 38.4612 70.626 38.9421 70.438 c
42.1052 72.8878 44.508 76.0958 45.3713 80.8477 c
44.3884 80.8008 45.0212 83.5098 44.6052 84.5216 c
44.2634 83.6905 44.6213 82.1573 44.1462 81.4591 c
43.9343 82.0645 43.9241 82.8702 43.8391 83.6036 c
43.5364 83.7462 43.782 82.0323 43.3801 81.7657 c
43.1653 82.3165 43.3904 83.3048 42.9211 83.6036 c
42.5544 83.4083 43.0061 82.3956 42.615 82.2247 c
42.1311 82.3028 42.3674 83.0997 42.0022 83.2969 c
41.7903 83.0489 41.8733 82.5079 41.5432 82.379 c
41.4924 82.7354 41.3874 83.0372 41.0842 83.1426 c
40.863 82.8028 40.7004 82.4053 40.7781 81.7657 c
42.3972 81.3946 42.3552 79.3633 44.4514 79.4708 c
44.1521 79.1837 44.405 78.9092 44.4514 78.5508 c
43.8342 78.7618 43.9104 78.2764 43.6863 78.0919 c
43.6721 78.588 43.2624 78.6876 42.9211 78.8575 c
42.9353 79.0977 43.3113 78.9776 43.2273 79.3165 c
42.3801 79.8458 41.4363 80.2803 40.6252 80.8477 c
40.4944 79.2852 41.841 78.3907 42.155 77.7852 c
40.9573 77.5567 41.261 78.8301 40.4724 79.0098 c
39.6384 78.8712 39.2951 77.4366 38.3293 77.9385 c
39.28 78.5176 39.8161 79.5118 40.0134 80.8477 c
39.1243 80.8692 39.1731 79.9522 38.635 79.6221 c
37.6003 80.4512 37.1604 78.2969 36.3391 78.7042 c
36.5422 79.42 37.2663 79.6133 37.8694 79.9278 c
38.2761 80.2842 37.4631 80.3399 37.8694 80.6944 c
38.5842 80.8985 38.9504 81.4512 39.7063 81.6124 c
39.716 82.338 39.7312 83.0655 39.2473 83.2969 c
39.3191 82.8155 39.0564 82.6719 38.7883 82.5303 c
38.6692 82.8712 38.7004 83.3614 38.3293 83.4493 c
38.3332 82.8321 38.2854 82.2696 37.8694 82.0714 c
37.8743 82.6895 37.8264 83.254 37.4104 83.4493 c
37.3933 82.752 37.407 82.0245 36.9514 81.7657 c
36.9714 82.6524 36.926 83.4747 36.4924 83.9083 c
36.114 82.9014 36.7624 81.8087 36.032 81.1534 c
35.9612 82.2042 35.9573 83.3233 35.573 84.0616 c
35.281 83.0284 35.6794 81.3028 35.114 80.5411 c
35.3 82.2022 34.7873 83.8243 35.114 85.1329 c
36.8962 85.6036 37.8552 84.1602 39.7063 84.2149 c
39.8342 84.5977 40.1262 84.8165 40.1653 85.2862 c
40.1013 85.8848 39.2903 85.7374 39.2473 86.3585 c
39.6443 86.5225 39.9973 86.7305 40.6252 86.6641 c
41.1394 86.0567 40.884 84.6798 41.5432 84.2149 c
43.2722 84.1192 43.5134 85.5118 45.217 85.4395 c
45.217 85.2852 45.341 85.2579 45.3713 85.1329 c
45.4114 84.1016 44.7273 82.2071 45.676 81.4591 c
46.1042 86.3995 46.0032 91.2706 45.3713 96.1553 c
36.928 95.6915 28.2781 94.8414 19.8064 96.0025 c
17.969 74.7247 m
19.0564 74.4844 19.7654 73.8663 21.1833 73.9581 c
21.3772 77.754 18.1531 78.6075 17.969 74.7247 c
12.4582 70.897 m
14.7663 71.088 15.9534 72.4024 17.8161 73.0401 c
17.675 73.7423 18.1994 73.7794 18.1223 74.4171 c
15.8581 74.751 12.4543 73.8262 12.4582 70.897 c
f
64.5051 75.796 m
65.1262 75.5684 65.093 73.9356 64.5051 73.4991 c
65.1057 73.6378 65.4602 73.6856 65.8821 73.3467 c
65.8127 72.0919 65.5793 70.998 65.425 69.824 c
64.6838 71.482 63.843 73.0421 62.9748 74.5704 c
64.134 74.3311 64.4543 74.9278 64.5051 75.796 c
f
grestore
gsave
-19.782 .003 m
139.536 .003 l
139.536 171.732 l
-19.782 171.732 l
-19.782 .003 l
clp
98.357 12.577 m
94.478 12.577 l
94.478 .479 l
114.45 .479 l
114.45 5.433 l
106.499 5.433 l
106.499 12.193 l
102.697 12.193 l
102.697 5.433 l
98.357 5.433 l
p
114.45 31.596 m
107.997 27.179 l
107.154 26.604 106.346 26.066 105.808 25.681 c
105.116 28.563 103.197 30.522 100.124 30.522 c
96.245 30.522 94.363 27.603 94.363 22.687 c
94.363 20.151 94.402 17.116 94.478 15.503 c
114.45 15.503 l
114.45 20.458 l
106.654 20.458 l
106.654 20.65 l
114.45 25.566 l
114.45 31.596 l
p
100.622 25.259 m
102.275 25.259 103.388 24.03 103.388 22.109 c
103.388 21.572 103.388 20.957 103.312 20.458 c
98.202 20.458 l
98.165 20.919 98.126 21.418 98.126 21.956 c
98.126 23.991 99.048 25.259 100.622 25.259 c
114.45 46.241 m
110.493 46.241 l
110.493 38.905 l
106.114 38.905 l
106.114 45.897 l
102.351 45.897 l
102.351 38.905 l
98.357 38.905 l
98.357 46.241 l
94.478 46.241 l
94.478 33.951 l
114.45 33.951 l
p
114.524 55 m
94.404 55 l
94.404 49.826 l
114.524 49.826 l
p
108.228 75.0089 m
106.077 75.0089 104.387 73.8956 103.773 71.667 c
103.734 71.667 l
102.966 73.6641 101.277 74.7403 99.356 74.7403 c
96.206 74.7403 94.363 72.5508 94.363 67.173 c
94.363 64.524 94.478 61.259 94.478 59.223 c
114.45 59.223 l
114.45 62.296 114.527 64.907 114.527 66.367 c
114.527 72.9356 111.224 75.0089 108.228 75.0089 c
100.085 69.479 m
101.814 69.479 102.659 67.903 102.659 65.561 c
102.659 65.291 102.659 64.715 102.62 64.139 c
97.859 64.139 l
97.859 64.792 97.82 65.599 97.82 66.213 c
97.82 68.71 98.741 69.479 100.085 69.479 c
108.228 69.785 m
109.88 69.785 110.993 68.671 110.993 66.252 c
110.993 65.483 110.954 64.715 110.878 64.139 c
105.77 64.139 l
105.731 64.638 105.731 65.407 105.731 65.829 c
105.731 68.326 106.46 69.785 108.228 69.785 c
106.73 96.6553 m
94.478 96.6553 l
94.478 91.7784 l
106.114 91.7784 l
108.995 91.7784 110.686 90.587 110.686 87.5528 c
110.686 84.7491 109.38 83.2891 106.308 83.2891 c
94.478 83.2891 l
94.478 78.335 l
107.421 78.335 l
111.954 78.335 114.796 81.2149 114.796 87.2842 c
114.796 93.8521 111.185 96.6553 106.73 96.6553 c
114.45 116.897 m
107.997 112.48 l
107.154 111.9034 106.346 111.3663 105.808 110.982 c
105.116 113.8624 103.197 115.8214 100.124 115.8214 c
96.245 115.8214 94.363 112.9024 94.363 107.9864 c
94.363 105.4512 94.402 102.4171 94.478 100.8033 c
114.45 100.8033 l
114.45 105.7584 l
106.654 105.7584 l
106.654 105.9503 l
114.45 110.8663 l
114.45 116.897 l
p
100.622 110.5591 m
102.275 110.5591 103.388 109.3301 103.388 107.4102 c
103.388 106.8721 103.388 106.2574 103.312 105.7584 c
98.202 105.7584 l
98.165 106.2193 98.126 106.7183 98.126 107.2559 c
98.126 109.2921 99.048 110.5591 100.622 110.5591 c
113.335 135.609 m
103.811 135.609 l
103.811 130.6544 l
110.072 130.6544 l
110.302 129.963 110.417 129.1182 110.417 128.273 c
110.417 125.0084 108.305 122.7813 104.464 122.7813 c
100.508 122.7813 98.281 125.3541 98.281 128.8492 c
98.281 130.7701 98.663 132.5362 99.394 134.3033 c
95.131 135.2252 l
94.439 133.0743 94.132 130.8853 94.132 128.734 c
94.132 121.6671 98.895 117.5191 104.848 117.5191 c
111.454 117.5191 114.796 121.9361 114.796 127.8502 c
114.796 130.6929 114.258 133.2281 113.335 135.609 c
false s
1 .75 0 0 k
f
81.704 18.44 m
69.3723 18.44 l
69.3723 13.53 l
81.085 13.53 l
83.986 13.53 85.686 12.331 85.686 9.278 c
85.686 6.456 84.37 4.987 81.279 4.987 c
69.3723 4.987 l
69.3723 0 l
82.4 0 l
86.96 0 89.822 2.899 89.822 9.007 c
89.822 15.617 86.188 18.44 81.704 18.44 c
89.474 43.435 m
69.3723 43.435 l
69.3723 38.603 l
77.8381 38.642 l
79.926 38.642 81.588 38.681 82.786 38.758 c
82.786 38.719 l
81.433 38.101 80.1575 37.405 78.9582 36.632 c
69.3723 30.795 l
69.3723 24.107 l
89.474 24.107 l
89.474 28.901 l
79.5383 28.901 l
77.9543 28.901 76.9485 28.862 75.9836 28.785 c
75.9836 28.823 l
77.1037 29.326 78.5344 30.023 79.6555 30.718 c
89.474 36.748 l
89.474 43.435 l
p
89.481 55 m
69.3957 55 l
69.3869 49.827 l
89.484 49.827 l
p
f
gsave
0 1 .8 .2 k
119.412 49.827 20.124 5.175 rectfill
grestore
gsave
43.389 48.828 m
65.493 48.828 l
65.493 56.001 l
43.389 56.001 l
43.389 48.828 l
clp
64.485 49.827 m
44.388 49.827 l
44.388 55.002 l
47.988 55.002 l
47.9988 54.996 48.0091 54.99 48.0199 54.984 c
52.1452 54.984 l
52.1388 54.99 52.1324 54.996 52.126 55.002 c
52.7607 55.002 l
52.7655 54.996 52.7704 54.99 52.7752 54.984 c
53.6871 54.984 l
53.685 54.99 53.6828 54.996 53.6808 55.002 c
64.485 55.002 l
64.485 49.827 l
0 1 .8 .2 k
f
52.1452 54.984 m
48.0199 54.984 l
48.0091 54.99 47.9988 54.996 47.988 55.002 c
52.126 55.002 l
52.1324 54.996 52.1388 54.99 52.1452 54.984 c
0.698039 1 .8 .2 k
f
53.6871 54.984 m
52.7752 54.984 l
52.7704 54.99 52.7655 54.996 52.7607 55.002 c
53.6808 55.002 l
53.6828 54.996 53.685 54.99 53.6871 54.984 c
f
grestore
grestore
grestore
grestore
grestore
end
restore
showpage
%%EOF
