%!PS-Adobe-3.0 EPSF-3.0 
%%BoundingBox: 0 0 794 595
%%Pages: 0
%%Creator: LibreOffice 4.2
%%Title: none
%%CreationDate: none
%%LanguageLevel: 2
%%EndComments
%%BeginProlog
%%BeginResource: procset SDRes-Prolog 1.0 0
/b4_inc_state save def
/dict_count countdictstack def
/op_count count 1 sub def
userdict begin
0 setgray 0 setlinecap 1 setlinewidth 0 setlinejoin 10 setmiterlimit[] 0 setdash newpath
/languagelevel where {pop languagelevel 1 ne {false setstrokeadjust false setoverprint} if} if
/bdef {bind def} bind def
/c {setrgbcolor} bdef
/l {neg lineto} bdef
/rl {neg rlineto} bdef
/lc {setlinecap} bdef
/lj {setlinejoin} bdef
/lw {setlinewidth} bdef
/ml {setmiterlimit} bdef
/ld {setdash} bdef
/m {neg moveto} bdef
/ct {6 2 roll neg 6 2 roll neg 6 2 roll neg curveto} bdef
/r {rotate} bdef
/t {neg translate} bdef
/s {scale} bdef
/sw {show} bdef
/gs {gsave} bdef
/gr {grestore} bdef
/f {findfont dup length dict begin
{1 index /FID ne {def} {pop pop} ifelse} forall /Encoding ISOLatin1Encoding def
currentdict end /NFont exch definefont pop /NFont findfont} bdef
/p {closepath} bdef
/sf {scalefont setfont} bdef
/ef {eofill}bdef
/pc {closepath stroke}bdef
/ps {stroke}bdef
/pum {matrix currentmatrix}bdef
/pom {setmatrix}bdef
/bs {/aString exch def /nXOfs exch def /nWidth exch def currentpoint nXOfs 0 rmoveto pum nWidth aString stringwidth pop div 1 scale aString show pom moveto} bdef
%%EndResource
%%EndProlog
%%BeginSetup
%%EndSetup
%%Page: 1 1
%%BeginPageSetup
%%EndPageSetup
pum
0.02835 0.02833 s 
0 -21000 t
/tm matrix currentmatrix def
gs
0 0 m 27999 0 l 27999 20999 l 0 20999 l 0 0 l eoclip newpath
gs
0 0 m 27999 0 l 27999 20999 l 0 20999 l 0 0 l eoclip newpath
pum
1400 19571 t
pom
pum
13952 19571 t
pom
1270 lw 1 lj 0.003 0.003 0.003 c 5102 17790 m  21580 17790 l  ps
5318 18450 m  5302 3758 l  ps
pum
4652 5916 t
0.003 0.402 0.003 c 3733 -2597 m  3733 0 l  2412 0 l  2412 -2597 l  157 -6331 l 
1545 -6331 l  3064 -3653 l  4600 -6331 l  5988 -6331 l  3733 -2597 l  p ef
pom
pum
20694 20902 t
0.800 0.003 0.003 c 4850 0 m  3196 -2622 l  1542 0 l  84 0 l  2364 -3463 l 
276 -6585 l  1734 -6585 l  3196 -4257 l  4659 -6585 l  6107 -6585 l  4107 -3463 l 
6299 0 l  4850 0 l  p ef
pom
pum
2282 21159 t
0.003 0.003 0.800 c 5016 0 m  257 0 l  257 -879 l  3463 -4957 l  577 -4957 l 
577 -5929 l  4843 -5929 l  4843 -5066 l  1637 -972 l  5016 -972 l  5016 0 l 
p ef
pom
gr
gs
0 0 m 27999 0 l 27999 20999 l 0 20999 l 0 0 l eoclip newpath
gr
gr
0 21000 t 
pom
count op_count sub {pop} repeat countdictstack dict_count sub {end} repeat b4_inc_state restore
%%PageTrailer
%%Trailer
%%EOF
