%!PS-Adobe-3.0 EPSF-3.0
%%BoundingBox: 0 0 109 127
%%HiResBoundingBox: 0 0 108.1804 126.54
%%Title: ufcd-logo-e1-right-a5-color
%%CreationDate: 2009-12-08T12:58+0100
%%Creator: Project ufcd
%%LanguageLevel: 2
%%DocumentData: Clean7Bit
%%Pages: 1
%%EndComments
%%Page: 1 1
save
0 0 108.1804 126.54 rectclip
9 dict begin
/k{setcmykcolor}bind def
/p{closepath}bind def
/c{curveto}bind def
/f{fill}bind def
/l{lineto}bind def
/m{moveto}bind def
/s{setoverprint}bind def
/np{newpath}bind def
/clp{clip np}bind def
gsave
np
gsave
-21.6536 138.726 m
-21.6536 -17.19 l
134.2524 -17.19 l
134.2524 138.726 l
p
clp
gsave
-21.6536 138.7167 m
-21.6536 -17.19 l
134.2524 -17.19 l
134.2524 138.7167 l
p
clp
grestore
gsave
57.7175 138.726 m
57.7175 42.3354 l
134.2524 42.3354 l
134.2524 138.726 l
57.7175 138.726 l
clp
17.2126 109.186 m
13.1555 104.8017 9.5036 99.5585 7.0769 93.3935 c
6.4797 91.8754 6.1037 90.1459 5.5446 88.4433 c
5.0031 86.7919 4.507 84.9653 4.2487 83.2577 c
1.091 62.3774 8.9157 46.3471 20.1584 35.997 c
28.7829 28.06 41.4924 21.193 57.8718 22.091 c
74.3249 22.994 84.8014 29.683 93.4634 38.472 c
95.6394 40.6811 97.6144 43.0815 99.2394 45.6615 c
104.3134 53.7201 107.9344 63.6181 107.3714 76.4218 c
107.0244 84.3207 105.0024 90.8539 102.0674 97.0468 c
100.6454 100.0468 99.1604 102.7568 97.2354 105.1781 c
95.3194 107.5907 93.4284 110.0781 91.1084 112.1318 c
82.0944 120.1 69.78 126.8896 52.8039 125.8027 c
36.2004 124.7402 25.5344 118.1791 17.2126 109.186 c
17.2126 109.186 l
p
53.3938 126.5097 m
69.8249 127.2255 82.9654 120.7079 91.5784 112.3671 c
100.3854 103.8393 107.1294 92.3241 108.0784 76.4218 c
108.5844 67.9238 106.7764 60.455 104.1884 54.1479 c
101.5944 47.8197 98.1724 42.3647 93.9344 38.001 c
85.1494 28.953 74.112 22.156 57.7546 21.501 c
41.5276 20.853 28.3928 27.167 19.5695 35.644 c
15.0197 40.0151 11.4387 44.8686 8.3733 50.849 c
5.3928 56.6615 3.2165 63.6205 2.9524 71.7079 c
2.4011 88.5605 8.6779 100.9941 16.9768 110.0107 c
23.1975 116.7699 31.3386 121.7699 41.7263 124.8603 c
45.3366 125.9345 49.2453 126.329 53.3938 126.5097 c
53.3938 126.5097 l
p
false s
0.7 .45 0 0 k
f
72.1316 122.2675 m
61.7019 121.6967 50.8152 122.372 39.487 122.3857 c
49.0022 125.9565 62.7351 125.7157 72.1316 122.2675 c
72.1316 122.2675 l
p
f
41.844 121.914 m
50.8093 121.4028 62.3132 121.974 70.1296 121.4423 c
69.6511 120.5785 68.3444 120.9711 67.5359 120.9711 c
58.4538 120.9711 51.9548 120.705 43.258 121.0888 c
42.7434 121.1113 41.5739 120.9472 41.3723 121.6781 c
41.5471 121.7392 41.6696 121.853 41.844 121.914 c
41.844 121.914 l
p
f
72.6042 121.5605 m
75.321 121.4731 77.6335 120.1606 79.7934 119.0854 c
82.3834 117.7944 84.8154 115.8886 87.1004 114.1352 c
97.6394 106.0473 105.6174 93.497 106.6624 76.6576 c
107.4794 63.5248 102.9424 52.5248 97.2354 44.4838 c
94.2274 40.2455 91.1904 36.955 87.2174 33.759 c
85.9634 32.749 84.4034 31.97 82.9754 31.048 c
79.7744 28.98 76.5866 27.218 72.6042 25.746 c
68.7448 24.318 64.7937 23.462 60.112 23.035 c
61.0495 23.777 62.3718 23.671 63.528 23.861 c
67.0124 24.423 70.4167 25.497 73.4284 26.57 c
73.2038 27.288 73.0691 28.095 72.7214 28.691 c
72.114 28.812 71.6941 28.302 71.3073 28.574 c
71.0866 29.542 72.0046 29.369 72.1316 29.988 c
71.489 31.82 71.4089 34.212 69.7761 35.056 c
69.7605 35.542 69.9792 35.792 69.8933 36.351 c
70.3991 36.072 71.0163 35.904 71.778 35.88 c
72.1823 33.22 73.1062 31.08 74.2546 29.162 c
74.0476 28.386 73.5671 27.884 73.6648 26.806 c
78.7214 28.507 83.3714 31.331 87.4534 34.583 c
92.0654 38.259 96.5694 43.2612 99.7094 48.726 c
103.5764 55.4526 106.7504 65.5976 106.3094 75.5976 c
105.6494 90.6064 98.9714 102.9604 90.1644 110.8354 c
89.8264 110.8197 90.2664 110.0263 89.9284 110.0107 c
89.5354 110.1293 88.6474 109.7499 88.6314 110.2455 c
88.3854 111.4008 89.4384 110.5356 89.8094 111.0712 c
85.0284 115.5209 79.7804 119.5033 72.6042 121.5605 c
72.6042 121.5605 l
p
f
70.364 113.4281 m
69.7741 112.7865 70.5652 111.9418 71.1902 111.7787 c
71.4011 112.037 71.6491 112.2616 71.778 112.603 c
71.3347 112.9057 71.028 113.3456 70.364 113.4281 c
70.364 113.4281 l
p
76.0222 112.0141 m
76.4402 113.4516 75.1862 116.0009 74.1355 114.8427 c
74.8737 114.5116 75.4734 113.1562 74.7253 112.3671 c
74.0339 112.6982 73.9694 113.6547 73.0749 113.7817 c
73.0808 113.579 72.9851 113.4799 72.8405 113.4281 c
73.3855 112.6786 73.8581 111.8534 74.489 111.1889 c
75.071 111.3935 75.6277 111.621 76.0222 112.0141 c
76.0222 112.0141 l
p
72.8405 120.0282 m
72.9968 118.7275 75.5886 116.1493 76.3757 117.6713 c
75.7976 118.9843 74.612 120.3017 72.8405 120.0282 c
72.8405 120.0282 l
p
78.1433 118.3783 m
77.4187 117.8842 76.5886 117.4975 76.1394 116.728 c
76.4948 115.9047 77.0769 115.3095 77.4362 114.4887 c
77.8386 111.3759 75.1784 111.3246 73.4284 110.3642 c
72.8132 110.6913 72.7624 111.582 72.2507 112.0141 c
71.8191 112.3285 71.7722 111.4472 71.4245 111.3066 c
70.4597 111.726 69.4792 112.5937 70.0105 114.1352 c
70.903 114.5614 71.8894 114.1728 72.487 113.664 c
72.6413 113.7055 72.6706 113.871 72.8405 113.8993 c
72.2741 115.2626 69.9792 116.0966 71.073 118.0243 c
71.8894 117.0346 72.7507 116.0883 73.7819 115.3139 c
74.8425 116.7143 70.3601 117.6611 72.1316 120.1459 c
74.6257 121.4921 76.5398 119.3569 78.1433 118.3783 c
78.1433 118.3783 l
p
f
56.2224 120.4999 m
56.0652 118.6918 59.2312 119.4018 59.405 117.5531 c
59.1843 117.2187 58.4831 116.8842 57.989 117.2001 c
58.0495 117.8305 58.6023 117.5131 58.9323 117.6713 c
57.6023 118.6073 54.2395 118.6298 52.9226 117.6713 c
52.8381 117.351 53.4777 117.7553 53.3938 117.4355 c
53.2951 116.8549 52.6501 117.4789 52.3327 117.4355 c
52.5793 118.8779 54.1462 119.0009 55.3967 119.4389 c
55.4289 119.8627 55.1794 120.0072 55.1613 120.3813 c
55.3571 120.5785 55.8532 120.475 56.2224 120.4999 c
56.2224 120.4999 l
p
f
grestore
60.8171 120.4999 m
61.3542 118.1615 61.3835 114.08 61.0554 111.6601 c
60.2663 112.394 60.6179 113.7822 60.5827 114.8427 c
60.5261 116.5209 60.4128 118.3578 60.4655 120.1459 c
60.4323 120.3364 60.5769 120.3486 60.5827 120.4999 c
60.8171 120.4999 l
60.8171 120.4999 l
p
false s
0.7 .45 0 0 k
f
59.8757 120.3813 m
60.0944 117.9018 60.5769 114.0258 59.9929 111.8959 c
59.9734 114.9086 59.9323 117.5282 59.8757 120.3813 c
59.8757 120.3813 l
p
f
61.5261 120.3813 m
62.0241 118.4623 61.6394 114.8046 61.7605 112.1318 c
61.3015 114.2201 61.6237 117.5961 61.5261 120.3813 c
61.5261 120.3813 l
p
f
68.2429 120.3813 m
68.362 120.3813 68.4792 120.3813 68.5964 120.3813 c
68.8054 117.7128 68.989 114.7197 68.7155 111.7787 c
67.8484 112.2358 68.2956 114.0004 68.2429 115.1957 c
68.1726 116.7953 68.0495 118.538 68.1257 120.0282 c
68.0925 120.2182 68.237 120.2314 68.2429 120.3813 c
68.2429 120.3813 l
p
f
67.5359 120.2641 m
67.8855 118.2709 67.8933 114.5844 67.7722 111.8959 c
67.2312 114.2236 67.6862 117.5458 67.5359 120.2641 c
67.5359 120.2641 l
p
f
69.1862 120.1459 m
69.4519 117.8935 69.4655 114.0561 69.4206 111.8959 c
69.0378 114.3783 69.2605 116.9745 69.1862 120.1459 c
69.1862 120.1459 l
p
f
gsave
57.7175 138.726 m
57.7175 42.3354 l
134.2524 42.3354 l
134.2524 138.726 l
57.7175 138.726 l
clp
81.2074 117.2001 m
81.2074 116.9638 81.2074 116.728 81.2074 116.4921 c
80.8214 116.3295 80.3854 116.2148 79.7934 116.2568 c
79.7954 116.5346 79.5884 116.6039 79.6744 116.9638 c
80.2334 116.995 80.5824 117.2338 81.2074 117.2001 c
81.2074 117.2001 l
p
f
58.8152 115.3139 m
58.6823 114.6996 57.8464 114.7895 57.8718 114.0175 c
58.2331 113.664 58.3464 114.559 58.8152 114.4887 c
59.5066 114.1205 59.5202 112.7099 59.2859 111.7787 c
58.9304 111.6479 58.0925 111.5551 57.7546 111.7787 c
57.8152 112.3456 58.1609 112.6293 58.4616 112.957 c
57.9675 113.5551 57.5827 112.2514 57.4011 111.7787 c
56.239 111.6645 56.5769 113.5453 57.7546 113.5463 c
57.1848 113.8759 56.4831 113.3271 56.3396 112.8388 c
55.8488 112.8979 55.7317 113.3305 55.633 113.7817 c
57.1369 113.7363 57.3059 116.1332 58.8152 115.3139 c
58.8152 115.3139 l
p
f
grestore
80.2644 115.3139 m
81.6604 112.058 77.5163 111.6532 78.0241 108.5966 c
77.4675 108.6445 77.2136 108.3862 76.6101 108.4784 c
76.7351 109.3105 76.3718 109.6537 76.2566 110.2455 c
77.6726 111.0883 79.4244 112.7885 78.8504 114.8427 c
79.0824 115.2377 79.6644 115.2851 80.2644 115.3139 c
80.2644 115.3139 l
p
f
67.0652 115.0785 m
66.903 113.9047 65.3366 114.1352 65.2976 112.8388 c
64.5202 112.5551 64.0319 111.9814 63.2937 111.6601 c
63.1394 112.3256 63.7605 112.2148 63.7644 112.7211 c
63.5105 113.5663 62.4675 113.6244 62.2331 114.4887 c
63.1316 115.0541 63.7136 113.5253 64.1179 112.8388 c
65.5456 113.0683 65.0905 115.7861 67.0652 115.0785 c
67.0652 115.0785 l
p
f
66.8288 114.0175 m
67.405 113.2699 66.0573 112.5492 66.0046 111.6601 c
65.4304 111.7148 64.6237 111.537 64.2351 111.7787 c
64.3093 112.2543 64.864 112.2499 65.2976 112.3671 c
65.6667 113.0585 65.9734 113.8119 66.8288 114.0175 c
66.8288 114.0175 l
p
f
62.3503 113.4281 m
63.5359 113.434 63.4362 111.9423 62.5847 111.6601 c
62.1003 111.8002 62.155 112.9872 62.3503 113.4281 c
62.3503 113.4281 l
p
f
67.0652 112.603 m
66.8855 112.2641 67.0691 112.2348 66.948 111.7787 c
66.7898 111.7787 66.6335 111.7787 66.4753 111.7787 c
66.4968 112.2275 66.6433 112.5541 67.0652 112.603 c
67.0652 112.603 l
p
f
gsave
57.7175 138.726 m
57.7175 42.3354 l
134.2524 42.3354 l
134.2524 138.726 l
57.7175 138.726 l
clp
79.4404 107.1821 m
79.0284 104.6254 82.7724 104.4623 81.9144 107.1821 c
81.4714 107.5741 79.8954 107.5136 79.4404 107.1821 c
79.4404 107.1821 l
p
81.2074 107.7714 m
83.2194 107.8281 84.5984 110.2626 83.4464 112.0141 c
82.6334 110.7626 80.3644 109.9159 81.2074 107.7714 c
81.2074 107.7714 l
p
81.6784 112.603 m
82.6864 112.3256 83.9094 112.579 84.9774 112.603 c
85.3094 111.3241 85.3254 109.7284 85.9204 108.7143 c
85.6724 108.3227 85.5784 109.0673 85.2134 108.9496 c
84.7724 108.5278 84.2724 108.1635 84.3894 107.1821 c
84.0574 107.6259 83.6724 107.246 83.3284 107.0644 c
83.1964 106.5292 83.2254 105.831 83.0924 105.2968 c
82.1084 104.3901 80.2004 104.5947 79.2034 105.2968 c
78.3504 105.8979 78.4104 107.141 77.5534 107.4179 c
77.989 107.6904 78.9264 107.4584 79.5574 107.5356 c
79.6294 108.3144 79.3504 108.7436 79.4404 109.5395 c
80.2014 110.5444 81.3074 111.2055 81.6784 112.603 c
81.6784 112.603 l
p
f
70.2468 111.0712 m
70.1511 109.9994 68.5964 110.3642 67.653 110.3642 c
64.4362 110.3642 60.1491 110.269 57.1652 110.4814 c
57.2365 110.7636 57.0173 111.3368 57.2824 111.4247 c
61.8855 111.2763 65.78 111.5688 70.2468 111.0712 c
70.2468 111.0712 l
p
f
71.4245 109.8925 m
70.9948 109.5654 69.6179 109.7157 69.1862 109.7743 c
69.9206 110.0585 70.6921 110.0019 71.4245 109.8925 c
71.4245 109.8925 l
p
f
72.7214 108.9496 m
72.446 108.29 71.489 108.5995 70.9538 108.5966 c
66.5652 108.5727 61.0027 108.5932 57.2824 108.9496 c
57.302 109.0868 57.2561 109.1596 57.1652 109.186 c
57.217 109.2905 57.2678 109.3964 57.4011 109.4213 c
61.2898 109.3876 64.6902 109.3036 69.0671 109.3036 c
70.3152 109.3036 71.7038 109.5937 72.7214 108.9496 c
72.7214 108.9496 l
p
f
grestore
88.7484 109.3036 m
88.5764 108.6908 88.6414 107.8417 88.6314 107.0644 c
87.1534 106.0693 85.5844 105.162 85.0964 103.1752 c
84.6474 102.9345 84.1964 103.1513 83.6824 103.1752 c
83.6824 103.7636 83.6824 104.3534 83.6824 104.9428 c
85.3194 105.7699 86.9964 107.0898 86.9834 109.186 c
87.7004 109.0966 88.0494 109.3739 88.7484 109.3036 c
88.7484 109.3036 l
p
f
70.7175 108.2426 m
71.7859 108.3183 72.7937 107.102 73.6648 106.3573 c
75.321 104.9418 76.5652 103.7792 78.1433 102.4677 c
78.8934 101.8442 79.9244 101.4111 80.2644 100.4638 c
78.3191 101.3417 76.8523 102.9228 75.3152 104.2358 c
73.7644 105.5595 72.0339 106.686 70.7175 108.2426 c
70.7175 108.2426 l
p
f
64.3542 104.8251 m
66.8777 105.454 63.8425 108.7797 63.2937 105.8857 c
62.8874 105.9916 62.7819 106.3945 62.2331 106.3573 c
61.6198 106.0649 60.6706 105.4858 60.9362 104.7074 c
61.6316 105.6493 63.3191 104.5663 64.3542 104.8251 c
64.3542 104.8251 l
p
59.9929 103.6464 m
60.3503 106.2099 61.9148 108.0151 64.9421 107.5356 c
65.4792 107.0278 66.0319 106.3754 65.7683 105.414 c
65.2292 103.4531 60.9792 105.4545 59.9929 103.6464 c
59.9929 103.6464 l
p
f
91.1084 107.4179 m
91.7234 107.248 92.3874 107.1279 93.2274 107.1821 c
91.4224 105.373 89.1434 104.0385 87.5714 101.996 c
87.4894 101.5595 87.7744 101.4902 87.6904 101.0536 c
87.1624 100.873 86.6084 100.7206 85.9204 100.6996 c
86.2094 101.1855 85.6624 102.164 85.9204 102.5859 c
87.7274 104.1181 89.6254 105.5605 91.1084 107.4179 c
91.1084 107.4179 l
p
f
65.2976 102.1142 m
64.4792 99.1415 69.2116 100.8271 66.8288 102.35 c
67.2019 102.4081 67.2448 102.1376 67.653 102.2323 c
68.3991 102.7997 68.1511 104.6313 67.4187 105.061 c
67.7429 103.7963 65.5534 103.0444 65.2976 102.1142 c
65.2976 102.1142 l
p
67.0652 106.475 m
67.1648 106.4965 67.1765 106.4286 67.1823 106.3573 c
69.1843 105.0868 69.0671 99.0263 65.4148 100.1108 c
63.2116 102.6601 67.8933 103.4814 67.0652 106.475 c
67.0652 106.475 l
p
f
95.5864 104.2358 m
93.9484 102.2211 91.0574 101.457 89.4574 99.4032 c
89.4574 99.0497 89.4574 98.6962 89.4574 98.3427 c
89.0064 98.4423 88.5104 98.497 87.9244 98.4609 c
87.6434 99.0112 88.0324 99.5043 87.9244 100.2284 c
89.7824 101.7109 92.0374 102.7948 93.5824 104.5893 c
94.1234 104.3461 94.8624 104.2988 95.5864 104.2358 c
95.5864 104.2358 l
p
f
61.4069 101.1713 m
61.8269 100.9985 62.114 101.5502 62.2331 101.289 c
62.2273 100.9018 62.0339 100.7021 62.1159 100.2284 c
62.528 99.8559 62.9909 99.5331 63.7644 99.5214 c
63.155 100.4838 63.3054 102.206 62.4694 102.9394 c
60.905 103.3925 60.5612 101.7948 61.4069 101.1713 c
61.4069 101.1713 l
p
64.7077 99.1679 m
62.4636 98.7934 59.9089 100.4189 60.4655 102.4677 c
60.8073 103.7314 63.1999 103.6933 63.528 102.35 c
63.8347 101.1044 63.6394 99.8447 64.7077 99.1679 c
64.7077 99.1679 l
p
f
85.4504 97.6357 m
82.8934 97.6249 80.7074 97.3437 78.2605 97.6357 c
78.1589 98.0346 79.2174 98.8808 79.7934 99.4032 c
80.4634 100.0131 81.2584 100.5287 81.6784 101.1713 c
83.2114 100.269 84.2294 98.85 85.4504 97.6357 c
85.4504 97.6357 l
p
f
gsave
57.7175 138.726 m
57.7175 42.3354 l
134.2524 42.3354 l
134.2524 138.726 l
57.7175 138.726 l
clp
95.7034 101.0536 m
95.6784 100.2914 95.2274 99.9579 95.3484 99.0497 c
94.7844 98.2177 91.0204 97.5654 91.3424 96.1034 c
91.6784 94.58 95.8264 96.8461 96.1744 97.9892 c
96.8484 98.0741 97.2274 97.8637 97.8254 97.8715 c
97.6884 97.2636 97.2994 96.9042 97.2354 96.2216 c
95.4344 95.4682 93.2504 95.099 92.5224 93.2753 c
91.9924 93.2172 91.6374 93.3349 91.2254 93.3935 c
91.1864 94.0995 91.5984 94.3559 91.5784 95.0424 c
91.3344 95.5844 90.2914 95.3281 89.8094 95.6322 c
89.7824 96.4076 90.1314 96.8051 90.0454 97.6357 c
91.3214 98.7973 93.8384 98.7153 93.9344 101.0536 c
94.7154 101.1259 94.8894 101.0844 95.7034 101.0536 c
95.7034 101.0536 l
p
f
55.7507 100.1108 m
57.4069 98.2709 60.1452 97.5131 61.9968 95.8676 c
62.0495 95.4887 62.2234 95.2294 62.2331 94.8075 c
64.0671 96.0121 67.6472 94.6054 67.2995 92.2148 c
66.7292 94.4389 63.5124 95.849 61.8796 93.7465 c
62.6687 97.5995 56.5402 97.0922 55.7507 100.1108 c
55.7507 100.1108 l
p
f
grestore
86.1574 97.0468 m
84.1064 96.6601 80.3174 96.6552 78.1433 97.0468 c
81.2524 96.912 83.2414 97.3505 86.1574 97.0468 c
86.1574 97.0468 l
p
f
79.4404 95.7509 m
79.5414 93.956 79.2644 92.4555 79.6744 90.9179 c
80.2134 90.9692 80.9734 90.7988 81.3254 91.0361 c
81.2504 92.6117 81.4754 94.4872 81.2074 95.8676 c
80.7194 96.1454 79.9104 95.8671 79.4404 95.7509 c
79.4404 95.7509 l
p
81.6784 96.457 m
81.7854 94.4291 81.7894 93.0229 81.7954 90.5649 c
81.0124 90.5629 80.3074 90.4975 79.3214 90.4467 c
78.9674 92.3403 79.0124 94.7206 79.0864 96.457 c
79.9504 96.457 80.8154 96.457 81.6784 96.457 c
81.6784 96.457 l
p
f
83.0924 95.7509 m
83.1824 94.1513 82.8504 92.1303 83.4464 91.0361 c
83.6664 92.2489 83.1964 94.391 83.5654 95.7509 c
83.5474 93.9164 83.7414 92.8891 83.6824 90.9179 c
84.1534 90.9179 84.6234 90.9179 85.0964 90.9179 c
85.3014 92.4052 85.0924 94.4321 84.9774 95.9858 c
84.4384 96.246 83.5324 95.9731 83.0924 95.7509 c
83.0924 95.7509 l
p
85.3324 96.3393 m
85.5804 94.4628 85.3814 92.3593 85.5674 90.6825 c
84.7094 90.4618 83.5124 90.5605 82.7394 90.5649 c
82.8364 92.7944 82.5694 94.7675 82.7394 96.457 c
83.5764 96.391 84.6864 96.5966 85.3324 96.3393 c
85.3324 96.3393 l
p
f
78.4964 96.3393 m
78.9674 94.6176 78.6724 92.309 78.8504 90.5649 c
78.1687 91.6156 78.6474 94.1933 78.4964 96.3393 c
78.4964 96.3393 l
p
f
82.1514 96.3393 m
82.6174 94.9213 82.3874 92.1786 82.2684 90.5649 c
81.7974 91.9853 82.0344 94.7226 82.1514 96.3393 c
82.1514 96.3393 l
p
f
86.0394 90.6825 m
85.5104 92.04 85.9464 94.3593 85.8034 96.1034 c
f
gsave
57.7175 138.726 m
57.7175 42.3354 l
134.2524 42.3354 l
134.2524 138.726 l
57.7175 138.726 l
clp
99.3564 94.8075 m
99.1274 94.2499 98.6574 93.9355 98.5324 93.2753 c
98.8054 92.5668 99.8264 92.6069 100.5354 92.3324 c
100.3664 91.599 99.7784 91.2822 99.5924 90.5649 c
99.8934 89.9223 100.8284 89.9155 101.3604 89.5038 c
101.4894 88.8378 100.7154 88.1244 100.4164 87.5004 c
98.5574 87.1996 96.5414 87.0551 95.9384 85.4965 c
95.4674 85.6928 95.0124 85.9072 94.4074 85.9687 c
94.8304 88.5702 98.8504 87.5737 99.8284 89.6215 c
98.2374 90.7416 95.5324 89.3173 94.5244 88.3251 c
93.9634 88.3134 93.6434 88.5453 93.2274 88.6791 c
93.5944 91.3769 97.9054 90.1303 98.8854 92.2148 c
98.2704 93.3197 97.5454 92.6396 96.2914 92.2148 c
95.0434 91.7914 93.9444 91.9067 93.4634 90.9179 c
92.9144 90.8403 92.7074 91.1039 92.2854 91.1537 c
92.4464 91.7411 92.6164 92.3163 92.8734 92.8036 c
94.5324 93.0986 96.9204 93.6098 97.7074 95.1611 c
98.4094 95.1947 98.8734 94.9931 99.3564 94.8075 c
99.3564 94.8075 l
p
f
62.4694 89.6215 m
61.8659 89.0844 60.7155 89.0956 59.7585 88.915 c
59.1062 90.4242 58.3894 91.8676 56.5754 92.2148 c
56.4953 93.3554 56.927 93.9843 57.2824 94.6894 c
60.2585 94.2465 61.6003 92.1713 62.4694 89.6215 c
62.4694 89.6215 l
p
f
79.7934 94.6894 m
80.0674 94.0204 79.8324 92.8442 79.9104 91.9789 c
79.9594 91.5541 79.6964 91.8178 79.7934 92.0971 c
79.7934 92.3324 79.7934 92.5683 79.7934 92.8036 c
79.7994 93.8222 79.6534 93.9159 79.7934 94.6894 c
79.7934 94.6894 l
p
f
58.4616 88.915 m
58.0515 89.0546 57.6745 89.228 57.2824 89.3862 c
57.5124 88.829 58.28 88.8114 58.9323 88.6791 c
58.9362 89.0746 58.7702 89.3027 58.5788 89.5038 c
58.5144 89.3324 58.7175 88.8949 58.4616 88.915 c
58.4616 88.915 l
p
56.3396 90.329 m
55.6027 90.3979 56.1486 89.1845 55.3967 89.2685 c
55.3772 89.0126 55.8147 89.2148 55.9865 89.1503 c
55.6584 88.6747 54.717 88.9711 54.6902 89.5038 c
53.8122 88.6137 52.2014 88.457 51.3899 87.5004 c
51.5686 87.33 51.988 87.9184 52.2146 88.0898 c
52.4275 87.5209 51.4338 87.1449 51.508 86.3217 c
51.0842 86.3696 51.3244 87.081 50.9182 87.1469 c
50.9856 87.9838 51.5476 88.3246 52.0974 88.6791 c
51.6906 93.3246 59.7878 92.6821 59.1687 88.6791 c
59.7331 88.1825 60.446 87.8344 60.3464 86.6757 c
59.9792 86.6215 59.9714 86.9272 59.9929 87.2646 c
59.3816 88.2631 57.8366 88.3295 56.9294 89.0326 c
56.9035 89.6235 56.8864 90.0414 56.3396 90.329 c
56.3396 90.329 l
p
f
grestore
66.3581 91.7431 m
67.2351 91.5605 68.8757 92.1396 69.1862 91.3896 c
68.7312 90.9228 67.0085 91.1562 66.3581 91.2719 c
66.3581 91.4286 66.3581 91.5864 66.3581 91.7431 c
66.3581 91.7431 l
p
f
69.1862 90.4467 m
68.1159 90.5053 67.7292 90.1967 67.0652 90.5649 c
67.2155 91.1371 69.0027 90.9433 69.1862 90.4467 c
69.1862 90.4467 l
p
f
87.2174 89.9755 m
84.3384 89.4321 80.4184 89.8915 77.0827 89.7397 c
77.0827 89.8573 77.0827 89.9755 77.0827 90.0937 c
77.1784 90.1152 77.1999 90.2114 77.3171 90.2109 c
80.4514 90.0566 84.2954 90.5204 87.2174 89.9755 c
87.2174 89.9755 l
p
f
78.6144 87.8539 m
78.2116 87.8046 77.9421 87.8896 78.0241 88.3251 c
78.4054 88.517 78.7094 88.4272 78.6144 87.8539 c
78.6144 87.8539 l
p
f
79.0864 88.4433 m
79.2584 88.3403 79.4594 88.267 79.4404 87.9721 c
79.3344 87.8803 79.1724 87.8447 78.9674 87.8539 c
78.9304 88.1269 78.9874 88.3066 79.0864 88.4433 c
79.0864 88.4433 l
p
f
80.3814 88.4433 m
80.6644 88.1098 81.0944 88.6054 81.3254 88.3251 c
81.3254 88.1684 81.3254 88.0107 81.3254 87.8539 c
80.9324 87.8539 80.5394 87.8539 80.1474 87.8539 c
80.1274 88.1469 80.3304 88.2192 80.3814 88.4433 c
80.3814 88.4433 l
p
f
84.9774 88.4433 m
85.3854 88.5258 85.4014 88.0297 85.2134 87.8539 c
84.8054 87.7714 84.7914 88.2675 84.9774 88.4433 c
84.9774 88.4433 l
p
f
86.8644 87.9721 m
86.5554 87.9389 86.3584 88.0146 86.3914 88.3251 c
86.5554 88.4999 86.9534 88.3866 86.8644 87.9721 c
86.8644 87.9721 l
p
f
77.4362 88.3251 m
77.7468 88.3608 77.739 88.079 77.7898 87.8539 c
77.3952 87.7353 77.403 88.018 77.4362 88.3251 c
77.4362 88.3251 l
p
f
82.6214 88.3251 m
82.7854 87.6332 81.8384 87.8173 81.6784 88.0898 c
81.7054 88.4565 82.2644 88.2885 82.6214 88.3251 c
82.6214 88.3251 l
p
f
83.9184 88.2079 m
83.9074 87.8735 83.1064 87.7255 83.0924 88.0898 c
82.9484 88.4819 83.8894 88.3779 83.9184 88.2079 c
83.9184 88.2079 l
p
f
85.5674 88.3251 m
85.7644 88.3251 85.9594 88.3251 86.1574 88.3251 c
86.1574 88.1684 86.1574 88.0107 86.1574 87.8539 c
85.7544 87.8046 85.4854 87.8896 85.5674 88.3251 c
85.5674 88.3251 l
p
f
58.9323 87.7363 m
60.153 87.6987 59.9792 85.4277 58.698 85.6147 c
58.7292 85.8212 58.3659 86.2031 58.698 86.3217 c
58.948 86.3769 58.9206 86.1537 58.9323 85.9687 c
59.7527 86.2426 59.3054 87.3403 58.9323 87.7363 c
58.9323 87.7363 l
p
f
79.4404 87.5004 m
79.4964 87.1288 78.8994 87.412 78.8504 87.1469 c
78.8854 86.7494 79.3714 86.8051 79.4404 86.4394 c
79.4554 85.913 78.8714 85.9867 78.4964 85.8505 c
78.4244 85.5307 78.6474 84.9155 78.3774 84.7895 c
78.2155 85.4296 77.989 86.0453 77.3171 86.4394 c
77.2351 86.8759 77.7312 86.7333 77.9069 86.9111 c
77.8054 87.0834 77.7312 87.2841 77.4362 87.2646 c
77.989 87.6464 78.6864 87.7031 79.4404 87.5004 c
79.4404 87.5004 l
p
f
59.0495 87.3827 m
58.9382 86.9262 59.5105 86.8974 59.1687 86.5575 c
58.8933 86.7138 58.8308 87.0839 58.698 87.3827 c
58.8152 87.3827 58.9323 87.3827 59.0495 87.3827 c
59.0495 87.3827 l
p
f
100.0634 86.5575 m
101.0494 86.8007 101.3264 85.9614 101.0064 85.2612 c
100.7334 85.2612 100.4554 85.2612 100.1804 85.2612 c
99.8094 85.6601 99.8564 86.0307 100.0634 86.5575 c
100.0634 86.5575 l
p
f
98.2954 84.9081 m
98.1594 84.8886 98.1964 84.6928 98.1784 84.5541 c
97.6964 84.2973 97.2334 84.2782 96.8814 84.6718 c
96.5104 85.9047 98.3834 85.8866 98.2954 84.9081 c
98.2954 84.9081 l
p
f
80.8524 84.5541 m
81.0044 84.8481 81.5144 84.5195 81.5594 84.3183 c
81.5144 83.7367 81.0374 83.5834 80.9714 83.0219 c
80.3774 82.9394 80.1964 83.2665 80.2644 83.8471 c
80.6684 83.7953 80.9244 83.893 81.2074 83.9648 c
81.2624 84.3349 81.0594 84.4462 80.8524 84.5541 c
80.8524 84.5541 l
p
f
gsave
57.7175 138.726 m
57.7175 42.3354 l
134.2524 42.3354 l
134.2524 138.726 l
57.7175 138.726 l
clp
82.8584 84.6718 m
83.1494 84.6874 83.4244 84.6894 83.5654 84.5541 c
83.3994 84.3661 83.1594 84.2529 82.8584 84.2006 c
82.8584 84.3573 82.8584 84.5146 82.8584 84.6718 c
82.8584 84.6718 l
p
f
58.9323 84.2006 m
58.2429 83.2001 57.1101 82.644 56.5754 81.4897 c
57.2717 81.7773 57.8093 83.2421 58.9323 83.4936 c
59.2546 83.1869 59.7722 83.0751 59.9929 82.6679 c
58.6609 81.4076 57.5319 79.9433 57.1652 77.7187 c
56.0359 77.393 55.3527 78.266 55.7507 79.2499 c
56.1013 79.2568 56.4406 79.4506 57.0476 79.4867 c
57.2111 80.3573 56.4348 80.288 56.4577 81.0185 c
56.1252 80.997 56.3112 80.4584 55.8684 80.5463 c
56.0559 82.018 57.2277 84.6308 58.9323 84.2006 c
58.9323 84.2006 l
p
f
grestore
102.8914 83.7289 m
102.4344 81.1752 97.4674 83.4042 96.5284 81.1362 c
97.5784 79.7763 100.7444 80.4872 102.1844 81.2543 c
102.7254 81.1655 103.0574 80.87 103.4814 80.6645 c
103.0614 80.1816 102.5354 79.8027 102.1844 79.2499 c
100.9014 79.5405 99.2154 79.2446 97.9424 79.1332 c
97.4574 78.9101 97.4364 78.2245 96.8814 78.0717 c
96.5164 78.3364 96.1474 78.5942 95.7034 78.7792 c
96.0264 79.2812 96.5594 79.5727 96.8814 80.0751 c
96.7074 80.8847 95.7274 80.8852 95.3484 81.4897 c
95.4574 82.2065 96.1064 82.3832 96.1744 83.1396 c
97.9464 83.1762 99.3484 83.5795 101.0064 83.7289 c
101.5284 84.4316 102.3074 84.329 102.8914 83.7289 c
102.8914 83.7289 l
p
f
gsave
57.7175 138.726 m
57.7175 42.3354 l
134.2524 42.3354 l
134.2524 138.726 l
57.7175 138.726 l
clp
83.0924 83.8471 m
83.4534 83.9321 83.4404 83.6435 83.7994 83.7289 c
83.8954 83.2016 83.5904 83.0751 83.2114 83.0219 c
83.0474 83.1738 83.0944 83.5336 83.0924 83.8471 c
83.0924 83.8471 l
p
f
61.2898 76.186 m
60.8152 76.5922 60.9851 77.037 61.2898 77.4828 c
60.7312 77.4521 60.6257 76.9672 59.9929 77.0116 c
59.7995 77.6225 59.8933 78.3759 60.112 78.8974 c
59.4382 78.7441 59.9128 77.4462 59.1687 77.3647 c
58.4655 78.8237 59.4265 80.6352 59.9929 81.6073 c
58.7722 80.8642 58.9968 78.6757 57.989 77.7187 c
57.3581 78.3847 57.9382 79.6889 58.3444 80.4291 c
58.78 81.2265 59.655 81.9604 60.2292 82.3144 c
62.737 80.8549 63.2878 77.4374 63.6472 73.829 c
63.3718 73.4599 63.2058 74.1449 62.821 74.3007 c
62.0007 74.6347 60.8523 74.3705 60.112 74.4184 c
60.1706 75.2636 59.9577 75.8368 59.7585 76.4218 c
60.2155 76.7011 60.864 76.3154 61.2898 76.186 c
61.2898 76.186 l
p
f
103.8344 77.4828 m
103.4834 76.7748 102.6664 76.5297 102.3034 75.8329 c
102.6684 75.1762 103.3304 74.8168 103.9534 74.4184 c
103.5984 73.7519 102.8874 73.4408 102.4204 72.8862 c
101.2234 73.1913 98.0924 73.8012 97.4714 72.5331 c
96.9574 72.726 96.5574 73.0336 96.0554 73.2402 c
96.2464 73.7958 96.7314 74.059 97.1174 74.4184 c
98.7744 74.3691 101.6004 73.8613 102.4204 75.0077 c
101.1374 77.0824 97.0024 74.6606 95.9384 76.186 c
96.6434 78.4072 101.3914 75.768 102.3034 78.0717 c
102.9634 78.0248 103.4244 77.7787 103.8344 77.4828 c
103.8344 77.4828 l
p
f
58.3444 72.8862 m
57.8718 73.8852 58.6609 76.9062 56.9294 77.0116 c
58.3054 77.8534 60.321 76.5478 59.6394 74.183 c
59.3679 73.5903 58.7214 73.373 58.3444 72.8862 c
58.3444 72.8862 l
p
f
grestore
89.3384 72.8862 m
89.4754 72.8676 89.4384 72.6713 89.4574 72.5331 c
87.6744 70.7797 86.3674 68.5507 84.5064 66.8759 c
85.9754 69.0219 87.7424 70.8686 89.3384 72.8862 c
89.3384 72.8862 l
p
f
73.5476 72.769 m
73.7819 72.769 74.0183 72.769 74.2546 72.769 c
75.5359 72.1615 74.3581 69.4447 73.1921 70.7646 c
74.9226 70.5829 74.6179 72.4823 73.5476 72.769 c
73.5476 72.769 l
p
f
74.8425 72.6503 m
75.1335 72.9701 75.5593 72.4306 75.5495 72.0614 c
75.0808 72.0243 75.2312 72.6064 74.8425 72.6503 c
74.8425 72.6503 l
p
f
88.0434 71.8256 m
87.7524 72.0463 87.4324 72.2377 87.2174 72.5331 c
87.4054 72.9941 88.0434 72.2914 88.0434 71.8256 c
88.0434 71.8256 l
p
f
78.7334 72.1791 m
78.1452 72.6122 77.2917 72.3056 76.9655 71.8256 c
76.8503 71.0048 77.3327 70.7797 77.6726 70.4115 c
78.5264 70.5131 79.0474 71.2597 78.7334 72.1791 c
78.7334 72.1791 l
p
77.5534 72.5331 m
78.1413 72.7499 78.8754 72.644 79.0864 72.0614 c
79.3604 71.3002 78.8324 70.4252 78.3774 70.2934 c
77.1335 69.9325 75.8464 71.9032 77.5534 72.5331 c
77.5534 72.5331 l
p
f
86.6274 70.6474 m
87.5264 70.8974 87.2034 72.9447 85.9204 72.2978 c
84.8914 71.7782 85.7464 70.4023 86.6274 70.6474 c
86.6274 70.6474 l
p
87.3344 72.1791 m
87.7484 70.9296 87.0084 70.2245 86.0394 70.4115 c
84.1624 70.7729 85.6664 73.9252 87.3344 72.1791 c
87.3344 72.1791 l
p
f
79.2034 72.415 m
79.5714 72.8505 79.7054 72.06 79.9104 71.9438 c
79.6394 71.6054 79.4054 72.2939 79.2034 72.415 c
79.2034 72.415 l
p
f
82.5024 72.2978 m
85.1104 71.873 81.5514 68.725 80.9714 71.0004 c
80.7644 71.809 81.2414 72.1244 81.6784 72.5331 c
82.0204 72.1298 81.1024 72.0478 81.2074 71.2367 c
81.4514 69.3359 84.4244 71.2065 82.5024 72.2978 c
82.5024 72.2978 l
p
f
84.1534 67.936 m
85.0944 67.9101 85.6494 69.2221 84.7424 69.9404 c
82.7234 70.3114 82.8754 67.9721 84.1534 67.936 c
84.1534 67.936 l
p
83.0924 69.5864 m
82.8054 69.8266 82.5304 69.0556 82.2684 68.8793 c
82.7354 68.2065 83.4344 67.7685 83.7994 66.9936 c
83.1254 67.3808 82.6844 67.9989 82.2684 68.6435 c
81.4774 68.2939 81.1964 67.4379 80.6174 66.8759 c
80.2154 67.2074 81.0884 68.0727 81.5594 68.2905 c
82.6354 69.8085 83.8054 71.2319 85.0964 72.5331 c
84.7274 71.5644 83.8694 71.0868 83.4464 70.1762 c
85.3734 71.1679 86.2744 67.8158 84.2724 67.7006 c
83.5224 67.6576 82.5964 68.4076 83.0924 69.5864 c
83.0924 69.5864 l
p
f
80.8524 72.2978 m
79.3424 70.5463 77.9948 68.6347 76.2566 67.1117 c
77.6862 68.8656 79.2054 71.1557 80.8524 72.2978 c
80.8524 72.2978 l
p
f
83.6824 72.2978 m
83.8584 72.6508 84.2094 72.2104 84.1534 71.9438 c
83.7764 71.8403 83.9094 72.2499 83.6824 72.2978 c
83.6824 72.2978 l
p
f
105.6024 71.3544 m
105.6594 70.9843 105.2854 71.0424 105.2484 70.7646 c
104.6744 70.8578 104.5374 71.3891 104.0714 71.5903 c
104.2724 72.8027 105.2444 71.7006 105.6024 71.3544 c
105.6024 71.3544 l
p
f
103.7174 71.1186 m
102.8364 69.0741 98.9124 71.2543 97.3524 69.704 c
96.8234 69.9609 96.4204 70.3427 96.0554 70.7646 c
96.1904 71.2992 96.8214 71.3373 97.1174 71.7079 c
98.4034 71.4921 100.0374 71.2138 101.3604 71.4726 c
101.7354 71.5453 102.1004 72.0478 102.3034 72.0614 c
103.0004 72.1069 103.0554 71.2118 103.7174 71.1186 c
103.7174 71.1186 l
p
f
76.0222 71.3544 m
76.6882 70.8022 77.1882 70.0864 77.6726 69.3505 c
77.0925 69.9228 76.073 70.642 76.0222 71.3544 c
76.0222 71.3544 l
p
f
80.2644 71.2367 m
80.9754 70.7289 81.4124 69.9491 82.0324 69.3505 c
81.2844 69.351 80.7054 70.5365 80.2644 71.2367 c
80.2644 71.2367 l
p
f
84.5064 71.2367 m
85.4034 71.0326 85.4264 69.955 86.1574 69.5864 c
85.5284 69.5883 84.8934 70.601 84.5064 71.2367 c
84.5064 71.2367 l
p
f
76.0222 68.1718 m
76.9694 68.3422 77.0417 70.4111 75.5495 69.8222 c
74.3503 69.3481 75.2683 68.037 76.0222 68.1718 c
76.0222 68.1718 l
p
76.6101 70.0575 m
77.1491 69.5732 77.03 68.3178 76.4929 67.936 c
75.7741 67.8471 75.3171 68.017 74.9616 68.2905 c
74.4069 69.5131 75.3503 70.6503 76.6101 70.0575 c
76.6101 70.0575 l
p
f
80.1474 67.8188 m
81.1724 67.9081 81.2724 70.2597 79.7934 69.8222 c
78.4944 69.4384 79.2194 67.7382 80.1474 67.8188 c
80.1474 67.8188 l
p
78.9674 69.704 m
79.6744 70.4189 81.0004 70.0029 81.2074 69.3505 c
81.9244 67.0907 78.0222 67.1049 78.9674 69.704 c
78.9674 69.704 l
p
f
73.1921 69.9404 m
73.5027 69.9755 73.5788 69.7768 73.5476 69.4687 c
73.4284 69.4687 73.3112 69.4687 73.1921 69.4687 c
73.1921 69.6264 73.1921 69.7826 73.1921 69.9404 c
73.1921 69.9404 l
p
f
68.9499 69.7045 m
68.9069 69.2367 69.0573 68.5746 68.8327 68.2905 c
66.9948 68.3525 65.1843 68.1918 63.7644 68.1718 c
63.1277 70.582 67.0319 69.4579 68.9499 69.7045 c
68.9499 69.7045 l
p
f
96.5284 66.1689 m
97.9304 66.0263 100.5304 65.371 101.7134 66.1689 c
101.6844 67.7963 96.7844 68.0126 96.5284 66.1689 c
96.5284 66.1689 l
p
103.2464 68.0546 m
102.9514 67.5234 102.2974 67.3534 101.9504 66.8759 c
102.1494 66.2499 102.7624 66.04 103.1274 65.579 c
102.7684 65.0351 102.1164 64.7851 101.7134 64.2836 c
100.3464 64.6698 98.9814 64.9037 97.3524 64.7548 c
96.9034 65.6396 96.1374 66.2114 95.4674 66.8759 c
95.9734 67.5077 96.5344 68.0878 97.1174 68.6435 c
98.6704 68.6581 101.0164 67.9257 102.0674 68.8793 c
102.6744 68.8188 102.9504 68.4277 103.2464 68.0546 c
103.2464 68.0546 l
p
f
74.1355 68.7616 m
74.7741 68.3779 75.155 67.7382 75.6687 67.2289 c
75.0085 67.123 74.405 68.0868 74.1355 68.7616 c
74.1355 68.7616 l
p
f
78.1433 68.5258 m
78.7254 68.5956 79.1844 67.5263 79.6744 67.1117 c
79.0554 67.0043 78.6644 68.143 78.1433 68.5258 c
78.1433 68.5258 l
p
f
74.6081 67.1117 m
74.1609 67.2934 73.948 67.7089 73.1921 67.5834 c
73.5105 68.0966 74.7409 67.8022 74.6081 67.1117 c
74.6081 67.1117 l
p
f
87.4534 67.1117 m
86.8074 67.2441 85.9384 67.3881 85.2134 66.8759 c
85.4594 67.8842 86.9244 67.7919 87.4534 67.1117 c
87.4534 67.1117 l
p
f
63.8835 67.5834 m
64.3093 67.6943 64.0476 67.1191 64.1179 66.8759 c
64.5827 66.8051 64.0886 67.6913 64.5905 67.5834 c
64.5671 66.3105 64.7312 64.8158 64.7077 63.2221 c
64.1941 63.9672 64.5359 65.5654 64.2351 66.5219 c
64.0163 65.8935 64.5905 63.8324 64.0007 63.2221 c
64.028 64.9897 63.8484 65.8232 63.8835 67.5834 c
63.8835 67.5834 l
p
f
78.8504 67.1117 m
78.6394 66.9037 77.5769 67.6747 76.9655 66.9936 c
77.2214 67.7621 78.4364 67.6435 78.8504 67.1117 c
78.8504 67.1117 l
p
f
gsave
57.7175 138.726 m
57.7175 42.3354 l
134.2524 42.3354 l
134.2524 138.726 l
57.7175 138.726 l
clp
83.0924 66.8759 m
82.6644 67.1869 81.7214 67.6933 81.4424 66.8759 c
80.8034 67.5556 83.0614 67.9052 83.0924 66.8759 c
83.0924 66.8759 l
p
f
68.9499 62.3974 m
69.6491 60.539 66.905 61.3329 66.0046 61.3368 c
59.4753 61.3647 49.5066 61.1674 42.3156 61.4545 c
42.3884 61.7743 42.1657 62.3896 42.4328 62.5156 c
50.321 62.7031 60.7761 62.8334 68.9499 62.3974 c
68.9499 62.3974 l
p
f
57.6374 60.8656 m
58.4948 60.8656 60.0378 60.8656 61.2898 60.8656 c
62.3933 60.8656 63.7527 61.1493 64.3542 60.5116 c
62.6374 60.7734 59.7605 60.1176 57.989 60.5116 c
57.78 60.5585 57.6413 60.4511 57.6374 60.8656 c
57.6374 60.8656 l
p
f
grestore
100.1804 59.0971 m
100.6594 58.8686 100.8774 58.3803 101.0064 57.8022 c
100.5344 57.6459 99.9834 57.5678 99.5924 57.3295 c
99.7034 56.7338 100.1624 56.4858 100.2994 55.9155 c
99.6904 55.9369 99.3644 55.6733 98.8854 55.5619 c
98.8194 55.9662 98.5414 56.1615 98.2954 56.3881 c
98.4144 56.935 99.1904 56.8295 99.3564 57.3295 c
98.0884 58.1518 96.1824 59.6596 94.2894 58.7436 c
94.1394 59.2631 93.6234 59.4155 93.5824 60.0405 c
94.1824 60.185 94.5754 60.5414 94.9964 60.8656 c
96.2684 59.976 97.9384 59.4858 99.3564 58.7436 c
99.8134 58.6811 99.8424 59.0444 100.1804 59.0971 c
100.1804 59.0971 l
p
f
64.7077 60.7475 m
66.4148 59.9804 67.9948 59.0854 68.8327 57.4467 c
67.3952 58.4838 65.8249 59.3901 64.7077 60.7475 c
64.7077 60.7475 l
p
f
68.7155 58.7436 m
67.8874 58.7182 67.1667 59.7768 66.4753 60.2763 c
67.3484 61.5815 69.8718 60.2289 68.7155 58.7436 c
68.7155 58.7436 l
p
f
88.9854 60.5116 m
89.4514 60.7768 89.9324 60.0468 90.0454 59.5697 c
89.5884 59.7787 89.4694 60.3271 88.9854 60.5116 c
88.9854 60.5116 l
p
f
85.3324 60.3945 m
85.6084 60.623 86.0674 60.0341 86.1574 59.6869 c
85.6924 59.7319 85.6144 60.1655 85.3324 60.3945 c
85.3324 60.3945 l
p
f
74.9616 60.3945 m
74.7175 60.0468 74.6042 59.5717 74.1355 59.4506 c
74.1862 59.9902 74.3933 60.3735 74.9616 60.3945 c
74.9616 60.3945 l
p
f
79.3214 59.0971 m
79.3834 58.1322 80.9164 57.9252 81.2074 59.0971 c
80.9264 60.3686 79.2484 60.2348 79.3214 59.0971 c
79.3214 59.0971 l
p
80.0284 60.2763 m
81.3264 60.5322 81.7374 58.3705 80.6174 58.0365 c
79.1624 57.603 78.2683 59.9272 80.0284 60.2763 c
80.0284 60.2763 l
p
f
85.2134 59.3334 m
85.1454 60.0737 84.5264 60.1352 84.1534 60.0405 c
81.8754 59.4643 85.4284 57.0092 85.2134 59.3334 c
85.2134 59.3334 l
p
84.7424 58.0365 m
83.6594 58.2045 83.1274 58.5483 83.0924 59.2162 c
82.9594 61.7441 87.2804 59.3862 84.7424 58.0365 c
84.7424 58.0365 l
p
f
76.9655 60.2763 m
77.3737 60.1742 77.4968 59.7865 77.7898 59.5697 c
77.4714 59.2963 77.03 59.9057 76.9655 60.2763 c
76.9655 60.2763 l
p
f
81.3254 60.1581 m
81.5534 60.4164 81.9874 59.8822 82.0324 59.5697 c
81.7214 59.6908 81.6354 60.0365 81.3254 60.1581 c
81.3254 60.1581 l
p
f
76.1394 58.0365 m
76.6472 58.185 76.9831 59.0502 76.4929 59.6869 c
74.4987 60.582 74.5573 57.5756 76.1394 58.0365 c
76.1394 58.0365 l
p
75.5495 60.0405 m
77.5085 60.6196 77.323 57.724 75.903 57.683 c
74.6491 57.6479 74.1784 59.6342 75.5495 60.0405 c
75.5495 60.0405 l
p
f
gsave
57.7175 138.726 m
57.7175 42.3354 l
134.2524 42.3354 l
134.2524 138.726 l
57.7175 138.726 l
clp
65.1804 58.3901 m
65.3366 58.3901 65.4929 58.3901 65.6511 58.3901 c
65.7527 58.769 65.4694 58.7592 65.2976 58.8627 c
65.2605 58.7026 65.1296 58.6362 65.1804 58.3901 c
65.1804 58.3901 l
p
66.4753 58.8627 m
66.2448 58.2494 66.2136 57.7807 66.4753 57.2123 c
65.7234 57.1772 65.4929 56.6244 64.7077 56.6225 c
64.3015 56.9272 64.7175 57.2143 64.7077 57.5658 c
64.7038 57.7045 64.4362 57.769 64.4714 57.9194 c
64.6159 58.5405 65.4187 58.851 65.2976 59.5697 c
65.8308 59.476 66.2448 59.2592 66.4753 58.8627 c
66.4753 58.8627 l
p
f
57.8718 59.0971 m
60.323 59.2319 62.3171 58.9076 64.5905 58.8627 c
64.112 58.2533 64.2605 57.7006 64.0007 56.976 c
63.0437 56.9623 62.0886 56.9487 61.4069 57.2123 c
61.0105 56.9018 61.237 55.9682 60.7019 55.7983 c
60.1237 55.9662 59.7019 56.2905 59.5222 56.8588 c
60.1589 56.8666 60.1472 56.9115 60.5827 56.976 c
60.8601 57.1303 60.8093 57.6127 60.9362 57.9194 c
61.3542 58.103 61.0066 57.519 61.2898 57.5658 c
61.5515 57.6147 61.403 58.2104 61.1726 58.1557 c
60.653 58.2026 60.7644 57.6186 60.5827 57.3295 c
59.5944 57.2807 58.0788 56.7436 57.4011 57.4467 c
57.5456 58.0092 57.7898 58.4721 57.8718 59.0971 c
57.8718 59.0971 l
p
f
grestore
78.2605 58.8627 m
78.9344 58.3569 79.5144 57.7592 79.9104 56.976 c
79.1804 57.4233 78.6194 58.0424 78.2605 58.8627 c
78.2605 58.8627 l
p
f
82.5024 58.8627 m
83.2094 58.4682 83.5534 57.7123 84.1534 57.2123 c
83.5454 57.2358 82.8974 58.2319 82.5024 58.8627 c
82.5024 58.8627 l
p
f
86.7464 58.8627 m
87.3914 58.4858 87.7584 57.8315 88.2784 57.3295 c
87.7394 57.3412 87.0884 58.2612 86.7464 58.8627 c
86.7464 58.8627 l
p
f
68.0066 57.4467 m
67.5105 57.0971 66.9558 57.5248 66.4753 57.5658 c
66.0515 59.1264 67.9109 58.5053 68.0066 57.4467 c
68.0066 57.4467 l
p
f
81.5594 56.1518 m
81.9484 55.7768 82.8074 55.894 83.0924 56.269 c
83.4794 58.1655 80.8504 57.6694 81.5594 56.1518 c
81.5594 56.1518 l
p
82.2684 57.8022 m
83.9074 57.9838 83.5804 55.3041 82.1514 55.4447 c
81.0574 55.5522 80.7414 57.6303 82.2684 57.8022 c
82.2684 57.8022 l
p
f
77.0827 56.6225 m
77.0319 55.7045 78.4244 55.2436 78.9674 56.269 c
78.9964 57.7494 77.1433 57.7397 77.0827 56.6225 c
77.0827 56.6225 l
p
79.3214 56.7397 m
79.1254 56.228 78.9124 55.7358 78.4964 55.4447 c
74.9714 55.3842 78.0554 59.4819 79.3214 56.7397 c
79.3214 56.7397 l
p
f
100.0634 54.8549 m
100.3524 54.1615 100.7704 53.5971 101.1234 52.9682 c
100.8214 52.2514 100.7584 51.2905 100.0634 50.9662 c
99.3834 51.8471 100.4814 52.4526 100.2994 53.558 c
99.8954 53.4916 99.5784 53.3373 99.3564 53.0873 c
97.4364 54.1127 95.9444 55.5678 93.2274 55.7983 c
93.0554 56.2924 92.6174 56.5209 92.5224 57.0951 c
92.9014 57.3041 93.3694 57.4233 93.7004 57.683 c
95.5414 56.4623 97.3544 55.2084 100.0634 54.8549 c
100.0634 54.8549 l
p
f
58.1081 56.8588 m
58.3034 56.8588 58.5007 56.8588 58.698 56.8588 c
58.6667 56.3783 58.4753 56.058 58.3444 55.6791 c
58.0691 55.9428 57.9499 56.4897 58.1081 56.8588 c
58.1081 56.8588 l
p
f
gsave
57.7175 138.726 m
57.7175 42.3354 l
134.2524 42.3354 l
134.2524 138.726 l
57.7175 138.726 l
clp
64.2351 56.7397 m
64.4265 56.7729 64.4382 56.6283 64.5905 56.6225 c
64.6452 56.144 64.0984 55.8764 63.8835 56.0326 c
63.987 56.2807 64.0652 56.558 64.2351 56.7397 c
64.2351 56.7397 l
p
f
57.5183 56.3881 m
58.3718 56.1088 58.1648 54.7826 58.2253 53.4408 c
58.2761 52.3041 58.6335 51.1459 58.3444 50.6127 c
57.4812 51.1537 57.4831 53.4994 57.4011 54.8549 c
57.3777 55.2436 57.4187 55.6498 57.4011 56.0326 c
57.3679 56.224 57.5124 56.2358 57.5183 56.3881 c
57.5183 56.3881 l
p
f
grestore
66.8288 56.1518 m
67.6609 54.8569 66.9968 52.183 66.7116 50.849 c
66.4167 50.7475 66.0788 50.6947 65.6511 50.7299 c
65.7214 52.2729 66.5925 54.4858 66.239 56.1518 c
66.5319 55.9975 66.7292 56.4975 66.8288 56.1518 c
66.8288 56.1518 l
p
f
67.4187 56.1518 m
67.653 56.1518 l
68.7155 55.851 69.0886 50.8471 67.4187 50.7299 c
67.3327 52.3354 67.821 54.3901 67.4187 56.1518 c
67.4187 56.1518 l
p
f
80.3814 56.0326 m
80.9654 56.0639 81.5654 55.0951 81.9144 54.5014 c
81.2584 54.8686 80.9754 55.6069 80.3814 56.0326 c
80.3814 56.0326 l
p
f
76.0222 56.0326 m
76.7859 55.7377 77.0769 54.9682 77.6726 54.5014 c
76.9851 54.4057 76.3816 55.4096 76.0222 56.0326 c
76.0222 56.0326 l
p
f
68.4792 55.9155 m
68.7527 55.7963 68.8581 55.5092 68.8327 55.0912 c
68.5027 55.1518 68.614 55.6576 68.4792 55.9155 c
68.4792 55.9155 l
p
f
97.5884 52.9682 m
97.5844 52.2963 98.1294 52.1752 98.1784 51.5541 c
97.7254 51.3412 97.2034 51.1947 96.7644 50.9662 c
95.1334 51.8276 93.8284 53.5854 91.5784 53.4408 c
91.6394 54.0522 91.1514 54.1127 91.2254 54.7377 c
91.7704 54.8197 92.0924 55.1264 92.6374 55.2084 c
93.7644 54.1733 95.0944 53.3412 96.6474 52.7338 c
97.1374 52.6342 97.2034 52.9623 97.5884 52.9682 c
97.5884 52.9682 l
p
f
63.8835 52.3803 m
63.948 50.7944 61.987 49.9838 61.2898 51.4369 c
60.9245 51.224 61.2273 51.0756 61.1726 50.6127 c
60.7058 50.6557 60.0417 50.5033 59.7585 50.7299 c
59.8327 51.6381 60.1628 52.2905 60.4655 52.9682 c
61.8679 53.0365 63.0027 52.8354 63.8835 52.3803 c
63.8835 52.3803 l
p
f
96.5284 49.435 m
96.6514 48.2592 97.4914 47.8022 97.8254 46.8412 c
97.1984 46.9994 96.9014 47.4877 96.2914 47.6655 c
95.7034 47.5463 95.6744 46.8705 95.3484 46.4877 c
94.8014 46.7865 94.8014 47.6127 95.2334 48.019 c
93.9674 49.2182 92.5264 51.2709 90.1644 50.6127 c
89.9614 51.0776 89.7334 51.517 89.5754 52.0248 c
90.2524 52.1401 90.9124 52.5678 91.4594 52.4975 c
92.1174 52.4135 92.4514 51.7201 92.9924 51.3197 c
94.1024 50.4955 95.3674 49.8354 96.5284 49.435 c
96.5284 49.435 l
p
f
gsave
57.7175 138.726 m
57.7175 42.3354 l
134.2524 42.3354 l
134.2524 138.726 l
57.7175 138.726 l
clp
58.8152 51.5541 m
59.1452 51.4916 59.0319 50.9877 59.1687 50.7299 c
58.7663 50.7221 58.8191 51.1674 58.8152 51.5541 c
58.8152 51.5541 l
p
f
68.8327 50.142 m
68.8386 49.56 68.9245 47.9428 68.7155 47.1947 c
67.9909 48.351 67.6179 49.724 66.0046 49.435 c
64.5573 49.1733 65.1277 47.4115 63.6472 47.0776 c
63.1472 48.5776 61.4362 50.2729 59.8757 48.726 c
59.4284 48.2826 59.2136 47.1479 58.698 47.0776 c
57.7995 46.9526 58.0964 47.6987 57.5183 48.4916 c
57.1809 48.9545 56.24 49.603 55.279 49.435 c
53.9621 49.2006 54.0158 47.0405 52.4504 47.3119 c
51.7878 50.1342 48.5471 49.9721 47.7365 47.3119 c
47.5793 47.3119 47.4226 47.3119 47.2653 47.3119 c
46.6306 48.4506 46.028 49.8705 44.6726 49.7865 c
43.385 49.7065 43.3449 48.1908 42.4328 47.4291 c
42.2722 48.1342 42.2121 49.5639 42.4328 50.2592 c
42.4138 50.3959 42.4587 50.4682 42.551 50.4936 c
51.1438 50.3608 60.9441 50.2104 68.8327 50.142 c
68.8327 50.142 l
p
f
grestore
99.3564 48.9623 m
99.1354 48.8686 98.9244 48.7651 98.6494 48.726 c
98.5024 49.2865 98.0964 49.5893 98.0594 50.2592 c
98.9674 50.974 98.9344 49.435 99.3564 48.9623 c
99.3564 48.9623 l
p
f
gsave
57.7175 138.726 m
57.7175 42.3354 l
134.2524 42.3354 l
134.2524 138.726 l
57.7175 138.726 l
clp
91.3424 44.9545 m
91.9384 44.9565 93.0734 44.7885 93.5824 45.1908 c
93.9244 47.5502 90.2524 47.5873 91.3424 44.9545 c
91.3424 44.9545 l
p
90.8714 45.6615 m
91.1454 47.0346 90.4914 48.685 88.7484 48.726 c
87.7784 47.2436 89.9694 46.392 90.8714 45.6615 c
90.8714 45.6615 l
p
91.2254 48.9623 m
91.2254 48.5697 91.2254 48.1752 91.2254 47.7846 c
93.5694 48.7631 94.2684 45.5737 93.4634 43.6596 c
92.6984 43.7572 91.8894 43.8119 90.9894 43.7768 c
89.6274 44.7533 88.7484 46.6381 86.7464 46.6049 c
86.6684 47.0151 86.3604 47.6342 86.5104 47.9018 c
87.1194 47.7104 87.8894 47.7846 88.2784 48.1381 c
88.1984 48.9057 88.2844 49.1459 88.1604 49.9057 c
89.6824 50.4487 90.0354 49.1127 91.2254 48.9623 c
91.2254 48.9623 l
p
f
38.779 46.8412 m
50.1657 46.7299 61.3112 46.685 72.487 46.6049 c
72.4265 45.9565 72.6159 45.06 72.3679 44.601 c
66.7448 44.7006 60.487 44.4623 55.279 44.601 c
49.7419 44.7494 44.406 44.7514 38.6623 44.9545 c
38.4299 45.2729 38.5915 45.9858 38.5437 46.4877 c
38.5388 46.6889 38.6316 46.7924 38.779 46.8412 c
38.779 46.8412 l
p
f
73.0749 46.6049 m
74.9616 46.6049 76.8464 46.6049 78.7334 46.6049 c
78.9814 46.1459 78.7914 45.2494 78.8504 44.601 c
76.8093 44.5092 74.7019 44.435 73.0749 44.601 c
73.0027 45.3959 73.0886 45.6889 73.0749 46.6049 c
73.0749 46.6049 l
p
f
86.8644 44.7201 m
88.8134 43.8783 89.6904 41.9682 91.5784 41.0658 c
91.3404 40.2748 91.8524 39.5483 91.6964 38.9447 c
91.0764 39.1498 90.9554 39.853 90.2824 40.0053 c
89.5104 40.0307 89.6574 39.1362 88.9854 39.0619 c
88.8694 39.3393 88.7804 39.6401 88.7484 40.0053 c
88.7644 40.4604 89.2274 40.4701 89.3384 40.8295 c
88.6334 42.2846 87.1844 42.9975 86.2764 44.2475 c
85.6254 44.4057 85.3754 44.2299 84.6234 44.2475 c
84.6394 44.7338 84.4204 44.9858 84.5064 45.5444 c
85.5784 45.7553 86.9504 46.2963 86.8644 44.7201 c
86.8644 44.7201 l
p
f
58.5788 43.7768 m
58.6726 43.1713 58.3308 43.0033 58.3444 42.4799 c
57.5964 42.4799 56.8503 42.4799 56.1042 42.4799 c
56.0583 42.9213 55.7546 43.5483 55.9865 43.894 c
56.5666 43.9018 57.8679 43.9897 58.5788 43.7768 c
58.5788 43.7768 l
p
f
61.6433 43.7768 m
61.7273 43.1811 61.4831 42.9155 61.4069 42.4799 c
60.6472 42.5424 59.6218 42.3432 59.0495 42.5971 c
58.6433 44.2162 60.5886 44.0014 61.6433 43.7768 c
61.6433 43.7768 l
p
f
64.7097 43.892 m
64.7644 43.2084 64.4304 42.9213 64.2331 42.4799 c
63.8015 42.2905 62.6667 42.2905 62.2351 42.4799 c
61.7937 44.2162 63.3972 43.9115 64.7097 43.892 c
f
73.7819 43.6596 m
71.8464 42.9662 70.2995 41.8764 68.5984 40.9506 c
67.9597 40.2475 67.1667 39.6987 66.4734 39.06 c
65.7995 38.439 65.2234 37.728 64.4753 37.179 c
65.4753 40.0229 67.321 42.0307 69.4167 43.7768 c
69.9128 43.767 70.4343 43.7768 70.9558 43.7768 c
71.9558 43.7944 72.946 43.8119 73.7819 43.6596 c
f
82.0324 43.4233 m
82.7394 43.4233 83.4464 43.4233 84.1534 43.4233 c
84.9914 41.8237 85.6684 40.0678 87.6904 39.6518 c
87.9144 39.2885 88.0024 38.7865 88.0434 38.238 c
87.3644 38.247 86.6804 38.263 86.1574 38.121 c
85.1534 39.4819 84.5324 41.8256 82.3854 41.6557 c
82.4144 42.3901 82.0514 42.7358 82.0324 43.4233 c
82.0324 43.4233 l
p
f
82.2684 35.173 m
82.8694 35.396 82.9054 36.187 83.7994 36.117 c
83.7644 36.986 83.2744 37.398 82.8584 37.884 c
81.3194 38.058 82.3154 35.978 82.2684 35.173 c
82.2684 35.173 l
p
79.2034 39.4155 m
79.9734 38.7494 80.1144 36.902 81.7954 37.531 c
81.6144 38.8412 81.8774 40.5971 81.0884 41.3022 c
80.9464 40.1889 79.9204 39.9565 79.2034 39.4155 c
79.2034 39.4155 l
p
81.2074 42.7162 m
81.7134 41.8471 81.5824 40.3432 81.9144 39.2983 c
82.4734 39.2104 82.7234 39.4311 83.2114 39.4155 c
83.6394 38.7826 84.0264 38.111 84.6234 37.648 c
84.4614 36.871 84.2664 36.035 84.5064 35.173 c
83.3674 35.093 82.5574 34.685 82.3854 33.64 c
81.9594 34.197 82.1414 35.361 81.9144 36.117 c
81.4754 36.562 80.5674 36.253 79.9104 36.234 c
79.5284 37.148 79.0104 37.927 78.4964 38.708 c
78.6514 39.4174 78.9124 40.0209 78.8504 40.9487 c
80.0984 41.0737 80.8644 41.685 81.2074 42.7162 c
81.2074 42.7162 l
p
f
65.6511 73.3573 m
66.5827 72.915 66.1335 71.0903 66.948 70.5292 c
67.1843 71.0741 66.2214 71.9799 66.5925 72.6503 c
67.3191 72.474 67.4362 71.6874 67.8894 71.2367 c
68.405 72.2465 66.5046 73.7455 65.6511 73.3573 c
65.6511 73.3573 l
p
64.9421 73.7114 m
64.2409 76.8207 65.2468 81.6357 62.9402 83.1396 c
64.5749 80.9657 63.9636 76.5419 64.9421 73.7114 c
64.9421 73.7114 l
p
65.5319 78.7792 m
65.5749 80.5048 65.9538 82.5209 66.239 83.6113 c
65.4968 82.6493 64.8366 80.3989 65.5319 78.7792 c
65.5319 78.7792 l
p
49.74 103.1752 m
46.5808 103.4272 47.4362 99.6645 44.5549 99.6396 c
46.987 97.1503 53.1154 100.0365 49.74 103.1752 c
49.74 103.1752 l
p
64.3542 99.9926 m
63.446 101.1249 64.0359 103.288 62.5847 103.6464 c
61.1823 103.9936 60.1999 103.1171 60.112 101.996 c
59.948 99.935 62.6706 98.4516 65.4148 99.0497 c
64.9773 99.5961 64.7546 99.4926 64.3542 99.9926 c
64.3542 99.9926 l
p
64.4714 102.1142 m
64.4187 100.6825 65.3444 99.3227 66.8288 99.7568 c
69.5515 100.5546 69.0261 106.7353 66.3581 106.9462 c
67.7605 104.9072 65.53 103.1781 64.4714 102.1142 c
64.4714 102.1142 l
p
42.7868 103.1752 m
42.8025 101.6991 44.3249 99.5082 45.8513 100.8183 c
47.9314 102.603 43.5998 105.267 45.6154 107.4179 c
44.4416 106.9076 42.7644 105.2988 42.7868 103.1752 c
42.7868 103.1752 l
p
47.2653 107.5356 m
46.5158 107.3364 45.9143 106.3505 45.969 105.6498 c
46.1252 103.6454 48.3698 104.6254 49.9758 103.8822 c
51.1931 103.3183 50.8747 102.4491 51.508 101.289 c
52.8054 104.0527 50.5295 108.4042 47.2653 107.5356 c
47.2653 107.5356 l
p
61.5261 104.3534 m
62.5476 104.6225 63.6823 103.9643 64.4714 104.1181 c
66.8933 104.5898 66.1335 107.7988 64.0007 107.8896 c
61.698 107.9867 59.3503 105.3046 59.7585 102.9394 c
60.5886 103.5688 60.5944 104.1078 61.5261 104.3534 c
61.5261 104.3534 l
p
57.6374 107.0644 m
58.0359 106.3632 59.2487 106.4765 59.1687 105.2968 c
59.4968 106.4609 60.3855 107.0658 61.0554 107.8896 c
59.4167 107.9277 58.4812 107.8954 57.6374 107.0644 c
57.6374 107.0644 l
p
42.0793 103.8822 m
42.278 105.8447 43.5769 106.706 44.5549 107.8896 c
43.6906 107.8896 42.8264 107.8896 41.9616 107.8896 c
41.8396 106.7934 41.6384 104.788 42.0793 103.8822 c
42.0793 103.8822 l
p
57.2824 107.5356 m
57.6609 107.8075 57.0319 108.061 57.1652 108.4784 c
59.8952 108.0873 65.5476 108.7597 69.1862 108.0068 c
69.0359 107.4902 67.9538 107.9042 67.4187 107.7714 c
67.8913 107.0263 68.9987 105.8949 69.3034 104.5893 c
69.4636 105.3593 69.4929 107.017 69.4206 108.1254 c
70.9089 107.3002 72.4753 106.0405 74.0183 104.8251 c
75.5319 103.6318 76.9597 102.2392 78.4964 101.1713 c
77.0827 101.4726 73.0593 102.5571 72.3679 100.8183 c
72.0632 100.0478 72.2956 98.8549 72.2507 97.6357 c
72.1296 94.3949 72.0944 89.1742 72.1316 86.204 c
71.2585 86.6274 70.6003 87.2646 69.7761 87.7363 c
71.9675 85.8036 74.4343 84.1449 76.7292 82.3144 c
76.905 83.5644 76.5222 86.4521 76.8464 88.4433 c
77.4851 86.3608 76.778 83.4692 77.3171 81.7255 c
77.364 82.1889 78.1706 81.894 78.1433 82.4321 c
78.3015 83.1811 77.2566 82.7245 77.3171 83.3749 c
77.2351 83.8119 77.5046 83.8964 77.9069 83.8471 c
78.1042 84.2905 77.3581 84.3837 77.6726 84.5541 c
78.1433 84.5541 78.6144 84.5541 79.0864 84.5541 c
78.7424 84.0624 78.8714 83.8393 79.4404 83.7289 c
79.5534 82.9467 78.7974 83.0341 78.4964 82.6679 c
78.4014 82.0224 79.1394 82.2114 79.3214 81.8437 c
79.4244 81.2299 78.6644 81.4794 78.4964 81.1362 c
78.6144 80.3886 79.6844 80.5961 79.4404 79.4867 c
76.0437 81.9833 72.6257 84.4579 69.4206 87.1469 c
69.446 87.602 69.4265 88.0156 69.3034 88.3251 c
68.6003 88.1362 67.6101 87.2607 66.948 88.0898 c
66.3972 87.5785 65.8054 87.1103 65.2976 86.5575 c
65.8894 86.4775 66.3484 87.5468 67.0652 87.7363 c
66.7605 86.0361 65.6569 85.1366 64.9421 83.8471 c
64.6296 83.8471 64.3152 83.8471 64.0007 83.8471 c
65.7234 82.62 66.5359 86.349 67.4187 87.3827 c
67.6023 83.2387 65.823 78.102 65.5319 73.829 c
66.7546 76.9111 67.2839 81.2978 67.8894 85.2612 c
68.0222 86.1235 67.7312 87.6064 68.8327 87.8539 c
68.7136 82.3578 68.6003 76.4877 68.4792 71.3544 c
68.1023 70.8276 67.4421 70.5829 67.0652 70.0575 c
66.4265 70.558 65.2253 70.498 64.3542 70.7646 c
64.2937 73.4267 64.0163 76.7548 62.9402 78.7792 c
63.2917 80.3593 61.9382 81.227 61.4069 82.3144 c
62.0984 83.1562 62.698 84.0893 63.1745 85.1435 c
63.6413 85.0082 64.5495 83.873 64.9421 84.7895 c
64.3073 84.6864 63.4284 85.2831 63.4109 85.8505 c
63.3737 87.1518 66.4753 87.5214 66.8288 88.6791 c
65.7116 88.1459 64.9441 87.2631 63.6472 86.9111 c
63.5905 88.6967 66.3034 87.7128 66.3581 89.3862 c
65.5378 89.8173 64.5652 89.3857 63.4109 89.5038 c
63.5984 86.6982 62.7175 83.3832 60.8171 82.6679 c
61.2448 84.0488 62.5827 84.5175 62.5847 86.3217 c
61.9148 85.1064 61.6159 83.5204 60.112 83.1396 c
59.4812 83.6083 59.5495 84.7778 58.5788 84.9081 c
59.5378 85.4814 60.7409 85.8095 60.8171 87.2646 c
61.5105 87.0922 62.4421 87.1606 62.5847 86.4394 c
64.0398 92.1147 58.7546 96.8554 52.4504 94.8075 c
49.9558 93.5156 47.801 90.7338 48.3254 87.1469 c
48.613 85.183 49.6501 84.1269 50.5652 82.6679 c
48.6145 83.5517 47.636 86.1987 47.7365 88.915 c
47.9016 93.3603 52.7204 96.6781 57.4011 95.7509 c
60.2097 95.1933 62.3484 92.8188 63.2937 90.0937 c
65.1804 90.0937 67.0652 90.0937 68.9499 90.0937 c
69.0671 89.7045 68.1941 89.6425 68.9499 89.6215 c
68.7917 88.9164 68.0495 88.7929 67.4187 88.561 c
68.1452 88.1908 68.5339 89.1723 69.3034 89.1503 c
69.1218 91.0278 69.7546 93.0219 69.3034 94.6894 c
68.9226 96.1 67.5398 96.6855 66.4753 97.5185 c
67.948 98.3232 69.8601 99.6811 69.3034 101.7607 c
68.6218 99.3793 66.6277 98.308 63.8835 97.9892 c
66.2058 96.6586 68.6745 95.474 69.0671 92.2148 c
68.7546 92.2148 68.4402 92.2148 68.1257 92.2148 c
66.5554 97.519 58.9734 96.8114 56.2224 100.936 c
55.115 98.2323 51.7141 97.8232 49.8576 95.8676 c
49.7317 95.4052 49.8322 94.7148 49.6218 94.3364 c
48.9524 94.0683 48.6701 94.8051 48.2082 94.9252 c
46.0627 95.4814 44.8899 93.2289 43.8474 91.9789 c
44.1218 94.2289 46.8127 96.3642 49.0334 94.8075 c
50.0217 98.5063 55.9387 97.8622 55.8684 102.2323 c
56.3977 102.29 56.7517 102.1723 57.1652 102.1142 c
57.9343 100.6835 59.0027 99.5522 60.7019 99.0497 c
60.2058 99.79 58.9402 101.3534 58.9323 102.5859 c
57.4577 102.6786 54.7063 102.4184 53.0402 102.7035 c
54.8313 103.4364 57.0412 102.8066 58.8152 102.9394 c
58.7683 103.7333 58.9206 104.3271 59.0495 104.9428 c
59.0847 105.0239 57.5398 104.185 57.5183 105.061 c
57.0998 105.0478 57.0901 104.6249 56.5754 104.7074 c
56.9079 104.6713 57.0813 104.1659 56.8108 103.8822 c
56.3415 103.8056 56.0905 103.9467 56.1042 104.3534 c
55.8313 103.5595 55.4719 104.2724 54.926 103.8822 c
54.3869 103.893 54.4729 104.5287 54.1008 104.7074 c
53.4934 104.7289 52.6965 104.5605 52.5686 105.061 c
53.341 102.8261 52.3835 100.6464 51.2722 99.2856 c
52.7356 99.8261 53.6198 100.9452 54.3366 102.2323 c
54.6902 102.2323 55.0432 102.2323 55.3967 102.2323 c
53.5363 96.5502 44.6672 97.8764 43.0227 91.9789 c
42.7478 91.9789 42.4724 91.9789 42.1975 91.9789 c
42.0861 95.2743 44.9436 96.6166 47.3825 97.7538 c
44.6506 98.2822 42.9777 99.8696 42.0793 102.2323 c
41.1892 99.9208 43.0227 98.5219 44.3191 97.6357 c
42.6428 96.4081 41.3767 94.5346 41.844 91.5077 c
42.3122 91.4159 44.1379 92.0483 44.6726 91.5077 c
44.1364 90.7929 43.1555 91.2314 42.0793 91.0361 c
41.8161 90.1606 42.0324 88.8046 41.9616 87.7363 c
41.0715 87.2509 40.4758 86.4726 39.487 86.0864 c
39.1613 88.832 39.5061 92.5898 39.3689 95.9858 c
39.2863 98.0253 39.5354 101.0458 38.426 101.8788 c
36.3791 103.4155 33.2805 102.102 31.3547 101.0536 c
34.49 103.6542 37.8152 106.0649 41.1364 108.4784 c
44.49 108.3447 48.7453 108.8564 52.3327 108.4784 c
52.3962 107.6303 51.3171 107.9228 50.6833 107.7714 c
50.9851 107.1293 52.093 106.2753 52.4504 105.2968 c
52.2722 106.2734 53.6565 106.4618 54.1008 107.1821 c
55.2531 107.0522 55.8625 106.393 56.9294 107.0644 c
54.9187 107.1025 53.9021 107.6781 52.4504 107.7714 c
52.3659 108.1318 52.5715 108.2006 52.5686 108.4784 c
53.4836 108.6806 53.6101 108.0326 53.9826 108.0068 c
54.2204 107.7387 54.3747 108.5517 54.8078 108.4784 c
55.6159 107.6728 57.2277 109.0942 57.2824 107.5356 c
57.2824 107.5356 l
p
f
72.0144 47.3119 m
71.4441 46.9662 70.0319 47.0092 69.3034 47.1947 c
69.3132 60.5883 69.3523 72.7875 69.5398 86.204 c
72.5066 84.3383 75.1042 82.1054 78.0241 80.1938 c
78.4914 79.3241 79.1784 78.6752 79.4404 77.6005 c
79.9344 80.6298 79.4634 85.4179 79.6744 88.2079 c
80.2214 85.2187 79.7564 81.2177 79.9104 77.8364 c
80.9424 78.2934 80.2664 79.9482 81.0884 80.4291 c
81.5824 80.4721 81.1724 80.0448 81.2074 79.8393 c
81.7704 79.9447 81.8604 80.5239 81.9144 81.1362 c
81.6964 81.6874 80.8014 80.8671 80.7354 81.6073 c
80.6764 82.2953 81.9284 81.6708 81.9144 82.3144 c
82.0804 82.9526 81.5164 82.8603 81.3254 83.1396 c
81.5614 83.9252 82.2914 85.2055 81.6784 86.0864 c
81.1064 85.912 80.3264 85.9057 80.2644 86.5575 c
80.3114 87.1 80.9914 87.0097 81.5594 87.0287 c
81.6414 87.3456 81.3174 87.2568 81.2074 87.3827 c
81.6944 87.7802 82.4634 87.5156 82.9754 87.5004 c
83.0884 87.0732 82.4654 87.3808 82.3854 87.1469 c
82.4774 86.6098 83.7004 87.204 83.7994 86.6757 c
83.7854 86.0209 83.1534 85.9882 82.5024 85.9687 c
82.4104 85.707 82.2564 85.5087 82.2684 85.1435 c
82.8484 84.3842 82.4074 83.9135 82.9754 83.1396 c
82.7954 82.9262 82.1664 83.162 82.2684 82.6679 c
82.1574 81.5995 83.3794 82.4731 83.3284 81.6073 c
83.4014 81.1425 82.6804 81.4687 82.3854 81.3715 c
82.3714 80.5727 82.7004 80.1152 82.9754 79.6044 c
83.2744 79.832 82.4184 80.3315 82.9754 80.5463 c
83.8464 79.9301 83.5434 78.5287 84.0354 77.3647 c
84.4094 81.2177 84.0164 85.1283 84.2724 88.3251 c
85.0324 85.1572 84.1924 81.5629 84.6234 77.3647 c
84.8794 78.3759 85.5064 79.5878 85.5674 81.1362 c
85.4484 81.4081 84.7784 81.1327 84.8604 81.6073 c
84.8754 82.2201 85.9634 81.7626 85.8034 82.5507 c
85.7934 83.0517 85.0514 82.8217 84.8604 83.1396 c
84.8054 84.0912 85.8154 83.7895 85.0964 84.5541 c
85.5714 84.6698 85.9484 84.8818 85.8034 85.6147 c
85.7784 86.1386 85.0614 85.9726 84.8604 86.3217 c
84.9504 87.0121 85.6044 86.9487 84.9774 87.5004 c
85.6984 87.4272 86.2724 87.7983 86.8644 87.5004 c
85.9714 87.0654 86.9754 86.9692 86.8644 86.0864 c
86.7234 85.9506 86.4484 85.9531 86.1574 85.9687 c
86.0654 85.5546 86.0344 84.5199 86.7464 84.5541 c
86.1174 84.0395 87.0024 83.9521 86.9834 83.3749 c
86.7974 82.9711 86.1744 83.0043 86.0394 82.5507 c
86.0244 81.9057 86.8934 82.1469 87.1004 81.7255 c
87.0324 81.3237 86.7154 81.1684 86.1574 81.2543 c
86.1354 79.8569 86.4464 78.7929 87.1004 78.0717 c
87.3644 81.4628 87.1904 85.7865 87.1004 88.561 c
83.4034 88.5781 79.3604 88.5361 76.0222 88.561 c
76.0222 88.7968 76.0222 89.0326 76.0222 89.2685 c
79.8344 89.3876 84.7784 89.6191 88.3974 89.1503 c
88.5084 88.4892 87.7804 88.6655 87.4534 88.4433 c
87.8424 84.663 87.6214 80.2079 87.6904 76.4218 c
86.5944 76.7822 86.4894 78.1283 86.1574 79.2499 c
84.8154 78.9423 85.2624 76.8451 84.1534 76.3046 c
84.5354 75.2641 85.9754 74.6801 86.0394 73.7114 c
84.1624 74.7817 83.5964 77.162 82.0324 78.5434 c
80.6044 77.2607 80.2314 74.9238 78.6144 73.829 c
79.7234 75.6659 80.7544 77.5805 82.0324 79.2499 c
82.8714 78.7944 82.9204 77.5463 83.6824 77.0116 c
83.3694 78.1132 82.7914 78.9496 82.2684 79.8393 c
81.1084 79.0365 80.7094 77.4692 79.7934 76.4218 c
79.1554 77.1601 78.8914 78.2695 78.2605 79.0146 c
77.6687 78.31 77.6687 77.0146 76.9655 76.4218 c
76.4245 77.6059 76.987 78.6083 76.7292 80.0751 c
77.1687 79.5732 76.9167 78.3783 77.0827 77.6005 c
77.6569 78.0859 77.737 79.0683 78.1433 79.7221 c
77.0476 80.3788 73.1394 81.4877 72.3679 79.8393 c
71.8894 78.8188 72.0749 76.2836 72.0144 75.0077 c
71.7761 69.8769 72.1101 65.8368 72.1316 61.8075 c
72.1589 57.1498 71.8757 51.6928 72.0144 47.3119 c
72.0144 47.3119 l
p
f
61.5261 64.9902 m
61.8679 64.9496 61.9226 66.2265 61.6433 66.0507 c
61.7058 65.5951 61.4323 65.476 61.5261 64.9902 c
61.5261 64.9902 l
p
54.8078 64.0478 m
55.6599 64.3735 56.1472 65.0644 56.4577 65.933 c
55.8235 65.664 55.5881 64.996 54.926 64.7548 c
53.1467 66.2367 52.2453 68.5956 50.6833 70.2934 c
51.9641 68.1181 52.8884 65.5849 54.8078 64.0478 c
54.8078 64.0478 l
p
55.1613 67.4657 m
56.0822 67.6186 56.8122 69.2123 57.1652 69.8222 c
56.3264 69.2861 55.7907 68.4457 54.926 67.936 c
53.3923 68.6816 52.4382 70.0063 51.154 71.0004 c
52.1086 69.9579 53.4499 67.1806 55.1613 67.4657 c
55.1613 67.4657 l
p
55.0432 66.1689 m
54.5305 66.2846 54.3581 66.7402 53.865 66.8759 c
55.4856 63.1069 58.7702 70.2885 59.0495 71.3544 c
57.8152 69.5248 56.8972 67.3798 55.0432 66.1689 c
55.0432 66.1689 l
p
46.4402 76.8935 m
47.2297 76.5102 46.924 74.517 47.0295 73.829 c
49.9978 75.5644 51.8918 71.9858 55.1613 72.2978 c
55.5705 72.3359 55.986 72.7377 56.4577 72.5331 c
55.9411 72.0287 55.1106 71.8364 54.1008 71.8256 c
54.3347 71.0688 55.8054 71.6406 56.4577 71.5903 c
55.4387 70.4863 53.5368 70.7763 52.4504 71.5903 c
52.7268 71.0561 53.7556 70.059 54.6902 70.0575 c
57.5671 70.0551 60.0593 76.4736 63.6472 73.122 c
65.2253 69.829 60.7409 65.6518 62.5847 63.3403 c
62.4616 63.0727 61.8444 63.2953 61.5261 63.2221 c
61.1316 63.8105 60.9831 64.6445 60.8171 65.4618 c
60.4265 64.8442 60.9694 63.6054 60.7019 63.1044 c
60.5046 63.1044 60.3073 63.1044 60.112 63.1044 c
59.864 63.5639 60.0515 64.4599 59.9929 65.1083 c
59.362 64.8759 59.8484 63.5239 59.2859 63.2221 c
58.8288 65.3422 60.9284 67.4457 61.2898 69.704 c
60.2312 67.6205 58.8952 65.8134 58.3444 63.2221 c
57.8484 63.1078 57.3244 63.2831 56.5754 63.2221 c
57.9109 65.6591 59.4206 67.9208 60.4655 70.6474 c
58.9929 68.1122 57.5866 65.5116 55.8684 63.2221 c
54.9895 63.0273 54.4489 63.163 53.6291 63.2221 c
52.4768 65.6835 51.2243 68.0458 49.8576 70.2934 c
50.4548 68.101 52.1999 66.0356 52.5686 63.2221 c
51.5837 63.0229 51.844 64.0688 51.6257 64.6362 c
51.3571 64.1523 51.6574 63.8256 51.508 63.2221 c
51.1775 63.0868 50.8957 63.0868 50.5652 63.2221 c
50.5485 64.018 51.0964 64.849 50.5652 65.4618 c
50.3684 64.5971 50.3064 63.599 49.74 63.1044 c
49.3083 63.1044 48.8757 63.1044 48.4436 63.1044 c
48.7273 64.0893 49.8708 64.8046 49.3864 66.1689 c
49.0666 66.2529 49.4709 65.6132 49.1506 65.6972 c
48.5178 65.8608 48.6672 66.5092 48.4436 67.1117 c
47.7404 69.0102 45.8318 71.5722 47.0295 73.7114 c
46.3908 74.2636 46.2243 75.8764 46.4402 76.8935 c
46.4402 76.8935 l
p
f
97.3524 61.8075 m
96.8214 61.7621 97.4854 61.2524 97.1174 61.1015 c
96.6964 61.0326 96.7584 61.4491 96.7644 61.8075 c
97.9774 62.6977 98.9094 61.4267 99.5924 60.7475 c
100.0924 61.0331 100.8674 61.0434 101.0064 61.6904 c
99.4074 61.9379 96.7004 63.6303 95.4674 62.0439 c
95.0414 62.246 94.8254 62.6576 94.5244 62.9872 c
94.7484 63.6679 95.5804 63.7382 95.9384 64.2836 c
97.4874 63.9062 98.6844 63.1786 100.6534 63.2221 c
100.9384 62.289 101.5244 61.6586 102.1844 61.1015 c
101.5394 60.4496 100.5964 60.0966 99.5924 59.8041 c
99.2824 60.9081 98.7954 61.8373 97.3524 61.8075 c
97.3524 61.8075 l
p
f
79.0864 53.9115 m
79.1314 53.2377 80.2034 52.8451 80.8524 53.4408 c
81.5084 55.1869 78.9964 55.1928 79.0864 53.9115 c
79.0864 53.9115 l
p
83.3284 54.0307 m
83.6194 53.3158 84.5594 53.183 85.0964 53.7944 c
85.1804 54.3901 84.9654 54.685 84.7424 54.9721 c
83.8324 55.0971 83.4854 54.6596 83.3284 54.0307 c
83.3284 54.0307 l
p
84.2724 56.3881 m
83.2914 55.1283 82.1574 54.0248 81.3254 52.6147 c
81.9034 52.7026 82.4244 52.7983 82.9754 52.6147 c
83.3464 53.0444 82.2054 53.4526 82.5024 53.7944 c
82.9424 53.5639 83.2134 53.1694 83.4464 52.7338 c
84.0104 52.6791 84.3834 52.8178 84.6234 53.0873 c
82.7004 52.8451 82.7644 55.0619 83.9184 55.3256 c
85.2894 55.6401 85.8344 53.9233 84.9774 53.0873 c
85.6844 53.2846 86.0414 53.8295 86.2764 54.5014 c
85.5264 55.0483 85.1604 55.9799 84.2724 56.3881 c
84.2724 56.3881 l
p
73.0749 66.2865 m
72.9265 66.2382 72.8347 66.1342 72.8405 65.933 c
72.7624 64.1674 72.9831 62.6982 73.3112 61.3368 c
78.7074 60.9555 85.0594 60.9379 90.4014 61.5727 c
89.8134 62.7543 88.0784 63.808 88.2784 66.1689 c
83.3774 65.996 77.823 66.0439 73.0749 66.2865 c
73.0749 66.2865 l
p
88.9854 68.4076 m
89.1084 68.7177 89.1254 69.1313 89.1024 69.5864 c
87.2724 71.1142 86.7034 67.1874 88.9854 68.4076 c
88.9854 68.4076 l
p
90.4014 70.7646 m
90.4944 71.2597 91.0324 71.3124 91.1084 71.8256 c
90.1294 73.4765 88.2604 70.9257 90.4014 70.7646 c
90.4014 70.7646 l
p
94.1704 73.3573 m
90.2504 71.6606 85.9924 63.8954 92.1684 61.4545 c
93.2054 64.9736 94.3264 69.0375 94.1704 73.3573 c
94.1704 73.3573 l
p
93.2274 73.3573 m
93.2154 73.5014 93.1944 73.6371 92.9924 73.5932 c
87.0224 72.391 79.5534 72.5068 73.5476 73.3573 c
72.9069 72.1904 73.1843 70.1054 72.9577 68.5258 c
74.2683 69.6904 75.3386 71.7231 76.6101 72.5331 c
76.0944 71.748 75.5183 71.0019 74.8425 70.1762 c
74.0964 69.2626 72.8874 68.455 72.9577 67.1117 c
75.7077 66.623 79.0754 66.3984 82.2684 66.4042 c
84.2994 66.4081 86.3034 66.5336 88.1604 66.7587 c
87.8954 67.5541 86.7354 68.08 86.7464 68.7616 c
87.3074 68.3007 87.6194 67.5932 88.2784 67.2289 c
88.4074 67.4228 88.9164 67.8368 88.6314 68.0546 c
85.8254 67.5707 88.0784 71.8866 89.4574 69.4687 c
89.7114 70.1669 88.6434 70.3197 88.6314 71.1186 c
89.1764 70.9164 89.1764 70.1708 89.8094 70.0575 c
89.7914 70.3915 90.1644 70.3324 90.1644 70.6474 c
87.9594 70.7162 90.2744 73.9447 91.4594 71.9438 c
91.6554 72.4989 90.8304 72.6401 91.1084 72.8862 c
91.4774 72.9032 91.5124 72.5839 91.5784 72.2978 c
92.2234 72.5551 92.5434 73.1371 93.2274 73.3573 c
93.2274 73.3573 l
p
90.8714 61.2187 m
85.5164 60.6884 79.1454 60.5746 73.5476 60.9828 c
73.198 60.0737 73.8034 59.0834 74.1355 58.2729 c
74.4734 57.4506 74.739 56.2592 75.5495 56.269 c
75.987 56.7631 74.5749 56.8998 74.9616 57.3295 c
75.3894 57.2475 75.4538 56.8022 75.903 56.7397 c
76.989 57.894 77.7155 59.4076 79.0864 60.2763 c
78.0241 58.7045 76.7468 57.351 75.5495 55.9155 c
75.8913 54.9194 76.6843 54.3783 77.5534 53.9115 c
79.6174 55.894 81.1174 58.4408 83.2114 60.3945 c
81.6514 57.9467 79.5694 56.0209 77.9069 53.6752 c
78.5514 53.7826 78.5754 53.0502 79.3214 52.9682 c
79.3874 53.2983 78.8194 53.5463 78.8504 54.0307 c
79.0144 56.517 83.0494 53.8803 80.2644 52.7338 c
81.2414 52.5326 81.7874 53.6674 82.2684 54.2651 c
84.0244 56.4545 85.6234 58.8471 87.5714 60.6298 c
86.7034 59.101 85.3254 58.0834 84.5064 56.5053 c
85.1274 55.9076 85.9244 55.4858 86.2764 54.6186 c
88.0184 56.8197 90.3774 57.976 90.8714 61.2187 c
90.8714 61.2187 l
p
86.2764 53.9115 m
87.5634 53.9096 87.3264 55.9623 88.5144 55.6791 c
88.7414 55.9682 88.9924 56.3022 88.7484 56.7397 c
89.5164 56.4819 89.6064 57.7143 89.9284 58.2729 c
88.4754 57.0522 87.3894 55.4682 86.2764 53.9115 c
86.2764 53.9115 l
p
64.4714 36.117 m
70.1042 38.027 75.3933 40.2807 79.6744 43.5405 c
83.5184 47.2416 87.4164 50.8842 89.8094 56.0326 c
87.8994 53.8178 85.0714 51.7182 81.5594 51.7905 c
72.1569 51.9858 71.3405 64.5634 72.9577 74.183 c
77.0319 73.8285 81.1414 73.1532 85.0964 73.3573 c
85.5044 73.3788 85.8774 73.6864 86.2764 73.7114 c
87.2274 73.7704 88.3384 73.5087 89.3384 73.5932 c
90.9794 73.7328 92.5924 74.1747 94.1704 74.4184 c
94.5184 78.4203 93.3664 82.3451 92.2854 85.7323 c
88.9734 96.1279 82.2974 103.7118 73.3112 108.3603 c
73.2155 108.3832 73.1941 108.4784 73.0749 108.4784 c
73.1277 108.5834 73.1784 108.6894 73.3112 108.7143 c
73.4109 108.7358 73.4226 108.6684 73.4284 108.5966 c
80.3344 105.2504 85.5984 100.0575 89.4574 93.3935 c
93.3384 86.6864 95.6374 78.2695 94.2894 68.4076 c
93.1144 59.81 89.1534 52.6362 84.1534 47.3119 c
79.0374 41.8647 72.6042 37.648 64.4714 36.117 c
64.4714 36.117 l
p
f
grestore
88.5144 60.0405 m
88.0304 60.099 88.2824 59.7924 87.6904 59.8041 c
86.8854 56.3979 90.8464 59.7572 88.5144 60.0405 c
88.5144 60.0405 l
p
89.3384 59.9233 m
89.4424 59.4643 89.5474 58.8256 89.3384 58.3901 c
86.9164 56.6381 86.8254 61.706 89.3384 59.9233 c
89.3384 59.9233 l
p
f
85.5674 56.5053 m
86.0574 54.6518 88.3154 57.1811 86.8644 57.683 c
86.1144 57.9428 85.3734 57.2338 85.5674 56.5053 c
85.5674 56.5053 l
p
86.8644 57.683 m
87.8754 57.1967 87.6884 55.6694 86.6274 55.5619 c
84.9894 55.3959 85.0474 58.5561 86.8644 57.683 c
86.8644 57.683 l
p
f
gsave
57.7175 138.726 m
57.7175 42.3354 l
134.2524 42.3354 l
134.2524 138.726 l
57.7175 138.726 l
clp
68.2429 56.5053 m
67.2819 56.7358 65.9069 56.6362 65.2976 56.1518 c
65.3796 56.0405 65.8503 56.228 66.0046 55.9155 c
65.9519 53.8862 65.5573 52.1967 64.9421 50.7299 c
64.5534 50.5365 64.0437 50.6108 63.7644 50.849 c
64.3972 52.1811 64.9499 53.5893 65.0612 55.4447 c
64.6003 55.6069 64.7878 54.7397 64.7077 54.2651 c
63.5202 52.4877 61.3093 53.8862 60.7019 55.3256 c
60.8952 55.81 61.3093 56.3979 61.8796 56.1518 c
62.1765 55.8197 61.5378 55.7084 61.5261 55.3256 c
61.7898 55.5951 62.8874 55.5033 63.1745 54.8549 c
64.778 55.5307 65.2859 57.3002 67.7722 57.0951 c
67.8503 56.8197 68.3894 57.0053 68.2429 56.5053 c
68.2429 56.5053 l
p
f
66.3581 42.0112 m
66.2859 42.3979 65.8269 42.3803 65.3679 42.3725 c
65.2585 42.3725 65.1609 42.3627 65.0612 42.3627 c
64.9987 43.9115 66.0515 43.8569 67.3737 43.8022 c
67.653 43.7846 67.9499 43.7768 68.2468 43.7768 c
67.5984 42.7221 66.5378 42.1108 66.0066 40.9506 c
65.7722 41.1928 66.3132 41.6518 66.3581 42.0112 c
f
56.3396 115.1957 m
55.967 115.0341 55.946 115.1703 55.5153 115.1957 c
55.3635 114.8246 56.4919 114.8246 56.3396 115.1957 c
56.3396 115.1957 l
p
55.8684 115.5497 m
56.6306 115.603 56.5979 116.5165 56.2224 116.8461 c
56.405 117.0165 56.7717 117.0033 56.9294 117.2001 c
56.7902 117.3354 56.5129 117.3334 56.2224 117.3173 c
55.9275 116.9052 56.3523 115.7729 55.8684 115.5497 c
55.8684 115.5497 l
p
54.6902 117.2001 m
54.5207 116.832 55.5661 116.832 55.3967 117.2001 c
55.3474 117.4623 54.7717 117.2919 54.6902 117.2001 c
54.6902 117.2001 l
p
53.7468 116.8461 m
54.3791 116.6464 53.927 117.5307 54.218 117.6713 c
54.9807 117.8744 57.1457 118.5815 57.2824 117.3173 c
57.7116 117.2031 57.3371 117.8915 57.8718 117.6713 c
58.0515 116.9799 57.4675 117.0541 57.2824 116.728 c
57.4187 115.5326 56.9875 114.9023 56.5754 114.2533 c
54.5905 114.0751 54.3825 115.6738 53.7468 116.8461 c
53.7468 116.8461 l
p
f
63.6472 116.728 m
63.3464 116.7905 63.2351 116.8847 63.0573 116.6103 c
63.6277 116.5834 63.0241 116.2367 62.9402 116.1391 c
63.3112 116.1176 63.3386 115.7514 63.2937 115.3139 c
64.1179 116.6103 m
64.614 116.7597 65.1042 116.3027 65.1804 116.728 c
64.862 117.0195 64.4109 116.9135 64.1179 116.6103 c
64.1179 116.6103 l
p
62.2331 117.3173 m
62.6218 119.915 67.0085 119.6777 66.8288 117.0815 c
66.2585 118.0239 63.7019 117.9804 62.7038 117.4355 c
63.4128 117.3495 64.5573 117.6625 65.4148 117.4355 c
65.8698 117.3149 65.9948 116.8427 66.3581 116.9638 c
65.7624 115.7255 65.489 113.6655 64.0007 113.8993 c
62.655 114.1117 63.0359 116.2817 62.2331 117.3173 c
62.2331 117.3173 l
p
f
56.4577 83.9648 m
56.4192 84.4018 55.1521 84.224 54.926 84.0824 c
55.2248 83.8896 56.0217 84.2621 56.4577 83.9648 c
56.4577 83.9648 l
p
55.3967 84.7895 m
55.6721 84.7895 55.947 84.7895 56.2224 84.7895 c
56.1521 85.0336 56.3679 85.5639 56.1042 85.6147 c
56.2468 84.9618 55.5246 85.1728 55.3967 84.7895 c
55.3967 84.7895 l
p
56.5754 86.5575 m
56.7844 86.4516 56.9196 86.2729 57.1652 86.204 c
57.2024 86.4804 57.53 86.4677 57.6374 86.6757 c
57.3913 86.8857 56.8303 86.6982 56.5754 86.5575 c
56.5754 86.5575 l
p
53.7468 86.6757 m
54.1501 86.7636 53.8967 86.1967 54.3366 86.3217 c
54.6364 86.3364 54.7937 86.4931 54.8078 86.7934 c
54.3122 86.643 53.8225 87.1005 53.7468 86.6757 c
53.7468 86.6757 l
p
56.3396 87.1469 m
56.5793 87.663 57.4226 87.3339 57.7546 87.5004 c
57.5554 88.1464 55.8762 87.8012 56.3396 87.1469 c
56.3396 87.1469 l
p
53.6291 87.5004 m
54.0027 87.6645 54.6706 87.6645 55.0432 87.5004 c
55.1892 87.8813 54.6623 87.5903 54.8078 87.9721 c
54.1799 88.0497 53.7761 87.9032 53.6291 87.5004 c
53.6291 87.5004 l
p
52.9226 88.2079 m
54.5603 89.185 56.8288 88.9106 58.4616 88.0898 c
58.5144 85.8759 57.5495 82.2397 55.279 82.6679 c
53.487 83.0068 52.6086 85.5683 52.9226 88.2079 c
52.9226 88.2079 l
p
f
grestore
66.3581 63.8114 m
66.8269 63.8764 66.7136 63.8764 67.1823 63.8114 c
67.3347 64.184 66.2058 64.184 66.3581 63.8114 c
66.3581 63.8114 l
p
67.1823 65.579 m
67.1784 65.4169 67.239 65.3207 67.2995 65.226 c
67.6843 65.1952 67.8679 65.3656 67.8894 65.6972 c
67.5984 65.7128 67.321 65.7153 67.1823 65.579 c
67.1823 65.579 l
p
67.0652 65.933 m
67.3581 66.0322 67.696 66.0873 68.1257 66.0507 c
68.0417 66.5541 67.0339 66.4882 67.0652 65.933 c
67.0652 65.933 l
p
66.1218 65.933 m
65.9714 65.769 65.5437 65.8818 65.5319 65.579 c
66.4538 65.811 66.0339 63.6513 66.8288 64.5185 c
65.9343 64.6313 66.5866 65.5658 66.3581 66.2865 c
66.2058 66.4491 65.8464 66.4028 65.5319 66.4042 c
65.4187 65.936 66.1902 66.3564 66.1218 65.933 c
66.1218 65.933 l
p
68.9499 67.5834 m
69.1374 65.3339 68.9206 62.332 66.0046 63.2221 c
65.153 64.0595 65.2624 65.8588 65.2976 67.5834 c
66.2644 68.0541 67.4851 67.6435 68.9499 67.5834 c
68.9499 67.5834 l
p
f
53.0617 104.4125 m
45.7287 104.4125 l
45.7287 100.5981 l
50.5485 100.5981 l
50.7258 100.0658 50.8147 99.4155 50.8147 98.7651 c
50.8147 96.2514 49.1882 94.5365 46.2312 94.5365 c
43.1858 94.5365 41.4704 96.5175 41.4704 99.2084 c
41.4704 100.6869 41.7663 102.0473 42.3278 103.4072 c
39.0456 104.1171 l
38.5134 102.4609 38.2771 100.7753 38.2771 99.1196 c
38.2771 93.6786 41.9436 90.4853 46.5271 90.4853 c
51.613 90.4853 54.1858 93.8857 54.1858 98.4394 c
54.1858 100.6279 53.7717 102.5795 53.0617 104.4125 c
53.0617 104.4125 l
p
43.2741 85.1274 m
44.5456 85.1274 45.4035 84.1811 45.4035 82.7026 c
45.4035 82.2885 45.4035 81.8154 45.344 81.4311 c
41.4113 81.4311 l
41.382 81.7861 41.3523 82.1703 41.3523 82.5844 c
41.3523 84.1513 42.0617 85.1274 43.2741 85.1274 c
43.2741 85.1274 l
p
53.9196 90.0063 m
48.9519 86.6059 l
48.301 86.162 47.6799 85.7485 47.2663 85.4526 c
46.7341 87.6703 45.2556 89.1786 42.8899 89.1786 c
39.9035 89.1786 38.4543 86.9311 38.4543 83.1459 c
38.4543 81.1947 38.4841 78.8583 38.5432 77.6166 c
53.9196 77.6166 l
53.9196 81.4311 l
47.9167 81.4311 l
47.9167 81.579 l
53.9196 85.3637 l
53.9196 90.0063 l
53.9196 90.0063 l
p
47.9758 74.4228 m
38.5432 74.4228 l
38.5432 70.6679 l
47.5027 70.6679 l
49.7204 70.6679 51.0217 69.7509 51.0217 67.415 c
51.0217 65.2563 50.0163 64.1327 47.6506 64.1327 c
38.5432 64.1327 l
38.5432 60.3183 l
48.508 60.3183 l
51.9973 60.3183 54.1858 62.5361 54.1858 67.2079 c
54.1858 72.2646 51.406 74.4228 47.9758 74.4228 c
47.9758 74.4228 l
p
49.1291 53.7358 m
50.4006 53.7358 51.258 52.8783 51.258 51.0151 c
51.258 50.4252 51.2287 49.8334 51.1696 49.3901 c
47.2365 49.3901 l
47.2072 49.7729 47.2072 50.3647 47.2072 50.6908 c
47.2072 52.6127 47.7688 53.7358 49.1291 53.7358 c
49.1291 53.7358 l
p
42.8601 53.4994 m
44.1911 53.4994 44.8415 52.2865 44.8415 50.4838 c
44.8415 50.2768 44.8415 49.8334 44.8117 49.3901 c
41.1452 49.3901 l
41.1452 49.892 41.1154 50.5131 41.1154 50.9858 c
41.1154 52.9076 41.8254 53.4994 42.8601 53.4994 c
42.8601 53.4994 l
p
49.1291 57.7572 m
47.4734 57.7572 46.1721 56.8998 45.6989 55.185 c
45.6696 55.185 l
45.0778 56.7221 43.7771 57.5502 42.2985 57.5502 c
39.8737 57.5502 38.4543 55.8647 38.4543 51.726 c
38.4543 49.685 38.5432 47.1713 38.5432 45.6049 c
53.9196 45.6049 l
53.9196 47.9701 53.9787 49.9799 53.9787 51.1049 c
53.9787 56.1615 51.4358 57.7572 49.1291 57.7572 c
49.1291 57.7572 l
p
53.9768 42.353 m
38.486 42.353 l
38.486 38.371 l
53.9768 38.371 l
53.9768 42.353 l
p
53.9196 35.611 m
50.8737 35.611 l
50.8737 29.962 l
47.5027 29.962 l
47.5027 35.343 l
44.6047 35.343 l
44.6047 29.962 l
41.5295 29.962 l
41.5295 35.611 l
38.5432 35.611 l
38.5432 26.148 l
53.9196 26.148 l
53.9196 35.611 l
p
43.2741 19.456 m
44.5456 19.456 45.4035 18.509 45.4035 17.033 c
45.4035 16.619 45.4035 16.144 45.344 15.759 c
41.4113 15.759 l
41.382 16.115 41.3523 16.499 41.3523 16.913 c
41.3523 18.48 42.0617 19.456 43.2741 19.456 c
43.2741 19.456 l
p
53.9196 24.335 m
48.9519 20.935 l
48.301 20.492 47.6799 20.078 47.2663 19.783 c
46.7341 21.999 45.2556 23.507 42.8899 23.507 c
39.9035 23.507 38.4543 21.259 38.4543 17.474 c
38.4543 15.523 38.4841 13.187 38.5432 11.947 c
53.9196 11.947 l
53.9196 15.759 l
47.9167 15.759 l
47.9167 15.908 l
53.9196 19.693 l
53.9196 24.335 l
53.9196 24.335 l
p
41.5295 9.693 m
38.5432 9.693 l
38.5432 .378 l
53.9196 .378 l
53.9196 4.193 l
47.7985 4.193 l
47.7985 9.396 l
44.8708 9.396 l
44.8708 4.193 l
41.5295 4.193 l
41.5295 9.693 l
p
1 .75 0 0 k
f
34.7234 42.353 m
19.26 42.353 l
19.2536 38.371 l
34.7258 38.371 l
34.7234 42.353 l
p
34.718 33.451 m
19.2424 33.451 l
19.2424 29.73 l
25.76 29.759 l
27.3674 29.759 28.6467 29.788 29.5695 29.849 c
29.5695 29.82 l
28.5276 29.343 27.5456 28.806 26.6233 28.212 c
19.2424 23.718 l
19.2424 18.57 l
34.718 18.57 l
34.718 22.259 l
27.0695 22.259 l
25.8493 22.259 25.0754 22.23 24.3318 22.171 c
24.3318 22.201 l
25.1945 22.587 26.2956 23.122 27.1589 23.66 c
34.718 28.3 l
34.718 33.451 l
34.718 33.451 l
p
28.736 14.206 m
19.2424 14.206 l
19.2424 10.425 l
28.26 10.425 l
30.4919 10.425 31.8015 9.503 31.8015 7.154 c
31.8015 4.98 30.7893 3.849 28.4089 3.849 c
19.2424 3.849 l
19.2424 .009 l
29.2717 .009 l
32.7834 .009 34.986 2.242 34.986 6.945 c
34.986 12.033 32.1882 14.206 28.736 14.206 c
28.736 14.206 l
p
f
73.2683 38.367 m
57.7175 38.367 l
57.7175 42.3354 l
73.2683 42.3354 l
73.2683 38.367 l
0 1 .8 .2 k
f
15.5612 38.367 m
0.009 38.367 l
0.009 42.3354 l
15.5612 42.3354 l
15.5612 38.367 l
f
grestore
grestore
end
restore
showpage
%%EOF
