%!PS-Adobe-3.0 EPSF-3.0
%%BoundingBox: 0 0 48 69
%%HiResBoundingBox: 0 0 47.826 68.3441
%%Title: ufcd-logo-e1-tiny-black
%%CreationDate: 2009-12-08T12:58+0100
%%Creator: Project ufcd
%%LanguageLevel: 2
%%DocumentData: Clean7Bit
%%Pages: 1
%%EndComments
%%Page: 1 1
save
0 0 47.826 68.3441 rectclip
9 dict begin
/k{setcmykcolor}bind def
/p{closepath}bind def
/c{curveto}bind def
/f{fill}bind def
/l{lineto}bind def
/m{moveto}bind def
/s{setoverprint}bind def
27.1035 6.3781 m
25.1484 6.3781 l
25.1484 .2853 l
35.207 .2853 l
35.207 2.7804 l
31.2031 2.7804 l
31.2031 6.1847 l
29.2891 6.1847 l
29.2891 2.7804 l
27.1035 2.7804 l
p
35.207 15.9562 m
31.958 13.7326 l
31.5313 13.4415 31.126 13.171 30.8555 12.9767 c
30.5068 14.4279 29.54 15.4142 27.9922 15.4142 c
26.0391 15.4142 25.0908 13.9445 25.0908 11.4689 c
25.0908 10.1925 25.1113 8.6642 25.1484 7.8517 c
35.207 7.8517 l
35.207 10.3468 l
31.2813 10.3468 l
31.2813 10.4435 l
35.207 12.9191 l
35.207 15.9562 l
p
28.2441 12.7638 m
29.0762 12.7638 29.6367 12.1447 29.6367 11.1779 c
29.6367 10.9083 29.6367 10.5978 29.5977 10.3468 c
27.0254 10.3468 l
27.0059 10.5792 26.9863 10.8302 26.9863 11.1007 c
26.9863 12.1261 27.4512 12.7638 28.2441 12.7638 c
35.207 23.3312 m
33.2148 23.3312 l
33.2148 19.6359 l
31.0098 19.6359 l
31.0098 23.1574 l
29.1152 23.1574 l
29.1152 19.6359 l
27.1035 19.6359 l
27.1035 23.3312 l
25.1484 23.3312 l
25.1484 17.1408 l
35.207 17.1408 l
p
35.2441 27.7413 m
25.1113 27.7413 l
25.1113 25.1349 l
35.2441 25.1349 l
p
32.0742 37.8175 m
30.9902 37.8175 30.1396 37.257 29.8301 36.1349 c
29.8105 36.1349 l
29.4238 37.1408 28.5723 37.6818 27.6055 37.6818 c
26.0195 37.6818 25.0908 36.5802 25.0908 33.8722 c
25.0908 32.5372 25.1484 30.8927 25.1484 29.8683 c
35.207 29.8683 l
35.207 31.4152 35.2461 32.7316 35.2461 33.466 c
35.2461 36.7736 33.582 37.8175 32.0742 37.8175 c
27.9727 35.0324 m
28.8438 35.0324 29.2695 34.2394 29.2695 33.0587 c
29.2695 32.924 29.2695 32.6339 29.25 32.3439 c
26.8516 32.3439 l
26.8516 32.673 26.832 33.0792 26.832 33.3878 c
26.832 34.6447 27.2959 35.0324 27.9727 35.0324 c
32.0742 35.1867 m
32.9063 35.1867 33.4658 34.6261 33.4658 33.4083 c
33.4658 33.0206 33.4473 32.6339 33.4082 32.3439 c
30.8359 32.3439 l
30.8164 32.5949 30.8164 32.9826 30.8164 33.1955 c
30.8164 34.4523 31.1836 35.1867 32.0742 35.1867 c
31.3203 48.7179 m
25.1484 48.7179 l
25.1484 46.2619 l
31.0098 46.2619 l
32.4609 46.2619 33.3125 45.6622 33.3125 44.1339 c
33.3125 42.7218 32.6543 41.9874 31.1074 41.9874 c
25.1484 41.9874 l
25.1484 39.4923 l
31.668 39.4923 l
33.9492 39.4923 35.3809 40.9435 35.3809 43.9992 c
35.3809 47.3058 33.5625 48.7179 31.3203 48.7179 c
35.207 58.9113 m
31.958 56.6867 l
31.5313 56.3976 31.126 56.1261 30.8555 55.9328 c
30.5068 57.383 29.54 58.3703 27.9922 58.3703 c
26.0391 58.3703 25.0908 56.9005 25.0908 54.424 c
25.0908 53.1486 25.1113 51.6203 25.1484 50.8068 c
35.207 50.8068 l
35.207 53.3019 l
31.2813 53.3019 l
31.2813 53.3996 l
35.207 55.8751 l
35.207 58.9113 l
p
28.2441 55.7199 m
29.0762 55.7199 29.6367 55.1007 29.6367 54.1339 c
29.6367 53.8634 29.6367 53.5538 29.5977 53.3019 c
27.0254 53.3019 l
27.0059 53.5343 26.9863 53.7863 26.9863 54.0568 c
26.9863 55.0822 27.4512 55.7199 28.2441 55.7199 c
34.6465 68.3351 m
29.8496 68.3351 l
29.8496 65.84 l
33.002 65.84 l
33.1172 65.4914 33.1758 65.0666 33.1758 64.6398 c
33.1758 62.9963 32.1133 61.8742 30.1777 61.8742 c
28.1855 61.8742 27.0645 63.1701 27.0645 64.9299 c
27.0645 65.8986 27.2578 66.7873 27.625 67.6769 c
25.4785 68.1408 l
25.1299 67.0578 24.9746 65.9562 24.9746 64.8722 c
24.9746 61.3146 27.374 59.2248 30.3711 59.2248 c
33.6992 59.2248 35.3809 61.4494 35.3809 64.4279 c
35.3809 65.8595 35.1094 67.1349 34.6465 68.3351 c
true s
0 0 0 1 k
f
18.7661 9.3126 m
12.5444 9.3126 l
12.5444 6.8361 l
18.4541 6.8361 l
19.9175 6.8361 20.7754 6.2306 20.7754 4.6896 c
20.7754 3.2658 20.1123 2.5246 18.5513 2.5246 c
12.5444 2.5246 l
12.5444 .0089 l
19.1172 .0089 l
21.4194 .0089 22.8623 1.4718 22.8623 4.5538 c
22.8623 7.8888 21.0293 9.3126 18.7661 9.3126 c
22.6875 21.9259 m
12.5444 21.9259 l
12.5444 19.4874 l
16.8154 19.507 l
17.8691 19.507 18.7075 19.5265 19.3125 19.5656 c
19.3125 19.546 l
18.6294 19.2335 17.9863 18.883 17.3813 18.4933 c
12.5444 15.548 l
12.5444 12.173 l
22.6875 12.173 l
22.6875 14.5919 l
17.6743 14.5919 l
16.8745 14.5919 16.3672 14.5724 15.8794 14.5333 c
15.8794 14.5529 l
16.4453 14.8058 17.1675 15.1574 17.7324 15.5089 c
22.6875 18.5509 l
22.6875 21.9259 l
p
22.6904 27.7609 m
12.5552 27.7609 l
12.5513 25.1505 l
22.6924 25.1505 l
p
f
47.817 25.1621 m
37.665 25.1621 l
37.665 27.7631 l
47.817 27.7631 l
47.817 25.1621 l
false s
f
10.161 25.1621 m
0 25.1621 l
0 27.7631 l
10.161 27.7631 l
10.161 25.1621 l
false s
f
end
restore
showpage
%%EOF
