%!PS-Adobe-3.0 EPSF-3.0
%%BoundingBox: 0 0 96 136
%%HiResBoundingBox: 0 0 95.148 135.6209
%%Title: ufcd-logo-e1-emblemless-black
%%CreationDate: 2009-12-08T12:58+0100
%%Creator: Project ufcd
%%LanguageLevel: 2
%%DocumentData: Clean7Bit
%%Pages: 1
%%EndComments
%%Page: 1 1
save
0 0 95.148 135.6209 rectclip
9 dict begin
/k{setcmykcolor}bind def
/p{closepath}bind def
/c{curveto}bind def
/f{fill}bind def
/l{lineto}bind def
/m{moveto}bind def
/s{setoverprint}bind def
53.9688 12.5859 m
50.0898 12.5859 l
50.0898 .4879 l
70.0625 .4879 l
70.0625 5.4429 l
62.1113 5.4429 l
62.1113 12.2019 l
58.3086 12.2019 l
58.3086 5.4429 l
53.9688 5.4429 l
p
70.0625 31.6059 m
63.6094 27.1879 l
62.7646 26.6129 61.958 26.0759 61.4199 25.6909 c
60.7285 28.5719 58.8076 30.5309 55.7363 30.5309 c
51.8574 30.5309 49.9746 27.6119 49.9746 22.6959 c
49.9746 20.1599 50.0127 17.1249 50.0898 15.5119 c
70.0625 15.5119 l
70.0625 20.4669 l
62.2646 20.4669 l
62.2646 20.6599 l
70.0625 25.5759 l
70.0625 31.6059 l
p
56.2344 25.2679 m
57.8867 25.2679 59 24.0389 59 22.1179 c
59 21.5809 59 20.9659 58.9238 20.4669 c
53.8145 20.4669 l
53.7773 20.9279 53.7383 21.4269 53.7383 21.9649 c
53.7383 23.9999 54.6602 25.2679 56.2344 25.2679 c
70.0625 46.2502 m
66.1055 46.2502 l
66.1055 38.9143 l
61.7266 38.9143 l
61.7266 45.9055 l
57.9629 45.9055 l
57.9629 38.9143 l
53.9688 38.9143 l
53.9688 46.2502 l
50.0898 46.2502 l
50.0898 33.9599 l
70.0625 33.9599 l
p
70.1357 55.009 m
50.0146 55.009 l
50.0146 49.8352 l
70.1357 49.8352 l
p
63.8398 75.0178 m
61.6895 75.0178 59.999 73.9045 59.3848 71.676 c
59.3457 71.676 l
58.5781 73.6731 56.8877 74.7492 54.9678 74.7492 c
51.8184 74.7492 49.9746 72.5598 49.9746 67.1819 c
49.9746 64.5325 50.0898 61.2678 50.0898 59.2326 c
70.0625 59.2326 l
70.0625 62.3049 70.1387 64.9162 70.1387 66.3762 c
70.1387 72.9446 66.8359 75.0178 63.8398 75.0178 c
55.6973 69.4875 m
57.4258 69.4875 58.2715 67.9123 58.2715 65.5696 c
58.2715 65.3 58.2715 64.7239 58.2324 64.1487 c
53.4697 64.1487 l
53.4697 64.801 53.4307 65.6086 53.4307 66.2219 c
53.4307 68.719 54.3535 69.4875 55.6973 69.4875 c
63.8398 69.7942 m
65.4922 69.7942 66.6055 68.6799 66.6055 66.261 c
66.6055 65.4924 66.5664 64.7239 66.4902 64.1487 c
61.3818 64.1487 l
61.3428 64.6477 61.3428 65.4162 61.3428 65.8381 c
61.3428 68.3352 62.0723 69.7942 63.8398 69.7942 c
62.3418 96.6643 m
50.0898 96.6643 l
50.0898 91.7873 l
61.7266 91.7873 l
64.6074 91.7873 66.2979 90.5964 66.2979 87.5622 c
66.2979 84.758 64.9922 83.2981 61.9199 83.2981 c
50.0898 83.2981 l
50.0898 78.344 l
63.0332 78.344 l
67.5664 78.344 70.4082 81.2243 70.4082 87.2932 c
70.4082 93.8611 66.7969 96.6643 62.3418 96.6643 c
70.0625 116.906 m
63.6094 112.489 l
62.7646 111.9123 61.958 111.3752 61.4199 110.9914 c
60.7285 113.8713 58.8076 115.8303 55.7363 115.8303 c
51.8574 115.8303 49.9746 112.9114 49.9746 107.9953 c
49.9746 105.4602 50.0127 102.426 50.0898 100.8122 c
70.0625 100.8122 l
70.0625 105.7673 l
62.2646 105.7673 l
62.2646 105.9592 l
70.0625 110.8752 l
70.0625 116.906 l
p
56.2344 110.5681 m
57.8867 110.5681 59 109.3391 59 107.4192 c
59 106.8811 59 106.2663 58.9238 105.7673 c
53.8145 105.7673 l
53.7773 106.2283 53.7383 106.7273 53.7383 107.2654 c
53.7383 109.301 54.6602 110.5681 56.2344 110.5681 c
68.9473 135.6184 m
59.4229 135.6184 l
59.4229 130.6633 l
65.6836 130.6633 l
65.9141 129.9724 66.0293 129.1272 66.0293 128.2825 c
66.0293 125.0173 63.917 122.7903 60.0762 122.7903 c
56.1191 122.7903 53.8916 125.363 53.8916 128.8582 c
53.8916 130.7791 54.2754 132.5452 55.0059 134.3123 c
50.7422 135.2341 l
50.0508 133.0833 49.7441 130.8943 49.7441 128.7434 c
49.7441 121.676 54.5068 117.5281 60.46 117.5281 c
67.0664 117.5281 70.4082 121.945 70.4082 127.8591 c
70.4082 130.7024 69.8691 133.2371 68.9473 135.6184 c
true s
0 0 0 1 k
f
37.3159 18.4489 m
24.9849 18.4489 l
24.9849 13.5389 l
36.6978 13.5389 l
39.5967 13.5389 41.2979 12.3399 41.2979 9.2869 c
41.2979 6.4649 39.9829 4.9959 36.8906 4.9959 c
24.9849 4.9959 l
24.9849 .0089 l
38.0117 .0089 l
42.5728 .0089 45.4336 2.9089 45.4336 9.0159 c
45.4336 15.6259 41.7998 18.4489 37.3159 18.4489 c
45.0859 43.4436 m
24.9849 43.4436 l
24.9849 38.6116 l
33.4497 38.6506 l
35.5376 38.6506 37.1997 38.6897 38.3979 38.7668 c
38.3979 38.7278 l
37.0449 38.1096 35.77 37.4143 34.5708 36.6408 c
24.9849 30.8039 l
24.9849 24.1169 l
45.0859 24.1169 l
45.0859 28.9099 l
35.1509 28.9099 l
33.5659 28.9099 32.561 28.8709 31.5947 28.7939 c
31.5947 28.8319 l
32.7158 29.3349 34.146 30.0319 35.2666 30.7269 c
45.0859 36.7571 l
45.0859 43.4436 l
p
45.0928 55.009 m
25.0078 55.009 l
24.999 49.8362 l
45.0957 49.8362 l
p
f
95.1445 55.01 m
75.0234 55.01 l
75.0234 49.8362 l
95.1445 49.8362 l
p
true s
0 0 0 1 k
f
20.1021 55.009 m
0 55.009 l
0 49.8352 l
20.1021 49.8352 l
p
f
end
restore
showpage
%%EOF
