%!PS-Adobe-3.0 EPSF-3.0
%%BoundingBox: 0 0 68 97
%%HiResBoundingBox: 0 0 67.446 96.4529
%%Title: ufcd-logo-e2-a4-gray
%%CreationDate: 2009-12-08T12:58+0100
%%Creator: Project ufcd
%%LanguageLevel: 2
%%DocumentData: Clean7Bit
%%Pages: 1
%%EndComments
%%Page: 1 1
save
0 0 67.446 96.4529 rectclip
9 dict begin
/k{setcmykcolor}bind def
/p{closepath}bind def
/c{curveto}bind def
/f{fill}bind def
/l{lineto}bind def
/m{moveto}bind def
/s{setoverprint}bind def
38.2275 9.0363 m
35.4717 9.0363 l
35.4717 .4416 l
49.6602 .4416 l
49.6602 3.9611 l
44.0127 3.9611 l
44.0127 8.7638 l
41.3105 8.7638 l
41.3105 3.9611 l
38.2275 3.9611 l
p
49.6602 22.549 m
45.0762 19.4103 l
44.4756 19.0001 43.9023 18.6183 43.5205 18.3468 c
43.0293 20.3927 41.666 21.7843 39.4824 21.7843 c
36.7266 21.7843 35.3896 19.7101 35.3896 16.2179 c
35.3896 14.4162 35.418 12.2619 35.4717 11.1154 c
49.6602 11.1154 l
49.6602 14.6359 l
44.1211 14.6359 l
44.1211 14.7716 l
49.6602 18.2648 l
49.6602 22.549 l
p
39.8379 18.0451 m
41.0107 18.0451 41.8008 17.173 41.8008 15.8087 c
41.8008 15.4269 41.8008 14.9894 41.748 14.6359 c
38.1191 14.6359 l
38.0918 14.9621 38.0635 15.3175 38.0635 15.6994 c
38.0635 17.1457 38.7188 18.0451 39.8379 18.0451 c
49.6602 32.9513 m
46.8496 32.9513 l
46.8496 27.7404 l
43.7393 27.7404 l
43.7393 32.7062 l
41.0654 32.7062 l
41.0654 27.7404 l
38.2275 27.7404 l
38.2275 32.9513 l
35.4717 32.9513 l
35.4717 24.2208 l
49.6602 24.2208 l
p
49.7236 39.1798 m
35.418 39.175 l
35.418 35.4982 l
49.7236 35.4943 l
p
45.2393 53.3888 m
43.7109 53.3888 42.5117 52.5978 42.0742 51.0148 c
42.0469 51.0148 l
41.502 52.4337 40.3008 53.1974 38.9365 53.1974 c
36.6992 53.1974 35.3896 51.6427 35.3896 47.8224 c
35.3896 45.9396 35.4717 43.6203 35.4717 42.175 c
49.6602 42.175 l
49.6602 44.3576 49.7148 46.2121 49.7148 47.2492 c
49.7148 51.9152 47.3691 53.3888 45.2393 53.3888 c
39.4551 49.4591 m
40.6836 49.4591 41.2832 48.341 41.2832 46.6769 c
41.2832 46.4855 41.2832 46.0763 41.2559 45.6662 c
37.873 45.6662 l
37.873 46.131 37.8457 46.7033 37.8457 47.1408 c
37.8457 48.9132 38.5 49.4591 39.4551 49.4591 c
45.2393 49.6779 m
46.4141 49.6779 47.2051 48.8869 47.2051 47.1671 c
47.2051 46.6212 47.1777 46.0763 47.123 45.6662 c
43.4941 45.6662 l
43.4668 46.0216 43.4668 46.5675 43.4668 46.8673 c
43.4668 48.6408 43.9844 49.6779 45.2393 49.6779 c
44.1758 68.7667 m
35.4717 68.7667 l
35.4717 65.3019 l
43.7393 65.3019 l
45.7852 65.3019 46.9863 64.4552 46.9863 62.3 c
46.9863 60.3078 46.0586 59.2716 43.875 59.2716 c
35.4717 59.2716 l
35.4717 55.7511 l
44.666 55.7511 l
47.8867 55.7511 49.9053 57.798 49.9053 62.1085 c
49.9053 66.7746 47.3398 68.7667 44.1758 68.7667 c
49.6602 83.1466 m
45.0762 80.0084 l
44.4756 79.5988 43.9023 79.2165 43.5205 78.9445 c
43.0293 80.9904 41.666 82.3825 39.4824 82.3825 c
36.7266 82.3825 35.3896 80.3087 35.3896 76.8156 c
35.3896 75.0148 35.418 72.8595 35.4717 71.714 c
49.6602 71.714 l
49.6602 75.2335 l
44.1211 75.2335 l
44.1211 75.3693 l
49.6602 78.8625 l
49.6602 83.1466 l
p
39.8379 78.6437 m
41.0107 78.6437 41.8008 77.7707 41.8008 76.4064 c
41.8008 76.0246 41.8008 75.5871 41.748 75.2335 c
38.1191 75.2335 l
38.0918 75.5607 38.0635 75.9152 38.0635 76.298 c
38.0635 77.7433 38.7188 78.6437 39.8379 78.6437 c
48.8691 96.4396 m
42.1025 96.4396 l
42.1025 92.9196 l
46.5488 92.9196 l
46.7129 92.4284 46.7949 91.8288 46.7949 91.2277 c
46.7949 88.9084 45.2949 87.3264 42.5654 87.3264 c
39.7559 87.3264 38.1719 89.1545 38.1719 91.6374 c
38.1719 93.0016 38.4453 94.2565 38.9648 95.5114 c
35.9355 96.1667 l
35.4443 94.6384 35.2266 93.0837 35.2266 91.5554 c
35.2266 86.5344 38.6094 83.5875 42.8379 83.5875 c
47.5313 83.5875 49.9053 86.7258 49.9053 90.9274 c
49.9053 92.9465 49.5234 94.7477 48.8691 96.4396 c
false s
0 0 0 1 k
f
26.4531 13.1339 m
17.6753 13.1339 l
17.6753 9.6388 l
26.0137 9.6388 l
28.0762 9.6388 29.2871 8.7863 29.2871 6.6134 c
29.2871 4.6046 28.3525 3.5578 26.1504 3.5578 c
17.6753 3.5578 l
17.6753 .0089 l
26.9482 .0089 l
30.1953 .0089 32.2314 2.0724 32.2314 6.4201 c
32.2314 11.1251 29.6455 13.1339 26.4531 13.1339 c
31.9844 30.9269 m
17.6753 30.9269 l
17.6753 27.4875 l
23.7012 27.5148 l
25.1875 27.5148 26.3701 27.5431 27.2227 27.5978 c
27.2227 27.5705 l
26.2598 27.13 25.3525 26.6339 24.5 26.0841 c
17.6753 21.9289 l
17.6753 17.1691 l
31.9844 17.1691 l
31.9844 20.5812 l
24.9121 20.5812 l
23.7842 20.5812 23.0684 20.5529 22.3809 20.4982 c
22.3809 20.5265 l
23.1797 20.8839 24.1973 21.3791 24.9951 21.8742 c
31.9844 26.1671 l
31.9844 30.9269 l
p
32.0156 39.174 m
17.7085 39.174 l
17.7085 35.4943 l
32.0156 35.4943 l
p
f
67.446 35.4826 m
53.145 35.4826 l
53.145 39.1726 l
67.446 39.1726 l
67.446 35.4826 l
f
14.328 35.4826 m
0 35.4826 l
0 39.1726 l
14.328 39.1726 l
14.328 35.4826 l
f
end
restore
showpage
%%EOF
