%!PS-Adobe-3.0 EPSF-3.0
%%BoundingBox: 0 0 49 70
%%HiResBoundingBox: 0 0 48.762 69.372
%%Title: ufcd-logo-e2-dl-color
%%CreationDate: 2009-12-08T12:58+0100
%%Creator: Project ufcd
%%LanguageLevel: 2
%%DocumentData: Clean7Bit
%%Pages: 1
%%EndComments
%%Page: 1 1
save
0 0 48.762 69.372 rectclip
9 dict begin
/k{setcmykcolor}bind def
/p{closepath}bind def
/c{curveto}bind def
/f{fill}bind def
/l{lineto}bind def
/m{moveto}bind def
/s{setoverprint}bind def
27.6621 6.4649 m
25.6797 6.4649 l
25.6797 .2813 l
35.9629 .2813 l
35.9629 2.8135 l
31.8242 2.8135 l
31.8242 6.2695 l
29.8809 6.2695 l
29.8809 2.8135 l
27.6621 2.8135 l
p
35.9629 16.1875 m
32.5898 13.9287 l
32.1582 13.6348 31.7461 13.3604 31.4717 13.1631 c
31.1172 14.6357 30.1367 15.6367 28.5654 15.6367 c
26.582 15.6367 25.6211 14.1455 25.6211 11.6318 c
25.6211 10.3359 25.6406 8.7852 25.6797 7.9609 c
35.9629 7.9609 l
35.9629 10.4932 l
31.9033 10.4932 l
31.9033 10.5918 l
35.9629 13.1055 l
35.9629 16.1875 l
p
28.8203 12.9482 m
29.666 12.9482 30.2344 12.3193 30.2344 11.3379 c
30.2344 11.0635 30.2344 10.749 30.1953 10.4932 c
27.584 10.4932 l
27.5645 10.7295 27.5449 10.9844 27.5449 11.2588 c
27.5449 12.2998 28.0156 12.9482 28.8203 12.9482 c
35.9629 23.6729 m
33.8672 23.6729 l
33.8672 19.9229 l
31.6289 19.9229 l
31.6289 23.4961 l
29.7051 23.4961 l
29.7051 19.9229 l
27.6621 19.9229 l
27.6621 23.6729 l
25.6797 23.6729 l
25.6797 17.3897 l
35.9629 17.3897 l
p
35.9629 28.2266 m
25.6445 28.2266 l
25.6416 25.5049 l
35.9629 25.5049 l
p
32.709 38.3779 m
31.6084 38.3779 30.7441 37.8076 30.4307 36.6699 c
30.4121 36.6699 l
30.0186 37.6904 29.1543 38.2402 28.1719 38.2402 c
26.5635 38.2402 25.6211 37.1211 25.6211 34.3731 c
25.6211 33.0186 25.6797 31.3486 25.6797 30.3096 c
35.9629 30.3096 l
35.9629 33.96 l
35.9629 37.3174 34.2393 38.3779 32.709 38.3779 c
28.5449 35.5508 m
29.4297 35.5508 29.8613 34.7461 29.8613 33.5479 c
29.8613 33.4111 29.8613 33.1162 29.8418 32.8223 c
27.4082 32.8223 l
27.4082 33.1553 27.3877 33.5684 27.3877 33.8818 c
27.3877 35.1582 27.8584 35.5508 28.5449 35.5508 c
32.709 35.708 m
33.5527 35.708 34.1211 35.1377 34.1211 33.9014 c
34.1211 33.5088 34.1025 33.1162 34.0625 32.8223 c
31.4512 32.8223 l
31.4326 33.0772 31.4326 33.4688 31.4326 33.6856 c
31.4326 34.9619 31.8057 35.708 32.709 35.708 c
31.9424 49.4434 m
25.6797 49.4434 l
25.6797 46.9492 l
31.6289 46.9492 l
33.1006 46.9492 33.9648 46.3408 33.9648 44.79 c
33.9648 43.3565 33.2969 42.6104 31.7266 42.6104 c
25.6797 42.6104 l
25.6797 40.0781 l
32.2949 40.0781 l
34.6123 40.0781 36.0654 41.5498 36.0654 44.6524 c
36.0654 48.0088 34.2197 49.4434 31.9424 49.4434 c
35.8887 59.7891 m
32.5898 57.5313 l
32.1582 57.2373 31.7461 56.9619 31.4717 56.7656 c
31.1172 58.2383 30.1367 59.2393 28.5654 59.2393 c
26.582 59.2393 25.6211 57.7471 25.6211 55.2344 c
25.6211 53.9385 25.6406 52.3867 25.6797 51.5635 c
35.8887 51.5635 l
35.8887 54.0947 l
31.9033 54.0947 l
31.9033 54.1943 l
35.8887 56.707 l
35.8887 59.7891 l
p
28.8203 56.5498 m
29.666 56.5498 30.2344 55.9209 30.2344 54.9404 c
30.2344 54.665 30.2344 54.3516 30.1953 54.0947 c
27.584 54.0947 l
27.5645 54.3311 27.5449 54.5859 27.5449 54.8613 c
27.5449 55.9024 28.0156 56.5498 28.8203 56.5498 c
35.3193 69.3545 m
30.4512 69.3545 l
30.4512 66.8213 l
33.6504 66.8213 l
33.7686 66.4678 33.8281 66.0361 33.8281 65.6045 c
33.8281 63.9355 32.748 62.7969 30.7852 62.7969 c
28.7617 62.7969 27.623 64.1123 27.623 65.8994 c
27.623 66.8799 27.8193 67.7832 28.1924 68.6875 c
26.0137 69.1582 l
25.6602 68.0576 25.502 66.9395 25.502 65.8398 c
25.502 62.2276 27.9375 60.1074 30.9805 60.1074 c
34.3574 60.1074 36.0654 62.3652 36.0654 65.3877 c
36.0654 66.8408 35.791 68.1367 35.3193 69.3545 c
false s
0 0 0 .4 k
f
19.127 9.4443 m
12.811 9.4443 l
12.811 6.9297 l
18.8105 6.9297 l
20.2949 6.9297 21.166 6.3164 21.166 4.752 c
21.166 3.3057 20.4932 2.5537 18.9092 2.5537 c
12.811 2.5537 l
12.811 0 l
19.4824 0 l
21.8203 0 23.2852 1.4854 23.2852 4.6133 c
23.2852 7.999 21.4238 9.4443 19.127 9.4443 c
23.1074 22.2471 m
12.811 22.2471 l
12.811 19.7725 l
17.1465 19.792 l
18.2158 19.792 19.0684 19.8115 19.6816 19.8516 c
19.6816 19.8311 l
18.9883 19.5137 18.335 19.1582 17.7207 18.7617 c
12.811 15.7725 l
12.811 12.3467 l
23.1074 12.3467 l
23.1074 14.8018 l
18.0176 14.8018 l
17.2061 14.8018 16.6919 14.7822 16.1968 14.7432 c
16.1968 14.7627 l
16.771 15.0205 17.5029 15.376 18.0781 15.7334 c
23.1074 18.8213 l
23.1074 22.2471 l
p
23.1094 28.2266 m
12.8232 28.2266 l
12.8179 25.5205 l
23.1113 25.5205 l
p
f
0 1 .8 .2 k
38.457 25.5335 10.296 2.691 rectfill
0 25.5335 10.341 2.691 rectfill
end
restore
showpage
%%EOF
