{
  "/info": { "target": "http://accounts.localhost:3000", "secure": false, "logLevel": "debug" },
  "/auth": { "target": "http://accounts.localhost:3000", "secure": false, "logLevel": "debug" },
  "/oauth2": { "target": "http://accounts.localhost:3000", "secure": false, "logLevel": "debug" },
  "/social_login/v1": { "target": "http://accounts.localhost:3000", "secure": false, "logLevel": "debug" },
  "/social_login/callback": { "target": "http://accounts.localhost:3000", "secure": false, "logLevel": "debug" },
  "/.well-known": { "target": "http://accounts.localhost:3000", "secure": false, "logLevel": "debug" },
  "/role/v1": { "target": "http://accounts.localhost:3000", "secure": false, "logLevel": "debug" },
  "/user_signup/v1": { "target": "http://accounts.localhost:3000", "secure": false, "logLevel": "debug" },
  "/user/v1": { "target": "http://accounts.localhost:3000", "secure": false, "logLevel": "debug" },
  "/client/v1": { "target": "http://accounts.localhost:3000", "secure": false, "logLevel": "debug" },
  "/scope/v1": { "target": "http://accounts.localhost:3000", "secure": false, "logLevel": "debug" },
  "/setup": { "target": "http://accounts.localhost:3000", "secure": false, "logLevel": "debug" },
  "/settings": { "target": "http://accounts.localhost:3000", "secure": false, "logLevel": "debug" },
  "/webauthn": { "target": "http://accounts.localhost:3000", "secure": false, "logLevel": "debug" },
  "/api": { "target": "http://accounts.localhost:3000", "secure": false, "logLevel": "debug" }
}
