INDEX VERSION 1.131+/home/revand/eclipse/RestAssured/.metadata/.plugins/org.eclipse.jdt.core
1865797976.index
2614710297.index
2129681228.index
3391679061.index
4037510123.index
52695801.index
3843154007.index
1232418035.index
3185179202.index
1861926845.index
2414739398.index
3403754105.index
1994251731.index
3257615146.index
749993972.index
2341095323.index
3672600150.index
690240108.index
3464769178.index
1959755923.index
1406923273.index
1189506136.index
2504263384.index
4172282122.index
917688572.index
18769411.index
40342388.index
3005115952.index
2659689113.index
975049378.index
