0 0 0 0 0 0 0 0 
0 0 0 0 0 0 0 0 
0 0 0 0 0 0 0 0 
0 0 0 0 0 0 0 0 
0 0 0 0 0 0 0 0 
0 0 0 0 0 0 0 0 
0 0 0 0 0 0 0 0 
0 0 0 0 0 0 0 0 
0 0 0 0 0 0 0 0 
0 0 0 0 0 0 0 0 
0 0 0 0 0 0 0 0 
0 0 0 0 0 0 0 0 
0 0 0 0 0 0 0 0 
0 0 0 0 0 0 0 0 
0 0 0 0 0 0 0 0 
0 0 0 0 0 0 0 0 
0 0 0 0 0 0 0 0 
0 0 0 0 0 0 0 0 
0 0 0 0 0 0 0 0 
0 0 0 0 0 0 0 0 
0 0 0 0 0 0 0 0 
0 0 0 0 0 0 0 0 
0 0 0 0 0 0 0 0 
0 0 0 0 0 0 0 0 
0 0 0 0 0 0 0 0 
0 0 0 0 0 0 0 0 
0 0 0 0 0 0 0 0 
0 0 0 0 0 0 0 0 
0 0 0 0 0 0 0 0 
0 0 0 0 0 0 0 0 
0 0 0 0 0 0 0 0 
0 0 0 0 0 0 0 0 
0 0 0 0 0 0 0 0 
0 0 0 0 0 0 0 0 
0 0 0 0 0 0 0 0 
0 0 0 0 0 0 0 0 
0 0 0 0 0 0 0 0 
0 0 0 0 0 0 0 0 
0 0 0 0 0 0 0 0 
0 0 0 0 0 0 0 0 
0 0 0 0 0 0 0 0 
0 0 0 0 0 0 0 0 
0 0 0 0 0 0 0 0 
0 0 0 0 0 0 0 0 
0 0 0 0 0 0 0 0 
0 0 0 0 0 0 0 0 
0 0 0 0 0 0 0 0 
0 0 0 0 0 0 0 0 
0.0157019 0.00161217 0.029633 0.223493 0.0275718 0.0304406 0.240172 0.813669 
0.155351 0.00401158 0.0657195 0.030889 0.0126514 0.10477 0.0741712 0.339105 
0.0569198 0.000651977 0.00806814 0.0291035 0.0529102 0.320863 0.0579747 0.0471783 
0.00593839 0.00652189 0.0507071 0.0079157 0.00726449 0.0521894 0.00725377 0.0164865 
0.00178452 0.0504453 0.319735 0.0559957 0.00449192 0.00361723 0.000486552 0.00182658 
0.0362915 0.00781478 0.0651088 0.0846121 0.0119493 0.00100293 0.000500918 0.0165628 
0.0301058 0.0143703 0.135517 0.410864 0.0788488 0.00700521 0.00520572 0.0553147 
0.256812 0.0618738 0.362547 0.132943 0.0180895 0.021753 0.0345222 0.290541 
0.707427 0.00834995 0.062199 0.0162844 0.0330412 0.213285 0.0604823 0.0813569 
0.351123 0.000584582 0.00499289 0.0141505 0.145784 0.55762 0.331043 0.210131 
0.596989 0.000442568 0.000911146 0.00636096 0.0498799 0.327871 0.660496 0.245373 
0.151392 0.00883271 0.00914903 0.0417547 0.020713 0.140129 0.235176 0.0520358 
0.0395331 0.111191 0.0914065 0.311709 0.0799015 0.0204413 0.0356513 0.00680821 
0.0044833 0.499237 0.365444 0.726243 0.312035 0.0566131 0.131562 0.0342997 
0.0458522 0.11166 0.0920651 0.312816 0.0879719 0.10045 0.35883 0.254349 
0.345699 0.0102616 0.0323544 0.0495215 0.0567933 0.348037 0.774412 0.735556 
0.779137 0.0196807 0.0150669 0.0716977 0.0260824 0.130372 0.537242 0.782182 
0.503341 0.196571 0.125661 0.382805 0.122387 0.0273186 0.131243 0.354977 
0.121565 0.645035 0.3931 0.120277 0.0277342 0.00541051 0.0138849 0.0501487 
0.0122701 0.252662 0.507234 0.139156 0.141224 0.0439532 0.0248829 0.00627444 
0.00341366 0.0574658 0.300515 0.217962 0.539984 0.318159 0.0497414 0.0596927 
0.0529537 0.0137736 0.129906 0.452918 0.330098 0.589344 0.168367 0.0182888 
0.00353114 0.0370709 0.294107 0.717087 0.340221 0.20294 0.0344912 0.00282888 
0.000211691 0.00827178 0.0836806 0.297769 0.164751 0.142747 0.0130131 0.000586789 
2.10111e-05 0.0141703 0.148569 0.0942444 0.312639 0.0575594 0.0490266 0.00233283 
5.87379e-05 0.00224301 0.0223289 0.0273667 0.0502182 0.0108992 0.0701738 0.00447932 
0.000203042 0.0144988 0.1036 0.183491 0.0377044 0.00358486 0.00460894 0.000514855 
0.00162585 0.104953 0.473661 0.610413 0.178974 0.0176779 0.00146281 0.00423209 
0.0273371 0.206567 0.121219 0.194745 0.0360394 0.00321932 0.00416903 0.04752 
0.248031 0.0587319 0.0272039 0.16112 0.0173056 0.00222395 0.0239158 0.243113 
0.684355 0.0524916 0.0322485 0.0184631 0.00164625 0.000301207 0.00417592 0.0474672 
0.248247 0.100274 0.22948 0.0292066 0.00181452 0 0.00547571 0.00451946 
0.0273649 0.011287 0.0290605 0.00347332 0.00443515 0 0.0755102 0.0053781 
0.00168915 0.0560955 0.00817109 0 0.0588774 0 0.00545845 0.000365905 
0 0.35322 0.0514127 0 0.365376 0 0 0.000133399 
0 0.0558536 0 0 0.166835 0 0 0 
0 0.00368374 0 0 0.496071 0 0 0 
0 0 0 0 0.118476 0 0 0 
0.336005 0 0 0 0.0101335 0 0 0 
0.305826 0 0 0 0 0 0 0 
0.0449731 0 0 0 0 0 0.286878 0.389164 
0.0702147 0 0.201599 0 0 0 0.0413762 0.0704447 
0 0 0.621294 0 0.126424 0.0542011 0.0110797 0.0068966 
0 0 0.204413 0 0.512684 0.355254 0.0810157 0.0282032 
0 0 0.0231596 0 0.354529 0.710714 0.314529 0.225626 
0 0 0 0 0.0994509 0.302949 0.254112 0.626712 
0.199735 0 0 0 0.0703295 0.0474369 0.0917013 0.331722 
0.0595855 0 0 0 0.00585246 0.0310692 0.229306 0.0671512 
0 0 0 0 0 0.00500998 0.0439359 0.0174387 
0 0 0 0 0 0 0.170646 0.143443 
0 0 0 0 0.0485348 0.163138 0.584118 0.251122 
0 0 0 0 0.304138 0 0.388292 0.500518 
0.110216 0 0 0.259832 0.664919 0.237558 0.0798179 0.113978 
0 0 0 0.396427 0.262068 0.0507563 0.00819117 0.0134972 
0 0 0 0.0613014 0.0332399 0.022371 0.00233574 0 
0 0 0 0.00750741 0.0402891 0.194755 0 0 
0 0 0 0.0428112 0.226427 0.584758 0 0 
0 0 0 0 0.0376873 0.173 0 0 
0 0 0 0 0 0.0169892 0 0 
0 0 0 0 0 0 0 0 
0 0.0299224 0.00576123 0 0 0 0 0 
0 0.300496 0.0740582 0 0 0 0 0 
0 0.885834 0.425001 0.0856252 0 0 0 0 
0 0.436985 0.728565 0.35179 0 0 0 0 
0.0265744 0.308921 0.726715 0.623686 0.164466 0 0 0 
0.109835 0.384835 0.325179 0.309603 0.0637482 0.106407 0 0.0977501 
0.501331 0.805484 0.377006 0.285097 0.151643 0.462588 0.104662 0.0234503 
0.10959 0.754629 0.403958 0.65925 0.242542 0.126552 0.0248425 0.00385871 
0.0135515 0.254239 0.225469 0.254336 0.0545906 0.026205 0.0901641 0.0218611 
0.0720716 0.172026 0.566812 0.211712 0.0279281 0.0902629 0.464522 0.144234 
0.402578 0.0299097 0.158062 0.0336243 0.00485109 0.0211197 0.0964045 0.0228103 
0.071846 0.00668317 0.0515913 0.0240296 0.0174691 0.100799 0.11114 0.0171461 
0.0057368 0.0375582 0.279873 0.210261 0.123849 0.470809 0.481779 0.100307 
0.00809082 0.0206053 0.204939 0.620166 0.19057 0.114667 0.1085 0.0337962 
0.00385189 0.00289612 0.0348808 0.180134 0.0517295 0.0148379 0.0420061 0.204557 
0.0335847 0.000245876 0.00365713 0.0349957 0.174686 0.0345323 0.166208 0.570992 
0.164558 0.00011072 0.000549813 0.00539202 0.0190093 0.0044678 0.031859 0.166181 
0.0339073 0.0127269 0.00553901 0.0434679 0.00631939 0.00185415 0.0236761 0.0412189 
0.0483533 0.022865 0.0457399 0.292097 0.0443796 0.0302273 0.027716 0.229046 
0.348365 0.240689 0.0386392 0.0460547 0.0121707 0.0553742 0.0636463 0.320382 
0.774486 0.598657 0.163654 0.0228213 0.0537687 0.339069 0.232223 0.144788 
0.468062 0.186248 0.250735 0.0553936 0.0385774 0.27129 0.615821 0.337587 
0.684423 0.242116 0.660413 0.245893 0.0948294 0.396219 0.241383 0.0795721 
0.228911 0.0843465 0.413063 0.189161 0.0271304 0.0777725 0.0586025 0.0131704 
0.0243671 0.013335 0.0854989 0.0546684 0.0138512 0.104033 0.264395 0.0622919 
0.00721244 0.0476349 0.241785 0.279514 0.0661523 0.265078 0.687176 0.286372 
0.0339182 0.21495 0.639441 0.28141 0.0367328 0.0746935 0.31907 0.0705717 
0.0326391 0.0466257 0.225272 0.0526627 0.0123112 0.096948 0.0456076 0.0337629 
0.24529 0.0191345 0.160269 0.0323021 0.00810015 0.00828638 0.00379785 0.0161007 
0.123064 0.0548647 0.260071 0.207684 0.0907619 0.0265374 0.0073259 0.0867754 
0.474768 0.241943 0.684813 0.549851 0.434601 0.077138 0.00631853 0.0132394 
0.0977093 0.0718622 0.365886 0.167779 0.177228 0.0274008 0.00199628 0 
0.00741601 0.00804829 0.0605722 0.142804 0.47259 0.1048 0.00853516 0 
0.000342623 0.00687169 0.0671929 0.275387 0.156603 0.022392 0.00159976 0 
2.44241e-05 0.0394332 0.290971 0.689645 0.269608 0.0327533 0.00245868 0.00301773 
0.00023829 0.0877564 0.357307 0.316885 0.0689447 0.00685299 0.00608045 0 
0 0.320898 0.735765 0.340479 0.0489508 0.00628824 0 0.305597 
0.0468022 0.0830771 0.322547 0.0857339 0.009123 0.000903397 0 0.0470138 
0 0.00871841 0.0447983 0.0227819 0.00224736 0.000146867 0 0.0030002 
0 0 0.0172303 0.14904 0.0179524 0.00108496 0 0 
0 0 0.00666805 0.108808 0.0675102 0 0 0 
0 0 0 0.469339 0.454634 0.0663227 0 0 
0 0 0 0.28177 0.648323 0.0441412 0 0 
0.0817453 0 0 0.0279387 0.220384 0.0414773 0 0 
0 0 0 0.00183174 0.0273512 0.00343825 0 0 
0 0 0 0 0.0587884 0.00471059 0 0 
0 0 0 0 0.0167537 0.020956 0 0 
0 0 0.45761 0 0 0.19723 0 0 
0 0 0.113594 0 0 0.616186 0 0.14501 
0 0 0 0 0 0.3829 0 0.0149055 
0 0 0 0 0.368325 0.434748 0 0.00255727 
0 0 0 0 0.160342 0.0861739 0 0 
0 0 0.305605 0 0.471165 0 0.0104565 0.0907953 
0 0 0.0475256 0 0.108454 0 0.0146781 0.00755296 
0 0 0 0 0.0237788 0 0.141967 0 
0 0 0 0 0.157786 0 0.0248075 0 
0 0 0 0 0.559412 0 0.0075117 0 
0.00297776 0 0 0 0.158287 0 0.0261247 0.0116656 
0.0451208 0.103772 0 0 0.0395424 0.251481 0.240356 0.11534 
0.341559 0 0 0 0.0269858 0.242193 0.664644 0.432603 
0.773487 0 0 0 0 0.148983 0.244886 0.219982 
0.671082 0 0 0.0264336 0.20064 0.469589 0.151411 0.094368 
0.17835 0 0 0.104847 0 0.127211 0.292167 0.352626 
0.0687373 0.00908439 0.104225 0.46225 0 0.0168344 0.0406969 0.0578079 
0.00808909 0.015133 0.0181837 0.10664 0 0.00326225 0.00264836 0.00415897 
0.011886 0.155471 0.0169056 0.0427231 0.251353 0 0.00189355 0.00613745 
0 0.0475737 0.0183473 0.00498621 0.0341939 0.00470635 0.0120136 0.0791224 
0 0.285719 0.063072 0.00816131 0.00406398 0.0270605 0.080341 0.406983 
0 0.419209 0.29769 0.0700333 0 0.213857 0 0.0797595 
0.00903861 0.296042 0.685378 0.321811 0.0393356 0.0253328 0.00477814 0.0339898 
0.00110022 0.0871882 0.281518 0.0685636 0.00927254 0.0468638 0.0403919 0.00708469 
0.000634762 0.255491 0.0996613 0.0276495 0.0189708 0.113574 0.313453 0.0552162 
0.0055442 0.0289236 0.0253431 0.18048 0.13543 0.504721 0.713102 0.138562 
0.0209652 0.00266536 0.0361201 0.108198 0.346821 0.757578 0.512904 0.101843 
0.0577009 0.000576523 0.00773252 0.0609834 0.115205 0.431703 0.434098 0.0883867 
0.0126697 0.00633797 0.0484077 0.333272 0.171742 0.586866 0.698016 0.256449 
0.0725776 0.0721901 0.0118854 0.0501757 0.0435212 0.276599 0.269934 0.0994401 
0.334832 0.332915 0.0457072 0.00589635 0.00392648 0.0297288 0.031595 0.0113817 
0.0507471 0.277175 0.0601574 0.00433944 0.00331251 0.00201434 0.00295467 0.0201779 
0.00314263 0.68432 0.0989689 0.0179474 0.0438739 0.00627302 0.0139386 0.00155896 
0.000153472 0.246322 0.0407013 0.0658515 0.310422 0.043252 0.161238 0 
0.000629413 0.0274086 0.0282917 0.124582 0.352915 0.115052 0.323895 0 
0.0024871 0.00455784 0.0495448 0.328299 0.33473 0.035119 0.0781671 0 
0.0324555 0.000500911 0.00835189 0.076751 0.050544 0.00381438 0.00375834 0 
0.001161 0.000958029 0.0211224 0.26351 0.0333828 0.00164422 0.000149127 0 
2.05947e-05 0.00181387 0.0301413 0.355788 0.0294937 0.00101582 2.41774e-05 0 
2.4817e-07 0.0145614 0.098382 0.788046 0.0956551 0.00349358 0 0 
2.29445e-07 0.0033209 0.081643 0.683945 0.0712919 0.0025407 0 0 
1.4818e-05 0.00456253 0.016408 0.230274 0.0159041 0.00305526 0 7.55795e-05 
0.000742062 0.0698303 0.00557618 0.0253441 0 0.0555031 0 0.00295088 
0.0238692 0.00419937 0.000295996 0.00112664 0 0.152026 0 0.0579096 
0.327331 1.79006e-06 2.65474e-05 0.00112941 0.0405995 0.550881 0.040378 0.00617223 
0.0746002 1.90141e-05 3.38999e-06 0.000175701 0.00774622 0.150241 0.00977192 0.000444805 
0.00293342 0.000970386 4.26205e-05 2.27446e-05 0.00122138 0.00935964 0.0461265 0.00148709 
0.000328961 0.0354216 0.00161381 0 0.0341978 0.00172544 0.00151523 0.000623537 
0.0110322 0.514638 0.02905 0.0202133 0.562213 0.0301614 0.00100181 0.0126542 
0.229324 0.098983 0.00450152 0.00497356 0.164506 0 0.000157138 0.00117958 
0.0251793 0.0124954 0.000835245 0.000241913 0.00774479 0.0143256 0.000195158 4.13513e-05 
0.000862731 0.170404 0.0209409 0.000707897 0.0085729 0.000409994 0.00175672 7.20374e-05 
4.13372e-05 0.0170579 0.277095 0.0105367 0.21678 0 0.045774 0.00180589 
0.000500109 0.026893 0.685489 0.0216817 0.0380779 0.00983923 0.325492 0.011483 
0.0074179 0.00750183 0.279726 0.00870658 0.0143442 0.0263382 0.706972 0.0358867 
0.078153 0.00297853 0.0362136 0.00147512 0.0139216 0.0127474 0.336994 0.0396666 
0.420037 0.0179315 0.015429 0.00919763 0.349659 0.0133215 0.197599 0.37375 
0.815194 0.627089 0.0116046 0.00177653 0.0615077 0.00637744 0.149504 0.0817585 
0.418499 0.0957316 0.00407219 0.000536978 0.0187862 0.0125002 0.519923 0.049368 
0.0713715 0.0341776 0.108435 0.00399317 0.1499 0.00742196 0.190638 0.397771 
0.0833497 0.00927878 0.466178 0.00876116 0.608591 0.00563514 0.0488493 0.271804 
0.153768 0.00146076 0.10729 0.00601078 0.153968 0.083418 0.0126201 0.078851 
0.0679589 0.000148096 0.00890351 0.0011767 0.0133164 0.00296494 0.0151415 0.0831451 
0.311688 2.35933e-06 0.000158432 5.43858e-05 0.000263439 0.009025 0.131165 0.317671 
0.0544446 5.67375e-08 9.11156e-06 0.000677227 0 0.00805632 0.515288 0.729254 
0.106989 4.67478e-07 2.59974e-05 0.00599306 0.307661 0.481575 0.310436 0.335353 
0.0628152 0.000230185 2.47544e-06 0.000536236 0.0508702 0.13768 0.542082 0.171553 
0 0.0653934 0 0.000487484 0 0.371979 0.1893 0.0220358 
0 0.574605 0 0.000549163 0 0.0657703 0.0313644 0.00215362 
0 0.155926 0 9.74692e-05 6.33047e-05 0.0115256 0.124837 0 
0.0440778 0.0492511 0.000442122 3.44605e-05 0.00228013 0 0.500716 0 
0.0845856 0.442342 0 0.00247777 0.0416096 0 0.128005 0 
0.710295 0.0386571 0.0715453 0 0.442574 0 0.00825592 0 
0.277936 0 0.401847 0 0.197435 0 0.0095879 0 
0.0326037 0 0.439318 0 0.0238729 0 0.0565831 0 
0 0 0.0979482 4.08455e-05 0.0373669 0 0.598745 0 
0 0 0.153552 0.0121316 0.0164673 0 0.182883 0 
0 0 0.560022 0.0965919 0.167307 0 0.00997515 0 
0 0 0.233738 0.551734 0.600714 0 0 0 
0 0 0.0730797 0.708426 0.486536 0 0 0 
0 0 0.0250449 0.382882 0.0886427 0 0 0 
0 0 0.0510769 0.662513 0.0542731 0 0 0 
0 0 0.0573712 0.724485 0.0568458 0 0.410257 0 
0 0 0 0.297672 0 0 0.117756 0 
0 0 0 0.0382694 0 0 0.533876 0 
0 0 0 0.00129369 0 0 0.317966 0 
0 0 0 0 0 0 0.650739 0 
0 0 0 0 0 0 0.217386 0 
0 0 0 0 0 0.640891 0.0404885 0 
0 0 0 0 0 0.0767658 0 0 
0 0 0 0.700094 0 0 0 0 
0 0 0 0.317668 0 0 0 0 
0 0 0 0.00995281 0 0 0 0 
0 0 0 0 0 0 0 0 
0 0 0 0 0 0 0 0 
