0 0 0 0 0 0 0 0 
0.0174551 0.0174551 0.0174551 0.0174551 0.0174551 0.0174551 0.0174551 0.0174551 
0.0349101 0.0349101 0.0349101 0.0349101 0.0349101 0.0349101 0.0349101 0.0349101 
0.0523652 0.0523652 0.0523652 0.0523652 0.0523652 0.0523652 0.0523652 0.0523652 
0.0698203 0.0698203 0.0698203 0.0698203 0.0698203 0.0698203 0.0698203 0.0698203 
0.0872753 0.0872753 0.0872753 0.0872753 0.0872753 0.0872753 0.0872753 0.0872753 
0.10473 0.10473 0.10473 0.10473 0.10473 0.10473 0.10473 0.10473 
0.122185 0.122185 0.122185 0.122185 0.122185 0.122185 0.122185 0.122185 
0.139641 0.139641 0.139641 0.139641 0.139641 0.139641 0.139641 0.139641 
0.157096 0.157096 0.157096 0.157096 0.157096 0.157096 0.157096 0.157096 
0.174551 0.174551 0.174551 0.174551 0.174551 0.174551 0.174551 0.174551 
0.192006 0.192006 0.192006 0.192006 0.192006 0.192006 0.192006 0.192006 
0.209461 0.209461 0.209461 0.209461 0.209461 0.209461 0.209461 0.209461 
0.226916 0.226916 0.226916 0.226916 0.226916 0.226916 0.226916 0.226916 
0.244371 0.244371 0.244371 0.244371 0.244371 0.244371 0.244371 0.244371 
0.261826 0.261826 0.261826 0.261826 0.261826 0.261826 0.261826 0.261826 
0.279281 0.279281 0.279281 0.279281 0.279281 0.279281 0.279281 0.279281 
0.296736 0.296736 0.296736 0.296736 0.296736 0.296736 0.296736 0.296736 
0.314191 0.314191 0.314191 0.314191 0.314191 0.314191 0.314191 0.314191 
0.331646 0.331646 0.331646 0.331646 0.331646 0.331646 0.331646 0.331646 
0.349101 0.349101 0.349101 0.349101 0.349101 0.349101 0.349101 0.349101 
0.366556 0.366556 0.366556 0.366556 0.366556 0.366556 0.366556 0.366556 
0.384011 0.384011 0.384011 0.384011 0.384011 0.384011 0.384011 0.384011 
0.401466 0.401466 0.401466 0.401466 0.401466 0.401466 0.401466 0.401466 
0.418922 0.418922 0.418922 0.418922 0.418922 0.418922 0.418922 0.418922 
0.436377 0.436377 0.436377 0.436377 0.436377 0.436377 0.436377 0.436377 
0.453832 0.453832 0.453832 0.453832 0.453832 0.453832 0.453832 0.453832 
0.471287 0.471287 0.471287 0.471287 0.471287 0.471287 0.471287 0.471287 
0.516939 0.521436 0.517936 0.497775 0.507621 0.505093 0.51087 0.504825 
0.592591 0.594609 0.591754 0.577355 0.580913 0.590949 0.590714 0.590892 
0.647677 0.652077 0.6477 0.604074 0.616898 0.635478 0.638095 0.63497 
0.735521 0.735391 0.735076 0.695772 0.697825 0.733807 0.728246 0.731526 
0.80658 0.808181 0.806983 0.742255 0.750362 0.796214 0.789699 0.791436 
0.909824 0.904219 0.913275 0.856556 0.853672 0.911744 0.89257 0.902702 
0.998242 0.99055 1.00477 0.92714 0.930905 0.994254 0.966022 0.980322 
1.12069 1.10711 1.1331 1.06709 1.06152 1.12899 1.08997 1.11064 
1.22989 1.21152 1.24657 1.16285 1.16545 1.23258 1.18277 1.21049 
1.37615 1.35739 1.39931 1.33131 1.3251 1.39028 1.33661 1.36509 
1.51144 1.48886 1.53874 1.45452 1.45825 1.51905 1.45856 1.49007 
1.68667 1.67069 1.72204 1.65625 1.65044 1.70671 1.64971 1.67402 
1.85258 1.83909 1.89421 1.81328 1.818 1.86898 1.80806 1.83121 
2.06724 2.06493 2.11773 2.05702 2.05028 2.09656 2.04531 2.05301 
2.27706 2.28326 2.33535 2.26089 2.26412 2.30639 2.25165 2.25542 
2.55865 2.56752 2.61696 2.56322 2.55316 2.59035 2.55109 2.53657 
2.84673 2.86664 2.90737 2.84703 2.84298 2.87899 2.83424 2.81817 
3.26286 3.27024 3.30405 3.26308 3.25995 3.27471 3.25332 3.23949 
3.8106 3.81867 3.82351 3.82259 3.78853 3.82878 3.79916 3.79572 
4.44632 4.45131 4.45865 4.47279 4.44099 4.46071 4.45342 4.4555 
5.08366 5.06054 5.06347 5.04887 5.07452 5.0419 5.04937 5.05018 
5.6297 5.6533 5.67245 5.64644 5.67883 5.64935 5.66481 5.66081 
6.01196 6.06544 5.98906 5.88764 5.9616 5.93845 5.93311 5.9242 
6.47351 6.6004 6.47162 6.39406 6.45947 6.51782 6.39076 6.45674 
6.14206 6.46013 6.01537 5.74623 5.97086 6.05 5.79775 5.94117 
6.05151 5.99551 5.74563 5.55451 5.51171 5.72704 5.35936 5.77012 
5.58145 5.40093 5.17371 5.02006 5.05544 5.20357 5.31198 5.27166 
5.03621 4.919 4.62638 4.44208 4.45822 4.8711 4.964 4.89704 
4.4943 4.39173 4.07258 3.81817 3.90649 4.44854 4.68634 4.35847 
3.92386 3.8369 3.60997 3.29436 3.6763 4.11359 4.27304 4.04567 
3.4988 3.30888 3.06954 2.82552 3.32673 3.8336 3.98907 3.49681 
3.16038 3.19338 2.67767 2.82651 3.13901 3.49332 3.57633 3.18844 
2.90824 3.39176 2.85832 3.0576 2.85831 3.00329 3.11384 2.7434 
2.92209 3.40246 2.89499 3.08707 2.83685 2.65452 2.79018 2.758 
2.83549 3.1502 2.86913 3.07279 2.61151 2.51503 2.44923 2.8486 
3.06406 2.66685 2.8044 2.65334 2.49295 2.4466 2.43738 2.9938 
2.90836 2.4031 2.52226 2.45628 1.97458 2.11916 2.34865 2.74619 
2.61627 2.63241 2.45971 2.3414 1.80278 1.78169 2.18227 2.33229 
2.09831 2.55617 2.51902 2.14779 1.73434 1.54048 1.92342 1.96175 
1.75396 2.14383 2.49124 2.00349 1.80021 1.40963 1.7824 1.541 
1.32574 1.815 2.20935 1.78323 2.05161 1.56358 1.55449 1.41676 
1.0995 1.45012 1.81286 1.98319 1.84939 1.88684 1.36888 1.16518 
0.955856 1.18594 1.64964 2.07551 1.79236 1.73584 1.23481 0.989583 
0.771866 1.03614 1.34538 1.69027 1.4576 1.52413 1.03956 0.897369 
0.729088 0.897014 1.22247 1.20296 1.3187 1.25505 0.946762 0.750667 
0.647802 0.764199 1.15735 1.07156 1.04537 0.886144 0.889768 0.685581 
0.576674 0.747751 0.969756 0.927034 0.721106 0.728421 0.689263 0.657678 
0.555377 0.746372 1.09604 1.08802 0.613763 0.551474 0.505011 0.647964 
0.53481 0.933932 0.926873 1.01443 0.473595 0.420018 0.398371 0.673565 
0.942018 0.641422 0.805743 0.853958 0.33705 0.29683 0.337562 0.730743 
1.17182 0.613909 0.629994 0.65125 0.257112 0.228982 0.354238 0.594415 
0.981415 0.570466 0.776603 0.400903 0.219858 0.169242 0.297524 0.410636 
0.757574 0.448285 0.634474 0.231455 0.26671 0.139867 0.431664 0.288433 
0.438467 0.477643 0.36561 0.15669 0.318046 0.127604 0.278167 0.257712 
0.180063 0.746569 0.252529 0.109071 0.624897 0.120419 0.188234 0.270489 
0.144602 0.585365 0.153015 0.116756 0.612951 0.113112 0.153569 0.189717 
0.204062 0.277365 0.15392 0.100823 0.700182 0.100138 0.161211 0.169787 
0.173273 0.163466 0.132619 0.108568 0.618417 0.104351 0.137845 0.13981 
0.531305 0.084004 0.125667 0.125269 0.338058 0.126571 0.187207 0.122967 
0.59701 0.115868 0.134963 0.121944 0.187334 0.12739 0.146847 0.105243 
0.302401 0.114132 0.132371 0.125467 0.137826 0.115782 0.418279 0.501549 
0.242293 0.0781595 0.431043 0.0873009 0.156451 0.138339 0.385151 0.423561 
0.155588 0.0731095 0.66066 0.0718604 0.29663 0.232948 0.285257 0.286622 
0.112618 0.0845505 0.594632 0.0568986 0.608351 0.494555 0.313427 0.257801 
0.0873888 0.102228 0.288173 0.0955797 0.643081 0.91447 0.421696 0.551607 
0.106963 0.100179 0.119303 0.113634 0.392963 0.868968 0.578674 0.675803 
0.30426 0.0793448 0.107359 0.108143 0.315819 0.600674 0.510035 0.647435 
0.270314 0.0919768 0.0980911 0.103548 0.227786 0.298761 0.68556 0.493374 
0.16457 0.0977316 0.10348 0.114318 0.166942 0.251074 0.594419 0.285654 
0.112769 0.0993747 0.0966608 0.1106 0.174258 0.147959 0.544333 0.352588 
0.110203 0.0896488 0.104083 0.116163 0.264067 0.269203 0.800372 0.297006 
0.0756536 0.0900109 0.0975678 0.092503 0.594637 0.113529 0.717436 0.547553 
0.202501 0.0800744 0.0798108 0.336671 0.842844 0.310294 0.570515 0.409541 
0.123733 0.0984744 0.0705318 0.608211 0.718301 0.343885 0.324692 0.230678 
0.10644 0.0950955 0.105246 0.452689 0.50275 0.281031 0.200586 0.14031 
0.102748 0.107235 0.106695 0.276067 0.267762 0.563267 0.109807 0.117745 
0.101378 0.104986 0.117286 0.233972 0.338666 0.682344 0.109152 0.105907 
0.105817 0.119163 0.117813 0.160068 0.240564 0.638908 0.104275 0.106919 
0.111591 0.123948 0.145362 0.15045 0.1584 0.369762 0.115017 0.105225 
0.117753 0.169208 0.166611 0.144623 0.149538 0.17567 0.125236 0.106844 
0.110172 0.250859 0.24563 0.173745 0.129485 0.124425 0.113028 0.105424 
0.0824372 0.614679 0.443819 0.176933 0.125922 0.111774 0.108643 0.110523 
0.133454 0.695722 0.839348 0.428206 0.109844 0.113393 0.10589 0.101683 
0.116299 0.754127 1.10815 0.647118 0.137364 0.117115 0.109258 0.122298 
0.227771 0.809019 1.3766 0.920936 0.349501 0.118151 0.130657 0.0992775 
0.335771 0.918894 1.25762 0.985804 0.417282 0.326405 0.0897462 0.282954 
0.65395 1.15628 1.08651 1.01006 0.443925 0.73204 0.228854 0.139652 
0.714365 1.32161 0.97931 1.22631 0.674748 0.740153 0.31031 0.13925 
0.589556 1.17083 0.829937 1.1866 0.622155 0.519636 0.571728 0.20035 
0.607489 1.08099 1.12581 1.10701 0.551645 0.528407 0.95939 0.447613 
0.958975 0.702477 1.26951 0.868784 0.530697 0.537308 1.03652 0.416718 
0.908097 0.507448 1.01534 0.792066 0.547013 0.659861 1.00093 0.400979 
0.616 0.521379 1.07068 0.949497 0.600887 1.06344 1.19578 0.663577 
0.536724 0.477948 0.923283 1.32661 0.829842 0.98837 1.14005 0.794894 
0.448992 0.44227 0.756487 1.32401 0.776845 0.862113 0.809054 1.04428 
0.658613 0.34645 0.610004 1.04234 0.93979 0.694462 0.918721 1.22777 
0.91059 0.326867 0.615693 0.888252 0.842903 0.645709 0.810987 1.12856 
1.03281 0.45793 0.536242 0.863859 0.639605 0.610631 0.747071 1.02025 
0.958204 0.702916 0.60196 1.11964 0.625915 0.765782 0.649521 1.19276 
1.39891 1.01352 0.600805 1.02012 0.455454 0.874684 0.71106 1.28175 
1.72797 1.36056 0.915023 0.844291 0.545763 1.11607 0.865418 1.17305 
1.83903 1.27021 1.24251 0.793081 0.591228 1.11787 1.32763 1.22215 
1.65314 1.24301 1.50119 1.06706 0.664912 1.23496 1.34515 1.10144 
1.49706 1.18533 1.66396 1.19604 0.633222 1.19821 1.18541 0.94111 
1.22919 0.995055 1.48106 1.06267 0.6296 1.01635 1.31832 0.819509 
0.949524 0.847335 1.37747 1.22036 0.690635 1.12597 1.51108 0.908186 
0.888291 1.00807 1.54935 1.33546 0.740697 0.95763 1.38442 0.892674 
0.825349 0.860865 1.3702 1.09954 0.757187 0.87429 1.09647 0.64602 
0.999634 0.623687 1.2337 0.928198 0.802367 0.708983 0.828943 0.45274 
0.920165 0.58187 1.15027 0.984961 1.04988 0.51488 0.675071 0.469197 
0.853637 0.606577 1.19315 1.27043 1.25284 0.748697 0.477535 0.385901 
0.774723 0.575701 1.10037 1.13615 1.15041 0.602929 0.381717 0.178675 
0.565831 0.414459 0.957262 1.075 1.16182 0.594895 0.315143 0.170618 
0.358466 0.411734 0.656277 0.99957 1.06123 0.502772 0.208134 0.133194 
0.260522 0.355303 0.769767 1.30014 0.932509 0.379552 0.155493 0.170592 
0.216535 0.369119 0.762584 1.12102 0.823418 0.245745 0.12204 0.106377 
0.0780107 0.524333 1.052 0.960508 0.665174 0.140669 0.0823637 0.507312 
0.258456 0.437835 0.962331 0.919565 0.499401 0.137011 0.102515 0.407049 
0.20035 0.227279 0.75747 0.667375 0.351974 0.121608 0.118733 0.203116 
0.142734 0.157741 0.544551 0.697615 0.370968 0.142997 0.113151 0.127957 
0.111078 0.12541 0.296804 0.584892 0.541583 0.0956717 0.10941 0.10673 
0.110041 0.112978 0.171544 0.74069 0.806297 0.230286 0.0891729 0.0977306 
0.0945157 0.0993539 0.109514 0.650492 0.819679 0.217484 0.0970027 0.0972239 
0.215542 0.0879736 0.129566 0.401152 0.790501 0.216177 0.0987021 0.081902 
0.117753 0.098431 0.113536 0.213448 0.627207 0.13535 0.11059 0.103738 
0.0987977 0.0996929 0.149639 0.142731 0.552473 0.138067 0.111567 0.0893343 
0.0963386 0.0958488 0.141043 0.11664 0.354898 0.205631 0.107151 0.11466 
0.0901699 0.0788644 0.497391 0.0829379 0.130387 0.59424 0.0764849 0.0842138 
0.0733747 0.0839924 0.517248 0.100749 0.126419 0.707488 0.0708034 0.357752 
0.0952525 0.101314 0.174119 0.118519 0.158317 0.670825 0.092967 0.14417 
0.0948496 0.0973278 0.144616 0.109315 0.533391 0.645611 0.0979083 0.109586 
0.0949155 0.0895092 0.106177 0.109052 0.661205 0.55455 0.0920856 0.0970764 
0.0848136 0.0652778 0.456243 0.069694 0.701768 0.266115 0.126937 0.242133 
0.101298 0.0830359 0.367518 0.100676 0.716544 0.122264 0.137954 0.137401 
0.0997133 0.0985631 0.14302 0.122047 0.532059 0.100757 0.465749 0.0847857 
0.110385 0.0934251 0.118434 0.104756 0.582743 0.106516 0.462604 0.115427 
0.108451 0.0994675 0.0990697 0.0811377 0.700244 0.124699 0.402839 0.141149 
0.14297 0.0898684 0.0981714 0.110207 0.652499 0.123642 0.538976 0.181741 
0.0918737 0.257239 0.073201 0.100962 0.432866 0.471421 0.769737 0.468198 
0.538115 0.0971856 0.103883 0.0986164 0.330494 0.698065 1.13814 0.703635 
0.678633 0.0738975 0.0867038 0.1204 0.123659 0.685474 1.17196 0.84422 
0.720687 0.0889195 0.117771 0.107212 0.385131 0.883169 0.996301 0.703355 
0.716919 0.0879682 0.0698665 0.461237 0.13377 0.73207 0.893299 0.886348 
0.648191 0.108705 0.264392 0.68775 0.151044 0.513895 0.744624 0.722353 
0.35593 0.207342 0.134757 0.70975 0.124531 0.405777 0.456993 0.543086 
0.173336 0.587776 0.119918 0.527096 0.546312 0.130248 0.372931 0.454728 
0.107828 0.667448 0.247484 0.287647 0.525488 0.231771 0.155146 0.592353 
0.110306 0.700625 0.492677 0.286326 0.288111 0.265168 0.251659 0.723779 
0.102429 0.69769 0.812614 0.352721 0.127477 0.581941 0.155604 0.648965 
0.102784 0.70294 1.17851 0.655628 0.102257 0.558677 0.202374 0.509994 
0.128285 0.627035 1.11423 0.618815 0.202575 0.478356 0.450557 0.227263 
0.104011 0.693382 0.945043 0.488176 0.257099 0.683835 0.731282 0.262134 
0.0819465 0.657403 0.543425 0.708903 0.425812 0.966578 0.983842 0.444818 
0.108805 0.388558 0.478231 0.697289 0.764874 1.20469 0.967959 0.52294 
0.296189 0.264728 0.307577 0.700529 0.723518 1.20557 0.975151 0.378069 
0.26701 0.279907 0.328759 0.899478 0.651325 1.21607 1.10467 0.588415 
0.288201 0.565212 0.240709 0.769048 0.547019 1.08772 1.10278 0.573273 
0.706623 0.843728 0.278943 0.577486 0.405121 0.925485 0.835037 0.340073 
0.545249 1.04545 0.449693 0.433598 0.444093 0.702498 0.686539 0.321444 
0.364114 0.974074 0.548622 0.405561 0.529101 0.606727 0.571831 0.239839 
0.230295 0.851945 0.533651 0.474045 0.915207 0.499264 0.715879 0.115202 
0.165909 0.668006 0.313169 0.740852 1.11385 0.545014 0.729154 0.106694 
0.121234 0.446776 0.4277 0.975026 1.06955 0.50695 0.691815 0.0920662 
0.211425 0.228543 0.342844 0.917015 0.910594 0.348185 0.481 0.0947093 
0.138461 0.153299 0.323485 0.946722 0.6648 0.287406 0.237021 0.116716 
0.107169 0.124077 0.354353 0.951946 0.492018 0.231749 0.164231 0.111909 
0.110859 0.100481 0.428732 1.01318 0.422915 0.156307 0.12218 0.105101 
0.106393 0.109506 0.469026 0.994408 0.432742 0.142845 0.131019 0.101274 
0.118893 0.11104 0.29956 0.864709 0.334306 0.14849 0.112881 0.110023 
0.101459 0.349982 0.119671 0.713055 0.129414 0.398546 0.106681 0.115364 
0.240016 0.213382 0.121929 0.465702 0.0841263 0.637022 0.0705095 0.227779 
0.600808 0.087184 0.133969 0.233699 0.244774 0.800871 0.228301 0.105371 
0.626075 0.13221 0.118373 0.154164 0.157035 0.677824 0.140025 0.0925452 
0.400133 0.137823 0.116795 0.138684 0.15224 0.490065 0.250818 0.116267 
0.235318 0.43774 0.0897102 0.107266 0.3343 0.246484 0.158899 0.122584 
0.114283 0.676663 0.0900158 0.0941713 0.64387 0.106531 0.130011 0.153143 
0.527666 0.666416 0.127457 0.10673 0.666261 0.0978369 0.128207 0.0765266 
0.529226 0.494353 0.162873 0.121795 0.541317 0.111374 0.154833 0.108744 
0.240992 0.765967 0.261524 0.127057 0.336402 0.150101 0.149747 0.12747 
0.239491 0.50954 0.580988 0.0766949 0.635993 0.0697033 0.518588 0.11632 
0.25128 0.425017 0.693085 0.0886587 0.583553 0.111928 0.691552 0.115811 
0.34904 0.319276 0.7187 0.11909 0.358847 0.214139 0.816077 0.409136 
0.655677 0.212614 0.643777 0.122172 0.435315 0.269323 0.8217 0.476475 
0.951167 0.384285 0.464574 0.0843703 0.675336 0.125166 0.741454 1.02062 
1.24857 0.849909 0.403606 0.0943342 0.713494 0.122677 0.759163 0.997174 
1.34787 0.891864 0.32444 0.101326 0.636182 0.105504 0.72985 0.88029 
1.1356 0.681 0.598011 0.0953315 0.680836 0.206443 0.841378 1.22927 
1.02646 0.498444 0.713614 0.0910645 0.682031 0.209608 0.809381 1.40371 
0.912535 0.341784 0.705143 0.0854508 0.710592 0.549425 0.64111 1.24968 
0.766554 0.282355 0.576699 0.100517 0.597831 0.446777 0.682674 1.10583 
0.683243 0.299463 0.317203 0.137096 0.485569 0.455942 0.89274 1.04874 
0.588497 0.204528 0.197849 0.148267 0.290654 0.552937 1.04511 1.07479 
0.514046 0.214511 0.133803 0.0843927 0.626996 1.01895 0.770401 0.827496 
0.61812 0.156499 0.133622 0.0929456 0.594502 1.10497 0.891655 0.766212 
0.227791 0.563726 0.0761855 0.113447 0.397362 0.975413 0.81888 0.812207 
0.162504 0.720244 0.0999969 0.124606 0.271749 0.88308 0.57601 0.571893 
0.168192 0.702894 0.105307 0.123805 0.224759 0.698006 0.679322 0.250057 
0.406345 0.465028 0.221302 0.110089 0.340421 0.414333 0.76716 0.171595 
0.581195 0.633526 0.243343 0.0945486 0.622663 0.145124 0.777515 0.188915 
0.744637 0.488745 0.589773 0.0937502 0.698602 0.112423 0.631431 0.229224 
0.817476 0.207817 0.686326 0.1054 0.730365 0.132345 0.46948 0.276002 
0.679737 0.144058 0.784151 0.277962 0.719031 0.112849 0.705372 0.173867 
0.363646 0.144027 0.756599 0.396461 0.720221 0.105555 0.708168 0.124339 
0.178681 0.142361 0.782889 0.593074 0.727091 0.0944713 0.714802 0.126062 
0.115846 0.11892 0.749027 1.07969 0.730655 0.113388 0.560565 0.102804 
0.0920797 0.130164 0.732888 1.33031 0.778236 0.130861 0.290829 0.107802 
0.0934476 0.095713 0.715676 1.24686 0.755403 0.114069 0.15197 0.0996399 
0.0898322 0.0986596 0.667642 1.12221 0.745773 0.113024 0.16034 0.0985648 
0.0896424 0.0896348 0.54542 0.922039 0.718607 0.0994622 0.146771 0.0919716 
0.0922603 0.080611 0.600695 0.827551 0.676353 0.0741423 0.562427 0.0712877 
0.0864407 0.09356 0.298664 0.816399 0.511815 0.0897995 0.586411 0.0889101 
0.0902894 0.097707 0.174292 0.685841 0.291743 0.0982617 0.670423 0.0855111 
0.0901546 0.0905453 0.123117 0.456119 0.167941 0.0989848 0.687988 0.0893478 
0.0923593 0.0901576 0.112241 0.227026 0.14781 0.1187 0.683577 0.0843974 
0.0892461 0.0846286 0.103208 0.169261 0.115289 0.112538 0.657969 0.0804624 
0.0861756 0.0893645 0.0955356 0.172305 0.07884 0.530805 0.466254 0.0885376 
0.0819037 0.0840802 0.0850336 0.217714 0.0730344 0.610154 0.144181 0.10154 
0.0847559 0.0876296 0.0645705 0.591992 0.0683306 0.283345 0.111493 0.0914335 
0.0816129 0.0801712 0.0740807 0.609086 0.0841341 0.0962308 0.103237 0.0861139 
0.0849068 0.0856626 0.0872491 0.421655 0.092461 0.085797 0.0900966 0.0845757 
0.0774202 0.0753042 0.0910841 0.150728 0.0912955 0.0772322 0.0848058 0.0766224 
0.0828317 0.0840988 0.0891757 0.0922699 0.0891312 0.0807594 0.0840269 0.0809241 
