{
  "language": "Solidity",
  "sources": {
    "contracts/libraries/Utility.sol": {
      "content": "// SPDX-License-Identifier: MIT\npragma solidity ^0.8.0;\npragma abicoder v2;\n\nimport \"@openzeppelin/contracts/utils/math/SafeMath.sol\";\n\nlibrary Finance {\n    using SafeMath for uint256;\n\n    /**\n     * @notice Calculates the amount of a fee given as basis points\n     * @param _amount The amount to calculate the fee for\n     * @param _bp The fee in basis points to calculate\n     */\n    function calculateFeeAmount(uint256 _amount, uint256 _bp)\n        internal\n        pure\n        returns (uint256)\n    {\n        uint256 _fee = _amount.mul(_bp).div(10000);\n\n        return _fee;\n    }\n\n    /**\n     * @notice Calculates basis points\n     * @param _dividend The value to calculate the basis points for\n     * @param _divisor The value to divide the dividend by, generally the whole amount\n     */\n    function calculateBP(uint256 _dividend, uint256 _divisor)\n        internal\n        pure\n        returns (uint256)\n    {\n        uint256 _bp = _dividend.mul(10**9).mul(10000).div(_divisor).div(10**9);\n        return _bp;\n    }\n}\n"
    },
    "@openzeppelin/contracts/utils/math/SafeMath.sol": {
      "content": "// SPDX-License-Identifier: MIT\n// OpenZeppelin Contracts v4.4.1 (utils/math/SafeMath.sol)\n\npragma solidity ^0.8.0;\n\n// CAUTION\n// This version of SafeMath should only be used with Solidity 0.8 or later,\n// because it relies on the compiler's built in overflow checks.\n\n/**\n * @dev Wrappers over Solidity's arithmetic operations.\n *\n * NOTE: `SafeMath` is generally not needed starting with Solidity 0.8, since the compiler\n * now has built in overflow checking.\n */\nlibrary SafeMath {\n    /**\n     * @dev Returns the addition of two unsigned integers, with an overflow flag.\n     *\n     * _Available since v3.4._\n     */\n    function tryAdd(uint256 a, uint256 b) internal pure returns (bool, uint256) {\n        unchecked {\n            uint256 c = a + b;\n            if (c < a) return (false, 0);\n            return (true, c);\n        }\n    }\n\n    /**\n     * @dev Returns the substraction of two unsigned integers, with an overflow flag.\n     *\n     * _Available since v3.4._\n     */\n    function trySub(uint256 a, uint256 b) internal pure returns (bool, uint256) {\n        unchecked {\n            if (b > a) return (false, 0);\n            return (true, a - b);\n        }\n    }\n\n    /**\n     * @dev Returns the multiplication of two unsigned integers, with an overflow flag.\n     *\n     * _Available since v3.4._\n     */\n    function tryMul(uint256 a, uint256 b) internal pure returns (bool, uint256) {\n        unchecked {\n            // Gas optimization: this is cheaper than requiring 'a' not being zero, but the\n            // benefit is lost if 'b' is also tested.\n            // See: https://github.com/OpenZeppelin/openzeppelin-contracts/pull/522\n            if (a == 0) return (true, 0);\n            uint256 c = a * b;\n            if (c / a != b) return (false, 0);\n            return (true, c);\n        }\n    }\n\n    /**\n     * @dev Returns the division of two unsigned integers, with a division by zero flag.\n     *\n     * _Available since v3.4._\n     */\n    function tryDiv(uint256 a, uint256 b) internal pure returns (bool, uint256) {\n        unchecked {\n            if (b == 0) return (false, 0);\n            return (true, a / b);\n        }\n    }\n\n    /**\n     * @dev Returns the remainder of dividing two unsigned integers, with a division by zero flag.\n     *\n     * _Available since v3.4._\n     */\n    function tryMod(uint256 a, uint256 b) internal pure returns (bool, uint256) {\n        unchecked {\n            if (b == 0) return (false, 0);\n            return (true, a % b);\n        }\n    }\n\n    /**\n     * @dev Returns the addition of two unsigned integers, reverting on\n     * overflow.\n     *\n     * Counterpart to Solidity's `+` operator.\n     *\n     * Requirements:\n     *\n     * - Addition cannot overflow.\n     */\n    function add(uint256 a, uint256 b) internal pure returns (uint256) {\n        return a + b;\n    }\n\n    /**\n     * @dev Returns the subtraction of two unsigned integers, reverting on\n     * overflow (when the result is negative).\n     *\n     * Counterpart to Solidity's `-` operator.\n     *\n     * Requirements:\n     *\n     * - Subtraction cannot overflow.\n     */\n    function sub(uint256 a, uint256 b) internal pure returns (uint256) {\n        return a - b;\n    }\n\n    /**\n     * @dev Returns the multiplication of two unsigned integers, reverting on\n     * overflow.\n     *\n     * Counterpart to Solidity's `*` operator.\n     *\n     * Requirements:\n     *\n     * - Multiplication cannot overflow.\n     */\n    function mul(uint256 a, uint256 b) internal pure returns (uint256) {\n        return a * b;\n    }\n\n    /**\n     * @dev Returns the integer division of two unsigned integers, reverting on\n     * division by zero. The result is rounded towards zero.\n     *\n     * Counterpart to Solidity's `/` operator.\n     *\n     * Requirements:\n     *\n     * - The divisor cannot be zero.\n     */\n    function div(uint256 a, uint256 b) internal pure returns (uint256) {\n        return a / b;\n    }\n\n    /**\n     * @dev Returns the remainder of dividing two unsigned integers. (unsigned integer modulo),\n     * reverting when dividing by zero.\n     *\n     * Counterpart to Solidity's `%` operator. This function uses a `revert`\n     * opcode (which leaves remaining gas untouched) while Solidity uses an\n     * invalid opcode to revert (consuming all remaining gas).\n     *\n     * Requirements:\n     *\n     * - The divisor cannot be zero.\n     */\n    function mod(uint256 a, uint256 b) internal pure returns (uint256) {\n        return a % b;\n    }\n\n    /**\n     * @dev Returns the subtraction of two unsigned integers, reverting with custom message on\n     * overflow (when the result is negative).\n     *\n     * CAUTION: This function is deprecated because it requires allocating memory for the error\n     * message unnecessarily. For custom revert reasons use {trySub}.\n     *\n     * Counterpart to Solidity's `-` operator.\n     *\n     * Requirements:\n     *\n     * - Subtraction cannot overflow.\n     */\n    function sub(\n        uint256 a,\n        uint256 b,\n        string memory errorMessage\n    ) internal pure returns (uint256) {\n        unchecked {\n            require(b <= a, errorMessage);\n            return a - b;\n        }\n    }\n\n    /**\n     * @dev Returns the integer division of two unsigned integers, reverting with custom message on\n     * division by zero. The result is rounded towards zero.\n     *\n     * Counterpart to Solidity's `/` operator. Note: this function uses a\n     * `revert` opcode (which leaves remaining gas untouched) while Solidity\n     * uses an invalid opcode to revert (consuming all remaining gas).\n     *\n     * Requirements:\n     *\n     * - The divisor cannot be zero.\n     */\n    function div(\n        uint256 a,\n        uint256 b,\n        string memory errorMessage\n    ) internal pure returns (uint256) {\n        unchecked {\n            require(b > 0, errorMessage);\n            return a / b;\n        }\n    }\n\n    /**\n     * @dev Returns the remainder of dividing two unsigned integers. (unsigned integer modulo),\n     * reverting with custom message when dividing by zero.\n     *\n     * CAUTION: This function is deprecated because it requires allocating memory for the error\n     * message unnecessarily. For custom revert reasons use {tryMod}.\n     *\n     * Counterpart to Solidity's `%` operator. This function uses a `revert`\n     * opcode (which leaves remaining gas untouched) while Solidity uses an\n     * invalid opcode to revert (consuming all remaining gas).\n     *\n     * Requirements:\n     *\n     * - The divisor cannot be zero.\n     */\n    function mod(\n        uint256 a,\n        uint256 b,\n        string memory errorMessage\n    ) internal pure returns (uint256) {\n        unchecked {\n            require(b > 0, errorMessage);\n            return a % b;\n        }\n    }\n}\n"
    },
    "contracts/RetroVisionToken.sol": {
      "content": "// SPDX-License-Identifier: MIT\npragma solidity ^0.8.0;\n\n//\n\nimport \"./libraries/Utility.sol\";\n\nimport \"@openzeppelin/contracts/access/Ownable.sol\";\n\nimport \"@openzeppelin/contracts/interfaces/IERC20.sol\";\n\nimport \"@openzeppelin/contracts/security/ReentrancyGuard.sol\";\n\nimport \"@openzeppelin/contracts/utils/Address.sol\";\nimport \"@openzeppelin/contracts/utils/Context.sol\";\nimport \"@openzeppelin/contracts/utils/Counters.sol\";\nimport \"@openzeppelin/contracts/utils/math/SafeMath.sol\";\nimport \"@openzeppelin/contracts/utils/math/Math.sol\";\n\n// Fee Schedule in BP - Initial total fee 13% maximum fee total is 20%\nuint16 constant FEE_MAX_TOTAL = 2000;\n\n// Indexes of internal wallets\nuint8 constant WALLET_DEV_MARKET = 0;\nuint8 constant WALLET_CHARITY = 1;\nuint8 constant WALLET_RESOURCE_LIQUIDITY = 2;\n\nuint8 constant FEE_REFLECTION = 0;\nuint8 constant FEE_DEV_MARKET = 1;\nuint8 constant FEE_CHARITY = 2;\nuint8 constant FEE_RESOURCE_LIQUIDITY = 3;\n\nuint256 constant FIRST_TX_DELAY = 1 days;\nuint256 constant TX_DELAY = 90;\n\nstruct TokenParams {\n    string name;\n    string symbol;\n    uint8 decimals;\n    uint256 totalSupply;\n    uint256 goLiveDate;\n}\n\nstruct Account {\n    uint256 balance;\n    bool excluded;\n    bool locked;\n    uint256 lastReflectedTick;\n    uint256 lastTX;\n    uint256 firstTX;\n    mapping(address => uint256) allowances;\n}\n\ncontract RetroVisionToken is IERC20, Context, ReentrancyGuard, Ownable {\n    using Address for address;\n\n    using SafeMath for uint256;\n    using SafeMath for uint16;\n    using SafeMath for uint8;\n\n    using Counters for Counters.Counter;\n\n    TokenParams private _tokenParams;\n\n    // Wallets\n    mapping(uint8 => address) private _internalWallets;\n    mapping(uint8 => bool) private _immutableWallet;\n\n    // Tracking of fee schedules\n    mapping(uint8 => uint16) private _feeSchedule;\n\n    // Reflections\n    uint256 private _totalReflections;\n    Counters.Counter private _totalReflectionTicks;\n\n    mapping(uint8 => uint256) private _totalFeesCollected;\n\n    // Accounting of account states\n    mapping(address => Account) private _accounts;\n\n    // Token limits\n    uint256[] private _limitCapSchedule;\n    uint256[] private _limitTxSchedule;\n\n    /**\n     * Constructor\n     */\n    constructor(\n        string memory _name,\n        string memory _symbol,\n        uint8 _decimals,\n        uint256 _supply,\n        address _devMarketWallet,\n        address _charityWallet,\n        address _resourceLiquidityWallet\n    ) {\n        // Initialize token parameters\n        _tokenParams.name = _name;\n        _tokenParams.symbol = _symbol;\n        _tokenParams.decimals = _decimals;\n        _tokenParams.totalSupply = _supply.mul(10**uint256(_decimals)); // Convert to retrowei\n\n        _totalReflections = 0;\n        _totalReflectionTicks.increment();\n\n        _totalFeesCollected[FEE_REFLECTION] = 0;\n        _totalFeesCollected[FEE_DEV_MARKET] = 0;\n        _totalFeesCollected[FEE_CHARITY] = 0;\n        _totalFeesCollected[FEE_RESOURCE_LIQUIDITY] = 0;\n\n        // Initial token limits\n        _limitCapSchedule = [\n            Finance.calculateFeeAmount(_tokenParams.totalSupply, 50), // 0.5%\n            Finance.calculateFeeAmount(_tokenParams.totalSupply, 100), // 1.0%\n            Finance.calculateFeeAmount(_tokenParams.totalSupply, 500), // 5.0%\n            Finance.calculateFeeAmount(_tokenParams.totalSupply, 1000) // 10.0%\n        ];\n\n        // 10%, 25%, 50%, 100%\n        _limitTxSchedule = [1000, 2500, 5000, 10000];\n\n        // Initialize internal wallets\n        setInternalWalletAddress(WALLET_DEV_MARKET, _devMarketWallet);\n        setInternalWalletAddress(WALLET_CHARITY, _charityWallet);\n        setInternalWalletAddress(WALLET_RESOURCE_LIQUIDITY, _resourceLiquidityWallet);\n\n        // Set initial fees\n        setFee(FEE_REFLECTION, 300);\n        setFee(FEE_DEV_MARKET, 200);\n        setFee(FEE_CHARITY, 200);\n        setFee(FEE_RESOURCE_LIQUIDITY, 200);\n\n        // Calculate seed amounts 5% + 2% + 15% = 22%\n        uint256 _devMarketSeed = Finance.calculateFeeAmount(\n            _tokenParams.totalSupply,\n            500\n        ); // 5%\n        uint256 _charitySeed = Finance.calculateFeeAmount(\n            _tokenParams.totalSupply,\n            200\n        ); // 5%\n        uint256 _resourceLiquiditySeed = Finance.calculateFeeAmount(\n            _tokenParams.totalSupply,\n            1500\n        ); // 15%\n\n        // Remaining 65% to Liquidity and 10% to Vesting Wallet\n        uint256 _remainingSeed = _tokenParams.totalSupply.sub(\n            _devMarketSeed.add(_charitySeed).add(_resourceLiquiditySeed)\n        );\n\n        // Seed distributions\n        _accounts[_devMarketWallet].balance = _devMarketSeed;\n        _accounts[_charityWallet].balance = _charitySeed;\n        _accounts[_resourceLiquidityWallet].balance = _resourceLiquiditySeed;\n        _accounts[_msgSender()].balance = _remainingSeed;\n\n        // Exclude addresses from tax calculations\n        setAccountExcluded(\n            _devMarketWallet,\n            true,\n            \"Constructor: Dev Marketing address exclusion\"\n        );\n        setAccountExcluded(\n            _charityWallet,\n            true,\n            \"Constructor: Charity address exclusion\"\n        );\n        setAccountExcluded(\n            _resourceLiquidityWallet,\n            true,\n            \"Constructor: Resource Liquidity address exclusion\"\n        );\n\n        emit Transfer(address(0), _devMarketWallet, _devMarketSeed);\n        emit Transfer(address(0), _charityWallet, _charitySeed);\n        emit Transfer(address(0), _resourceLiquidityWallet, _resourceLiquiditySeed);\n        emit Transfer(address(0), _msgSender(), _remainingSeed);\n    }\n\n    // TODO: What to do here, accept, return, or reject?\n    receive() external payable {\n        revert(\"Generic receive\");\n    }\n\n    fallback() external payable {\n        revert(\"Generic fallback\");\n    }\n\n    function name() public view virtual returns (string memory) {\n        return _tokenParams.name;\n    }\n\n    function symbol() public view virtual returns (string memory) {\n        return _tokenParams.symbol;\n    }\n\n    function decimals() public view virtual returns (uint8) {\n        return _tokenParams.decimals;\n    }\n\n    function totalSupply() public view override returns (uint256) {\n        return _tokenParams.totalSupply;\n    }\n\n    function isLive() public view returns (bool) {\n        return _tokenParams.goLiveDate != 0;\n    }\n\n    function goLive() public onlyOwner {\n        require(!isLive(), \"ERC20: Token already live\");\n        _tokenParams.goLiveDate = block.timestamp;\n\n        emit GoLive();\n    }\n\n    function reflectionBalanceOf(address _account)\n        public\n        view\n        returns (uint256)\n    {\n        uint256 _currentReflectionTick = _totalReflectionTicks.current();\n\n        // Return 0 if account is excluded, there are no reflections\n        if (\n            _accounts[_account].excluded ||\n            _totalReflections == 0 ||\n            _currentReflectionTick == 0 ||\n            _accounts[_account].lastReflectedTick >= _currentReflectionTick\n        ) return 0;\n\n        // Reflection balance or \"owed\" is equal to a percentage of the totalReflections\n        // as the accounts ownership share of the total supply minus the total reflections paid\n        // RB = (TR * (O / TS)) - RP\n\n        uint256 _ownershipShareBP = Finance.calculateBP(\n            _accounts[_account].balance,\n            _tokenParams.totalSupply\n        );\n\n        uint256 _reflectionShareBP = Finance.calculateBP(\n            _currentReflectionTick.sub(_accounts[_account].lastReflectedTick),\n            _currentReflectionTick\n        );\n\n        uint256 _reflectionShare = Finance.calculateFeeAmount(\n            _totalReflections,\n            _reflectionShareBP\n        );\n        uint256 _reflectionOwed = Finance.calculateFeeAmount(\n            _reflectionShare,\n            _ownershipShareBP\n        );\n\n        return _reflectionOwed;\n    }\n\n    function balanceOf(address _account)\n        public\n        view\n        override\n        returns (uint256)\n    {\n        uint256 _tokensOwned = _accounts[_account].balance;\n        if (!_accounts[_account].excluded) {\n            _tokensOwned = _tokensOwned.add(reflectionBalanceOf(_account));\n        }\n\n        return _tokensOwned;\n    }\n\n    function setAccountExcluded(\n        address _account,\n        bool _excluded,\n        string memory _reason\n    ) public onlyOwner {\n        require(_accounts[_account].excluded != _excluded, \"ERC20: No change\");\n\n        _accounts[_account].excluded = _excluded;\n\n        emit AccountExclusionStatusChanged(_account, _excluded, _reason);\n    }\n\n    function isExcluded(address _account) public view returns (bool) {\n        return _accounts[_account].excluded;\n    }\n\n    function setAccountLocked(\n        address _account,\n        bool _locked,\n        string memory _reason\n    ) public onlyOwner {\n        require(_accounts[_account].locked != _locked, \"ERC20: No change\");\n\n        _accounts[_account].locked = _locked;\n\n        emit AccountLockedStatusChanged(_account, _locked, _reason);\n    }\n\n    function isLocked(address _account) public view returns (bool) {\n        return _accounts[_account].locked;\n    }\n\n    function totalReflections() public view returns (uint256) {\n        return _totalReflections;\n    }\n\n    function allowance(address _owner, address _spender)\n        public\n        view\n        override\n        returns (uint256)\n    {\n        return _accounts[_owner].allowances[_spender];\n    }\n\n    function increaseAllowance(address _spender, uint256 _amount)\n        public\n        virtual\n        returns (bool)\n    {\n        address _sender = _msgSender();\n        _approve(\n            _sender,\n            _spender,\n            _accounts[_sender].allowances[_spender].add(_amount)\n        );\n        return true;\n    }\n\n    function decreaseAllowance(address _spender, uint256 _amount)\n        public\n        virtual\n        returns (bool)\n    {\n        address _sender = _msgSender();\n        _approve(\n            _sender,\n            _spender,\n            _accounts[_sender].allowances[_spender].sub(\n                _amount,\n                \"ERC20: decreased allowance below zero\"\n            )\n        );\n        return true;\n    }\n\n    function approve(address _spender, uint256 _amount)\n        public\n        override\n        nonReentrant\n        returns (bool)\n    {\n        _approve(_msgSender(), _spender, _amount);\n        return true;\n    }\n\n    function _approve(\n        address _owner,\n        address _spender,\n        uint256 _amount\n    ) private {\n        require(_owner != address(0), \"ERC20: approve from the zero address\");\n        require(_spender != address(0), \"ERC20: approve to the zero address\");\n\n        _accounts[_owner].allowances[_spender] = _amount;\n        emit Approval(_owner, _spender, _amount);\n    }\n\n    function transferFrom(\n        address _spender,\n        address _recipient,\n        uint256 _amount\n    ) public override returns (bool) {\n        address _sender = _msgSender();\n        _transfer(_spender, _recipient, _amount);\n        _approve(\n            _spender,\n            _sender,\n            _accounts[_spender].allowances[_sender].sub(\n                _amount,\n                \"ERC20: transfer amount exceeds allowance\"\n            )\n        );\n        return true;\n    }\n\n    function transfer(address _recipient, uint256 _amount)\n        public\n        override\n        returns (bool)\n    {\n        _transfer(_msgSender(), _recipient, _amount);\n        return true;\n    }\n\n    function _intitalizeAccount(address _account) private {\n        // Set initial tick on new holder account, to set their stake against the total supply\n        if (_accounts[_account].firstTX == 0) {\n            _accounts[_account].firstTX = block.timestamp;\n            _accounts[_account].lastTX = block.timestamp;\n            _accounts[_account].lastReflectedTick = _totalReflectionTicks\n                .current()\n                .add(1);\n\n            emit AccountCreated(_account);\n        }\n    }\n\n    function _applyReflectedFunds(address _account)\n        internal\n        nonReentrant\n        returns (uint256)\n    {\n        if (_accounts[_account].excluded) return 0;\n\n        uint256 _reflectionOwed = reflectionBalanceOf(_account);\n\n        _accounts[_account].balance = _accounts[_account].balance.add(\n            _reflectionOwed\n        );\n\n        _totalReflections = _totalReflections.sub(_reflectionOwed);\n\n        _accounts[_account].lastReflectedTick = _totalReflectionTicks\n            .current()\n            .add(1);\n\n        emit ReflectionApplied(_account, _reflectionOwed);\n\n        return _reflectionOwed;\n    }\n\n    function _transfer(\n        address _sender,\n        address _recipient,\n        uint256 _amount\n    ) private {\n        if (_sender != owner()) {\n            // If pre-golive we emit event and revert TX, only owner can tranfer tokens to other accounts\n            // such as a Liquidity pool, vesting contracts or other startup accounts\n            if (!isLive()) {\n                emit EarlyTransferFailed(_sender, _recipient, _amount);\n                revert(\"ERC20: token not yet live on-chain\");\n            }\n\n            if (!_accounts[_sender].excluded) {\n                // TX delay enforced on non-excluded accounts for FIRST_TX_DELAY after account creation\n                require(\n                    block.timestamp.sub(_accounts[_sender].firstTX) >\n                        FIRST_TX_DELAY,\n                    \"ERC20: transfer failed, intial wait period not met\"\n                );\n\n                // TX delay enforced on non-excluded accounts\n                require(\n                    block.timestamp.sub(_accounts[_sender].lastTX) > TX_DELAY,\n                    \"ERC20: transfer failed, arbitrage delay not met\"\n                );\n            }\n        }\n\n        // Reject TX for locked accounts\n        require(\n            !_accounts[_sender].locked && !_accounts[_recipient].locked,\n            \"ERC20: transfer failed, account is locked\"\n        );\n\n        // After fees taken and reflection ticks have incremented we apply reflection balance to sender\n        _applyReflectedFunds(_sender);\n\n        // Initialize accounts if not yet initialized\n        _intitalizeAccount(_sender);\n        _intitalizeAccount(_recipient);\n\n        uint256 _senderBalance = balanceOf(_sender);\n        require(\n            _amount <= _senderBalance,\n            \"ERC20: transfer amount exceeds senders balance\"\n        );\n        require(\n            _amount > 0,\n            \"ERC20: transfer amount must be greater than zero\"\n        );\n        require(_sender != _recipient, \"ERC20: transfer to self\");\n\n        // TODO: Transfer to Zero would equate to a burn, how should this be handled?\n        require(_sender != address(0), \"ERC20: transfer from the zero address\");\n\n        uint256 _finalAmount = _amount;\n        if (!_accounts[_sender].excluded) {\n            require(\n                _accounts[_recipient].balance.add(_amount) <=\n                    getHoldingCap(_recipient),\n                \"ERC20: transfer will exceed recipient holding cap\"\n            );\n            require(\n                _amount <= getTXCap(_sender),\n                \"ERC20: transfer amount exceeds TX cap\"\n            );\n\n            // Apply TX fees to TX when sender or recipient is a contract\n            // Covers routers and other defi contracts\n            // Liquidity address will be gated by exclusion list once contract is set as internal\n            if (_sender.isContract() || _recipient.isContract()) {\n                _finalAmount = _amount.sub(_applyFees(_amount));\n            }\n        }\n\n        _accounts[_sender].balance = _accounts[_sender].balance.sub(\n            _amount,\n            \"ERC20: transfer amount exceeds balance\"\n        );\n\n        uint256 _recipientBalance = _accounts[_recipient].balance;\n        _accounts[_recipient].balance = _recipientBalance.add(_finalAmount);\n\n        _accounts[_sender].lastTX = block.timestamp;\n        _accounts[_recipient].lastTX = block.timestamp;\n\n        emit Transfer(_sender, _recipient, _finalAmount);\n    }\n\n    /**\n     * @notice Applies fees for a given amount of tokens to internally manage wallets\n     * @param _amount The amount of tokens to collect fees for.\n     * @return The total fees collected.\n     */\n    function _applyFees(uint256 _amount) private returns (uint256) {\n        // Calculate fees based on sender address\n        (\n            uint256 _reflectionFee,\n            uint256 _devMarketFee,\n            uint256 _charityFee,\n            uint256 _resourceLiquidityFee,\n            uint256 _totalFee\n        ) = calculateFeeAmounts(_amount);\n\n        // Get current balances\n        uint256 _devMarketBalance = _accounts[\n            _internalWallets[WALLET_DEV_MARKET]\n        ].balance;\n        uint256 _charityBalance = _accounts[_internalWallets[WALLET_CHARITY]]\n            .balance;\n        uint256 _resourceLiquidityBalance = _accounts[\n            _internalWallets[WALLET_RESOURCE_LIQUIDITY]\n        ].balance;\n\n        // Reflection\n        _totalReflections = _totalReflections.add(_reflectionFee);\n        _totalReflectionTicks.increment();\n        _totalFeesCollected[FEE_REFLECTION] = _totalFeesCollected[\n            FEE_REFLECTION\n        ].add(_reflectionFee);\n\n        emit ReflectedAmount(_reflectionFee, _totalReflectionTicks.current());\n\n        // Dev Market\n        _accounts[_internalWallets[WALLET_DEV_MARKET]]\n            .balance = _devMarketBalance.add(_devMarketFee);\n\n        _totalFeesCollected[FEE_DEV_MARKET] = _totalFeesCollected[\n            FEE_DEV_MARKET\n        ].add(_devMarketFee);\n\n        emit DevMarketingFeeApplied(_devMarketFee);\n\n        // Charity\n        _accounts[_internalWallets[WALLET_CHARITY]].balance = _charityBalance\n            .add(_charityFee);\n\n        _totalFeesCollected[FEE_CHARITY] = _totalFeesCollected[FEE_CHARITY].add(\n            _charityFee\n        );\n\n        emit CharityFeeApplied(_charityFee);\n\n        // Resource Liquidity\n        _accounts[_internalWallets[WALLET_RESOURCE_LIQUIDITY]]\n            .balance = _resourceLiquidityBalance.add(_resourceLiquidityFee);\n\n        _totalFeesCollected[FEE_RESOURCE_LIQUIDITY] = _totalFeesCollected[\n            FEE_RESOURCE_LIQUIDITY\n        ].add(_resourceLiquidityFee);\n\n        emit ResourceLiquidityFeeApplied(_resourceLiquidityFee);\n\n        return _totalFee;\n    }\n\n    /**\n     * Fee management\n     */\n\n    /**\n     * @notice Calculate and return values for current fee schedule based on amount and address exclusion\n     * @param _amount Amount of tokens to calculate fees for\n     * @return reflection_fee, dev_market_fee, charity_fee, resource_liquidity_fee, liquidity_fee, total_fee\n     */\n    function calculateFeeAmounts(uint256 _amount)\n        internal\n        view\n        returns (\n            uint256,\n            uint256,\n            uint256,\n            uint256,\n            uint256\n        )\n    {\n        uint256 _reflectionFee = Finance.calculateFeeAmount(\n            _amount,\n            _feeSchedule[FEE_REFLECTION]\n        );\n        uint256 _devMarketFee;\n        uint256 _charityFee;\n        uint256 _resourceLiquidityFee;\n\n        if (_internalWallets[WALLET_DEV_MARKET] != address(0)) {\n            _devMarketFee = Finance.calculateFeeAmount(\n                _amount,\n                _feeSchedule[FEE_DEV_MARKET]\n            );\n        }\n\n        if (_internalWallets[WALLET_CHARITY] != address(0)) {\n            _charityFee = Finance.calculateFeeAmount(\n                _amount,\n                _feeSchedule[FEE_CHARITY]\n            );\n        }\n\n        if (_internalWallets[WALLET_RESOURCE_LIQUIDITY] != address(0)) {\n            _resourceLiquidityFee = Finance.calculateFeeAmount(\n                _amount,\n                _feeSchedule[FEE_RESOURCE_LIQUIDITY]\n            );\n        }\n\n        uint256 _totalFee = _reflectionFee\n            .add(_devMarketFee)\n            .add(_charityFee)\n            .add(_resourceLiquidityFee);\n\n        return (\n            _reflectionFee,\n            _devMarketFee,\n            _charityFee,\n            _resourceLiquidityFee,\n            _totalFee\n        );\n    }\n\n    /**\n     * @notice Return the current fee schedule\n     * @return The current fee schedule (reflection, dev market, charity, resource liquidity)\n     */\n    function getFees()\n        public\n        view\n        returns (\n            uint256,\n            uint256,\n            uint256,\n            uint256\n        )\n    {\n        return (\n            _feeSchedule[FEE_REFLECTION],\n            _feeSchedule[FEE_DEV_MARKET],\n            _feeSchedule[FEE_CHARITY],\n            _feeSchedule[FEE_RESOURCE_LIQUIDITY]\n        );\n    }\n\n    /**\n     * @notice Returns the previous and current fee from the schedule for the requested fee type\n     * @param _feeType UINT of the FeeTypes ENUM you are requesting\n     * @return current fee amount in basis points % = value / 1000\n     */\n    function getFee(uint8 _feeType) public view returns (uint256) {\n        return (_feeSchedule[_feeType]);\n    }\n\n    /**\n     * @notice Update fee schedule, setting _feeType to new value\n     * @param _feeType UINT of the FeeTypes ENUM you are updating\n     * @param _newFee UINT of the new fee as a value in basis points\n     */\n    function setFee(uint8 _feeType, uint16 _newFee) public onlyOwner {\n        require(\n            (\n                _feeSchedule[FEE_REFLECTION]\n                    .add(_feeSchedule[FEE_DEV_MARKET])\n                    .add(_feeSchedule[FEE_CHARITY])\n                    .add(_feeSchedule[FEE_RESOURCE_LIQUIDITY])\n                    .add(_newFee)\n            ).sub(_feeSchedule[_feeType]) <= FEE_MAX_TOTAL,\n            \"ERC20: proposed fee schedule exceeds limit of 20%\"\n        );\n\n        uint16 _oldFee = _feeSchedule[_feeType];\n        require(_newFee != _oldFee, \"ERC20: fee already set\");\n\n        // Update current schedule\n        _feeSchedule[_feeType] = _newFee;\n\n        emit FeeUpdated(_feeType, _oldFee, _newFee);\n    }\n\n    /**\n     * @notice Returns the lifetime totals for each fee type\n     * @return total_collected_reflection_fees, total_collected_dev_market_fees,\n     *         total_collected_charity_fees, total_collected_resource_liquidity_fees\n     */\n    function getTotalFeesCollected()\n        public\n        view\n        returns (\n            uint256,\n            uint256,\n            uint256,\n            uint256\n        )\n    {\n        return (\n            _totalFeesCollected[FEE_REFLECTION],\n            _totalFeesCollected[FEE_DEV_MARKET],\n            _totalFeesCollected[FEE_CHARITY],\n            _totalFeesCollected[FEE_RESOURCE_LIQUIDITY]\n        );\n    }\n\n    /**\n     * @notice Fetch the current balance for the requested internal wallet\n     * @return balance in Token Units\n     */\n    function getInternalBalance(uint8 _walletType)\n        public\n        view\n        returns (uint256)\n    {\n        return _accounts[_internalWallets[_walletType]].balance;\n    }\n\n    /**\n     * @notice Fetch the current address for the requested internal wallet\n     * @return address and mutability of the internal wallet\n     */\n    function getInternalWalletAddress(uint8 _walletType)\n        public\n        view\n        returns (address, bool)\n    {\n        return (_internalWallets[_walletType], _immutableWallet[_walletType]);\n    }\n\n    /**\n     * @notice Allow contract owner to update internal addresses in the event of breach or other event.\n     * Once project matures this is to be set to a form of contract based wallet at which point that wallet\n     * type becomes immutable.\n     * @param _walletType the type of internal wallet we are updating the address for\n     * @param _newAddress the new address to set the internal wallet too. Set to contract address to freeze type\n     */\n    function setInternalWalletAddress(uint8 _walletType, address _newAddress)\n        public\n        onlyOwner\n    {\n        require(\n            _newAddress != address(0),\n            \"ERC20: internal wallet must not be 0\"\n        );\n        require(\n            _newAddress != address(this),\n            \"ERC20: internal wallet must not be this contract\"\n        );\n        require(\n            _newAddress != _internalWallets[_walletType],\n            \"ERC20: new address must not be same\"\n        );\n        require(\n            !_immutableWallet[_walletType],\n            \"ERC20: internal address is immutable\"\n        );\n\n        address _oldAddress = _internalWallets[_walletType];\n        _internalWallets[_walletType] = _newAddress;\n\n        emit InternalWalletAddressChanged(\n            _walletType,\n            _oldAddress,\n            _newAddress\n        );\n\n        // Automated transfer of all tokens to new address\n        _accounts[_newAddress].balance = _accounts[_oldAddress].balance;\n        _accounts[_oldAddress].balance = 0;\n\n        emit Transfer(_oldAddress, _newAddress, _accounts[_newAddress].balance);\n\n        // Freeze this internal wallet type from future change, hope you meant to do this!\n        if (_newAddress.isContract()) {\n            _immutableWallet[_walletType] = true;\n            emit InternalWalletAddressMadeImmutable(\n                _walletType,\n                _oldAddress,\n                _newAddress\n            );\n        }\n    }\n\n    /**\n     * @notice Fetch the current maximum holding cap based on the age of the contract\n     * @return number of tokens account may hold as WEI\n     */\n    function getHoldingCap(address _account) public view returns (uint256) {\n        if (_accounts[_account].excluded) {\n            return _tokenParams.totalSupply;\n        }\n\n        if (!isLive()) return 0;\n\n        uint256 _seconds = block.timestamp.sub(_tokenParams.goLiveDate);\n\n        // After 6 months remove all holding caps\n        if (_seconds > 180 days) return _tokenParams.totalSupply;\n\n        return _limitCapSchedule[Math.min((_seconds.div(30 days)), 3)];\n    }\n\n    /**\n     * @notice Fetch the current maximum TX cap based on the age of the contract\n     * @return number of tokens account may hold as WEI\n     */\n    function getTXCap(address _account) public view returns (uint256) {\n        if (_accounts[_account].excluded) {\n            return _tokenParams.totalSupply;\n        }\n\n        if (!isLive()) return 0;\n\n        uint256 _seconds = block.timestamp.sub(_tokenParams.goLiveDate);\n        uint256 _limit = _limitTxSchedule[Math.min((_seconds.div(30 days)), 3)];\n        uint256 _holdingCap = getHoldingCap(_account);\n\n        return Finance.calculateFeeAmount(_holdingCap, _limit);\n    }\n\n    /**\n     * @notice Fetch the number of seconds remaining until address is eligible to make a transaction\n     * @return Seconds remaining until address is eligible to make a transaction\n     */\n    function getRemainingTXWait(address _account)\n        public\n        view\n        returns (uint256)\n    {\n        if (_accounts[_account].excluded) {\n            return 0;\n        }\n\n        // Initial delay\n        if (block.timestamp.sub(_accounts[_account].firstTX) < FIRST_TX_DELAY) {\n            uint256 _initialWait = block.timestamp.sub(\n                _accounts[_account].firstTX\n            );\n            return\n                _initialWait > FIRST_TX_DELAY\n                    ? 0\n                    : FIRST_TX_DELAY.sub(_initialWait);\n        }\n        // Arbitrage delay, we are already past initial delay\n        else if (block.timestamp.sub(_accounts[_account].lastTX) < TX_DELAY) {\n            uint256 _arbitrageWait = block.timestamp.sub(\n                _accounts[_account].lastTX\n            );\n            return _arbitrageWait > TX_DELAY ? 0 : TX_DELAY.sub(_arbitrageWait);\n        }\n\n        return 0;\n    }\n\n    /*************************************************************************\n     * Events\n     *************************************************************************/\n\n    // Emmitted when a fee is updated\n    event FeeUpdated(uint8 _feeType, uint16 _oldFee, uint16 _newFee);\n\n    // Emmitted when fee has been applied ie: transferred to wallet\n    event DevMarketingFeeApplied(uint256 _amount);\n    event CharityFeeApplied(uint256 _amount);\n    event ResourceLiquidityFeeApplied(uint256 _amount);\n\n    // Emitted when reflection has been collected to reflection pool\n    event ReflectedAmount(uint256 _amount, uint256 _ticks);\n\n    // Emitted when an account has performed an action that results in a reflection\n    // liquidity event committing their reflection share to their wallet\n    event ReflectionApplied(address indexed _account, uint256 _reflectionOwed);\n\n    // Emmitted when an internal wallet has been updated\n    event InternalWalletAddressChanged(\n        uint8 _walletType,\n        address indexed _oldAddress,\n        address indexed _newAddress\n    );\n\n    // Emmited when an internal wallet converts to a contract wallet and becomes immutable\n    event InternalWalletAddressMadeImmutable(\n        uint8 _walletType,\n        address indexed _oldAddress,\n        address indexed _newAddress\n    );\n\n    // Emmitted when a new account has been added to the contract\n    event AccountCreated(address indexed _account);\n\n    // Emmitted when an account has been excluded from fees\n    event AccountExclusionStatusChanged(\n        address indexed _account,\n        bool _excluded,\n        string _reason\n    );\n\n    // Emmitted when an account's locked status has been changed\n    event AccountLockedStatusChanged(\n        address indexed _account,\n        bool _locked,\n        string _reason\n    );\n\n    // Emmitted when the token goLive has been called and the token TX mechanism has been made globally active\n    event GoLive();\n\n    // Emmitted when the transfer function called prior to goLive\n    event EarlyTransferFailed(\n        address indexed _from,\n        address indexed _to,\n        uint256 _value\n    );\n}\n"
    },
    "@openzeppelin/contracts/access/Ownable.sol": {
      "content": "// SPDX-License-Identifier: MIT\n// OpenZeppelin Contracts v4.4.1 (access/Ownable.sol)\n\npragma solidity ^0.8.0;\n\nimport \"../utils/Context.sol\";\n\n/**\n * @dev Contract module which provides a basic access control mechanism, where\n * there is an account (an owner) that can be granted exclusive access to\n * specific functions.\n *\n * By default, the owner account will be the one that deploys the contract. This\n * can later be changed with {transferOwnership}.\n *\n * This module is used through inheritance. It will make available the modifier\n * `onlyOwner`, which can be applied to your functions to restrict their use to\n * the owner.\n */\nabstract contract Ownable is Context {\n    address private _owner;\n\n    event OwnershipTransferred(address indexed previousOwner, address indexed newOwner);\n\n    /**\n     * @dev Initializes the contract setting the deployer as the initial owner.\n     */\n    constructor() {\n        _transferOwnership(_msgSender());\n    }\n\n    /**\n     * @dev Returns the address of the current owner.\n     */\n    function owner() public view virtual returns (address) {\n        return _owner;\n    }\n\n    /**\n     * @dev Throws if called by any account other than the owner.\n     */\n    modifier onlyOwner() {\n        require(owner() == _msgSender(), \"Ownable: caller is not the owner\");\n        _;\n    }\n\n    /**\n     * @dev Leaves the contract without owner. It will not be possible to call\n     * `onlyOwner` functions anymore. Can only be called by the current owner.\n     *\n     * NOTE: Renouncing ownership will leave the contract without an owner,\n     * thereby removing any functionality that is only available to the owner.\n     */\n    function renounceOwnership() public virtual onlyOwner {\n        _transferOwnership(address(0));\n    }\n\n    /**\n     * @dev Transfers ownership of the contract to a new account (`newOwner`).\n     * Can only be called by the current owner.\n     */\n    function transferOwnership(address newOwner) public virtual onlyOwner {\n        require(newOwner != address(0), \"Ownable: new owner is the zero address\");\n        _transferOwnership(newOwner);\n    }\n\n    /**\n     * @dev Transfers ownership of the contract to a new account (`newOwner`).\n     * Internal function without access restriction.\n     */\n    function _transferOwnership(address newOwner) internal virtual {\n        address oldOwner = _owner;\n        _owner = newOwner;\n        emit OwnershipTransferred(oldOwner, newOwner);\n    }\n}\n"
    },
    "@openzeppelin/contracts/interfaces/IERC20.sol": {
      "content": "// SPDX-License-Identifier: MIT\n// OpenZeppelin Contracts v4.4.1 (interfaces/IERC20.sol)\n\npragma solidity ^0.8.0;\n\nimport \"../token/ERC20/IERC20.sol\";\n"
    },
    "@openzeppelin/contracts/security/ReentrancyGuard.sol": {
      "content": "// SPDX-License-Identifier: MIT\n// OpenZeppelin Contracts v4.4.1 (security/ReentrancyGuard.sol)\n\npragma solidity ^0.8.0;\n\n/**\n * @dev Contract module that helps prevent reentrant calls to a function.\n *\n * Inheriting from `ReentrancyGuard` will make the {nonReentrant} modifier\n * available, which can be applied to functions to make sure there are no nested\n * (reentrant) calls to them.\n *\n * Note that because there is a single `nonReentrant` guard, functions marked as\n * `nonReentrant` may not call one another. This can be worked around by making\n * those functions `private`, and then adding `external` `nonReentrant` entry\n * points to them.\n *\n * TIP: If you would like to learn more about reentrancy and alternative ways\n * to protect against it, check out our blog post\n * https://blog.openzeppelin.com/reentrancy-after-istanbul/[Reentrancy After Istanbul].\n */\nabstract contract ReentrancyGuard {\n    // Booleans are more expensive than uint256 or any type that takes up a full\n    // word because each write operation emits an extra SLOAD to first read the\n    // slot's contents, replace the bits taken up by the boolean, and then write\n    // back. This is the compiler's defense against contract upgrades and\n    // pointer aliasing, and it cannot be disabled.\n\n    // The values being non-zero value makes deployment a bit more expensive,\n    // but in exchange the refund on every call to nonReentrant will be lower in\n    // amount. Since refunds are capped to a percentage of the total\n    // transaction's gas, it is best to keep them low in cases like this one, to\n    // increase the likelihood of the full refund coming into effect.\n    uint256 private constant _NOT_ENTERED = 1;\n    uint256 private constant _ENTERED = 2;\n\n    uint256 private _status;\n\n    constructor() {\n        _status = _NOT_ENTERED;\n    }\n\n    /**\n     * @dev Prevents a contract from calling itself, directly or indirectly.\n     * Calling a `nonReentrant` function from another `nonReentrant`\n     * function is not supported. It is possible to prevent this from happening\n     * by making the `nonReentrant` function external, and making it call a\n     * `private` function that does the actual work.\n     */\n    modifier nonReentrant() {\n        // On the first call to nonReentrant, _notEntered will be true\n        require(_status != _ENTERED, \"ReentrancyGuard: reentrant call\");\n\n        // Any calls to nonReentrant after this point will fail\n        _status = _ENTERED;\n\n        _;\n\n        // By storing the original value once again, a refund is triggered (see\n        // https://eips.ethereum.org/EIPS/eip-2200)\n        _status = _NOT_ENTERED;\n    }\n}\n"
    },
    "@openzeppelin/contracts/utils/Address.sol": {
      "content": "// SPDX-License-Identifier: MIT\n// OpenZeppelin Contracts v4.4.1 (utils/Address.sol)\n\npragma solidity ^0.8.0;\n\n/**\n * @dev Collection of functions related to the address type\n */\nlibrary Address {\n    /**\n     * @dev Returns true if `account` is a contract.\n     *\n     * [IMPORTANT]\n     * ====\n     * It is unsafe to assume that an address for which this function returns\n     * false is an externally-owned account (EOA) and not a contract.\n     *\n     * Among others, `isContract` will return false for the following\n     * types of addresses:\n     *\n     *  - an externally-owned account\n     *  - a contract in construction\n     *  - an address where a contract will be created\n     *  - an address where a contract lived, but was destroyed\n     * ====\n     */\n    function isContract(address account) internal view returns (bool) {\n        // This method relies on extcodesize, which returns 0 for contracts in\n        // construction, since the code is only stored at the end of the\n        // constructor execution.\n\n        uint256 size;\n        assembly {\n            size := extcodesize(account)\n        }\n        return size > 0;\n    }\n\n    /**\n     * @dev Replacement for Solidity's `transfer`: sends `amount` wei to\n     * `recipient`, forwarding all available gas and reverting on errors.\n     *\n     * https://eips.ethereum.org/EIPS/eip-1884[EIP1884] increases the gas cost\n     * of certain opcodes, possibly making contracts go over the 2300 gas limit\n     * imposed by `transfer`, making them unable to receive funds via\n     * `transfer`. {sendValue} removes this limitation.\n     *\n     * https://diligence.consensys.net/posts/2019/09/stop-using-soliditys-transfer-now/[Learn more].\n     *\n     * IMPORTANT: because control is transferred to `recipient`, care must be\n     * taken to not create reentrancy vulnerabilities. Consider using\n     * {ReentrancyGuard} or the\n     * https://solidity.readthedocs.io/en/v0.5.11/security-considerations.html#use-the-checks-effects-interactions-pattern[checks-effects-interactions pattern].\n     */\n    function sendValue(address payable recipient, uint256 amount) internal {\n        require(address(this).balance >= amount, \"Address: insufficient balance\");\n\n        (bool success, ) = recipient.call{value: amount}(\"\");\n        require(success, \"Address: unable to send value, recipient may have reverted\");\n    }\n\n    /**\n     * @dev Performs a Solidity function call using a low level `call`. A\n     * plain `call` is an unsafe replacement for a function call: use this\n     * function instead.\n     *\n     * If `target` reverts with a revert reason, it is bubbled up by this\n     * function (like regular Solidity function calls).\n     *\n     * Returns the raw returned data. To convert to the expected return value,\n     * use https://solidity.readthedocs.io/en/latest/units-and-global-variables.html?highlight=abi.decode#abi-encoding-and-decoding-functions[`abi.decode`].\n     *\n     * Requirements:\n     *\n     * - `target` must be a contract.\n     * - calling `target` with `data` must not revert.\n     *\n     * _Available since v3.1._\n     */\n    function functionCall(address target, bytes memory data) internal returns (bytes memory) {\n        return functionCall(target, data, \"Address: low-level call failed\");\n    }\n\n    /**\n     * @dev Same as {xref-Address-functionCall-address-bytes-}[`functionCall`], but with\n     * `errorMessage` as a fallback revert reason when `target` reverts.\n     *\n     * _Available since v3.1._\n     */\n    function functionCall(\n        address target,\n        bytes memory data,\n        string memory errorMessage\n    ) internal returns (bytes memory) {\n        return functionCallWithValue(target, data, 0, errorMessage);\n    }\n\n    /**\n     * @dev Same as {xref-Address-functionCall-address-bytes-}[`functionCall`],\n     * but also transferring `value` wei to `target`.\n     *\n     * Requirements:\n     *\n     * - the calling contract must have an ETH balance of at least `value`.\n     * - the called Solidity function must be `payable`.\n     *\n     * _Available since v3.1._\n     */\n    function functionCallWithValue(\n        address target,\n        bytes memory data,\n        uint256 value\n    ) internal returns (bytes memory) {\n        return functionCallWithValue(target, data, value, \"Address: low-level call with value failed\");\n    }\n\n    /**\n     * @dev Same as {xref-Address-functionCallWithValue-address-bytes-uint256-}[`functionCallWithValue`], but\n     * with `errorMessage` as a fallback revert reason when `target` reverts.\n     *\n     * _Available since v3.1._\n     */\n    function functionCallWithValue(\n        address target,\n        bytes memory data,\n        uint256 value,\n        string memory errorMessage\n    ) internal returns (bytes memory) {\n        require(address(this).balance >= value, \"Address: insufficient balance for call\");\n        require(isContract(target), \"Address: call to non-contract\");\n\n        (bool success, bytes memory returndata) = target.call{value: value}(data);\n        return verifyCallResult(success, returndata, errorMessage);\n    }\n\n    /**\n     * @dev Same as {xref-Address-functionCall-address-bytes-}[`functionCall`],\n     * but performing a static call.\n     *\n     * _Available since v3.3._\n     */\n    function functionStaticCall(address target, bytes memory data) internal view returns (bytes memory) {\n        return functionStaticCall(target, data, \"Address: low-level static call failed\");\n    }\n\n    /**\n     * @dev Same as {xref-Address-functionCall-address-bytes-string-}[`functionCall`],\n     * but performing a static call.\n     *\n     * _Available since v3.3._\n     */\n    function functionStaticCall(\n        address target,\n        bytes memory data,\n        string memory errorMessage\n    ) internal view returns (bytes memory) {\n        require(isContract(target), \"Address: static call to non-contract\");\n\n        (bool success, bytes memory returndata) = target.staticcall(data);\n        return verifyCallResult(success, returndata, errorMessage);\n    }\n\n    /**\n     * @dev Same as {xref-Address-functionCall-address-bytes-}[`functionCall`],\n     * but performing a delegate call.\n     *\n     * _Available since v3.4._\n     */\n    function functionDelegateCall(address target, bytes memory data) internal returns (bytes memory) {\n        return functionDelegateCall(target, data, \"Address: low-level delegate call failed\");\n    }\n\n    /**\n     * @dev Same as {xref-Address-functionCall-address-bytes-string-}[`functionCall`],\n     * but performing a delegate call.\n     *\n     * _Available since v3.4._\n     */\n    function functionDelegateCall(\n        address target,\n        bytes memory data,\n        string memory errorMessage\n    ) internal returns (bytes memory) {\n        require(isContract(target), \"Address: delegate call to non-contract\");\n\n        (bool success, bytes memory returndata) = target.delegatecall(data);\n        return verifyCallResult(success, returndata, errorMessage);\n    }\n\n    /**\n     * @dev Tool to verifies that a low level call was successful, and revert if it wasn't, either by bubbling the\n     * revert reason using the provided one.\n     *\n     * _Available since v4.3._\n     */\n    function verifyCallResult(\n        bool success,\n        bytes memory returndata,\n        string memory errorMessage\n    ) internal pure returns (bytes memory) {\n        if (success) {\n            return returndata;\n        } else {\n            // Look for revert reason and bubble it up if present\n            if (returndata.length > 0) {\n                // The easiest way to bubble the revert reason is using memory via assembly\n\n                assembly {\n                    let returndata_size := mload(returndata)\n                    revert(add(32, returndata), returndata_size)\n                }\n            } else {\n                revert(errorMessage);\n            }\n        }\n    }\n}\n"
    },
    "@openzeppelin/contracts/utils/Context.sol": {
      "content": "// SPDX-License-Identifier: MIT\n// OpenZeppelin Contracts v4.4.1 (utils/Context.sol)\n\npragma solidity ^0.8.0;\n\n/**\n * @dev Provides information about the current execution context, including the\n * sender of the transaction and its data. While these are generally available\n * via msg.sender and msg.data, they should not be accessed in such a direct\n * manner, since when dealing with meta-transactions the account sending and\n * paying for execution may not be the actual sender (as far as an application\n * is concerned).\n *\n * This contract is only required for intermediate, library-like contracts.\n */\nabstract contract Context {\n    function _msgSender() internal view virtual returns (address) {\n        return msg.sender;\n    }\n\n    function _msgData() internal view virtual returns (bytes calldata) {\n        return msg.data;\n    }\n}\n"
    },
    "@openzeppelin/contracts/utils/Counters.sol": {
      "content": "// SPDX-License-Identifier: MIT\n// OpenZeppelin Contracts v4.4.1 (utils/Counters.sol)\n\npragma solidity ^0.8.0;\n\n/**\n * @title Counters\n * @author Matt Condon (@shrugs)\n * @dev Provides counters that can only be incremented, decremented or reset. This can be used e.g. to track the number\n * of elements in a mapping, issuing ERC721 ids, or counting request ids.\n *\n * Include with `using Counters for Counters.Counter;`\n */\nlibrary Counters {\n    struct Counter {\n        // This variable should never be directly accessed by users of the library: interactions must be restricted to\n        // the library's function. As of Solidity v0.5.2, this cannot be enforced, though there is a proposal to add\n        // this feature: see https://github.com/ethereum/solidity/issues/4637\n        uint256 _value; // default: 0\n    }\n\n    function current(Counter storage counter) internal view returns (uint256) {\n        return counter._value;\n    }\n\n    function increment(Counter storage counter) internal {\n        unchecked {\n            counter._value += 1;\n        }\n    }\n\n    function decrement(Counter storage counter) internal {\n        uint256 value = counter._value;\n        require(value > 0, \"Counter: decrement overflow\");\n        unchecked {\n            counter._value = value - 1;\n        }\n    }\n\n    function reset(Counter storage counter) internal {\n        counter._value = 0;\n    }\n}\n"
    },
    "@openzeppelin/contracts/utils/math/Math.sol": {
      "content": "// SPDX-License-Identifier: MIT\n// OpenZeppelin Contracts v4.4.1 (utils/math/Math.sol)\n\npragma solidity ^0.8.0;\n\n/**\n * @dev Standard math utilities missing in the Solidity language.\n */\nlibrary Math {\n    /**\n     * @dev Returns the largest of two numbers.\n     */\n    function max(uint256 a, uint256 b) internal pure returns (uint256) {\n        return a >= b ? a : b;\n    }\n\n    /**\n     * @dev Returns the smallest of two numbers.\n     */\n    function min(uint256 a, uint256 b) internal pure returns (uint256) {\n        return a < b ? a : b;\n    }\n\n    /**\n     * @dev Returns the average of two numbers. The result is rounded towards\n     * zero.\n     */\n    function average(uint256 a, uint256 b) internal pure returns (uint256) {\n        // (a + b) / 2 can overflow.\n        return (a & b) + (a ^ b) / 2;\n    }\n\n    /**\n     * @dev Returns the ceiling of the division of two numbers.\n     *\n     * This differs from standard division with `/` in that it rounds up instead\n     * of rounding down.\n     */\n    function ceilDiv(uint256 a, uint256 b) internal pure returns (uint256) {\n        // (a + b - 1) / b can overflow on addition, so we distribute.\n        return a / b + (a % b == 0 ? 0 : 1);\n    }\n}\n"
    },
    "@openzeppelin/contracts/token/ERC20/IERC20.sol": {
      "content": "// SPDX-License-Identifier: MIT\n// OpenZeppelin Contracts v4.4.1 (token/ERC20/IERC20.sol)\n\npragma solidity ^0.8.0;\n\n/**\n * @dev Interface of the ERC20 standard as defined in the EIP.\n */\ninterface IERC20 {\n    /**\n     * @dev Returns the amount of tokens in existence.\n     */\n    function totalSupply() external view returns (uint256);\n\n    /**\n     * @dev Returns the amount of tokens owned by `account`.\n     */\n    function balanceOf(address account) external view returns (uint256);\n\n    /**\n     * @dev Moves `amount` tokens from the caller's account to `recipient`.\n     *\n     * Returns a boolean value indicating whether the operation succeeded.\n     *\n     * Emits a {Transfer} event.\n     */\n    function transfer(address recipient, uint256 amount) external returns (bool);\n\n    /**\n     * @dev Returns the remaining number of tokens that `spender` will be\n     * allowed to spend on behalf of `owner` through {transferFrom}. This is\n     * zero by default.\n     *\n     * This value changes when {approve} or {transferFrom} are called.\n     */\n    function allowance(address owner, address spender) external view returns (uint256);\n\n    /**\n     * @dev Sets `amount` as the allowance of `spender` over the caller's tokens.\n     *\n     * Returns a boolean value indicating whether the operation succeeded.\n     *\n     * IMPORTANT: Beware that changing an allowance with this method brings the risk\n     * that someone may use both the old and the new allowance by unfortunate\n     * transaction ordering. One possible solution to mitigate this race\n     * condition is to first reduce the spender's allowance to 0 and set the\n     * desired value afterwards:\n     * https://github.com/ethereum/EIPs/issues/20#issuecomment-263524729\n     *\n     * Emits an {Approval} event.\n     */\n    function approve(address spender, uint256 amount) external returns (bool);\n\n    /**\n     * @dev Moves `amount` tokens from `sender` to `recipient` using the\n     * allowance mechanism. `amount` is then deducted from the caller's\n     * allowance.\n     *\n     * Returns a boolean value indicating whether the operation succeeded.\n     *\n     * Emits a {Transfer} event.\n     */\n    function transferFrom(\n        address sender,\n        address recipient,\n        uint256 amount\n    ) external returns (bool);\n\n    /**\n     * @dev Emitted when `value` tokens are moved from one account (`from`) to\n     * another (`to`).\n     *\n     * Note that `value` may be zero.\n     */\n    event Transfer(address indexed from, address indexed to, uint256 value);\n\n    /**\n     * @dev Emitted when the allowance of a `spender` for an `owner` is set by\n     * a call to {approve}. `value` is the new allowance.\n     */\n    event Approval(address indexed owner, address indexed spender, uint256 value);\n}\n"
    },
    "@openzeppelin/contracts/token/ERC20/ERC20.sol": {
      "content": "// SPDX-License-Identifier: MIT\n// OpenZeppelin Contracts v4.4.1 (token/ERC20/ERC20.sol)\n\npragma solidity ^0.8.0;\n\nimport \"./IERC20.sol\";\nimport \"./extensions/IERC20Metadata.sol\";\nimport \"../../utils/Context.sol\";\n\n/**\n * @dev Implementation of the {IERC20} interface.\n *\n * This implementation is agnostic to the way tokens are created. This means\n * that a supply mechanism has to be added in a derived contract using {_mint}.\n * For a generic mechanism see {ERC20PresetMinterPauser}.\n *\n * TIP: For a detailed writeup see our guide\n * https://forum.zeppelin.solutions/t/how-to-implement-erc20-supply-mechanisms/226[How\n * to implement supply mechanisms].\n *\n * We have followed general OpenZeppelin Contracts guidelines: functions revert\n * instead returning `false` on failure. This behavior is nonetheless\n * conventional and does not conflict with the expectations of ERC20\n * applications.\n *\n * Additionally, an {Approval} event is emitted on calls to {transferFrom}.\n * This allows applications to reconstruct the allowance for all accounts just\n * by listening to said events. Other implementations of the EIP may not emit\n * these events, as it isn't required by the specification.\n *\n * Finally, the non-standard {decreaseAllowance} and {increaseAllowance}\n * functions have been added to mitigate the well-known issues around setting\n * allowances. See {IERC20-approve}.\n */\ncontract ERC20 is Context, IERC20, IERC20Metadata {\n    mapping(address => uint256) private _balances;\n\n    mapping(address => mapping(address => uint256)) private _allowances;\n\n    uint256 private _totalSupply;\n\n    string private _name;\n    string private _symbol;\n\n    /**\n     * @dev Sets the values for {name} and {symbol}.\n     *\n     * The default value of {decimals} is 18. To select a different value for\n     * {decimals} you should overload it.\n     *\n     * All two of these values are immutable: they can only be set once during\n     * construction.\n     */\n    constructor(string memory name_, string memory symbol_) {\n        _name = name_;\n        _symbol = symbol_;\n    }\n\n    /**\n     * @dev Returns the name of the token.\n     */\n    function name() public view virtual override returns (string memory) {\n        return _name;\n    }\n\n    /**\n     * @dev Returns the symbol of the token, usually a shorter version of the\n     * name.\n     */\n    function symbol() public view virtual override returns (string memory) {\n        return _symbol;\n    }\n\n    /**\n     * @dev Returns the number of decimals used to get its user representation.\n     * For example, if `decimals` equals `2`, a balance of `505` tokens should\n     * be displayed to a user as `5.05` (`505 / 10 ** 2`).\n     *\n     * Tokens usually opt for a value of 18, imitating the relationship between\n     * Ether and Wei. This is the value {ERC20} uses, unless this function is\n     * overridden;\n     *\n     * NOTE: This information is only used for _display_ purposes: it in\n     * no way affects any of the arithmetic of the contract, including\n     * {IERC20-balanceOf} and {IERC20-transfer}.\n     */\n    function decimals() public view virtual override returns (uint8) {\n        return 18;\n    }\n\n    /**\n     * @dev See {IERC20-totalSupply}.\n     */\n    function totalSupply() public view virtual override returns (uint256) {\n        return _totalSupply;\n    }\n\n    /**\n     * @dev See {IERC20-balanceOf}.\n     */\n    function balanceOf(address account) public view virtual override returns (uint256) {\n        return _balances[account];\n    }\n\n    /**\n     * @dev See {IERC20-transfer}.\n     *\n     * Requirements:\n     *\n     * - `recipient` cannot be the zero address.\n     * - the caller must have a balance of at least `amount`.\n     */\n    function transfer(address recipient, uint256 amount) public virtual override returns (bool) {\n        _transfer(_msgSender(), recipient, amount);\n        return true;\n    }\n\n    /**\n     * @dev See {IERC20-allowance}.\n     */\n    function allowance(address owner, address spender) public view virtual override returns (uint256) {\n        return _allowances[owner][spender];\n    }\n\n    /**\n     * @dev See {IERC20-approve}.\n     *\n     * Requirements:\n     *\n     * - `spender` cannot be the zero address.\n     */\n    function approve(address spender, uint256 amount) public virtual override returns (bool) {\n        _approve(_msgSender(), spender, amount);\n        return true;\n    }\n\n    /**\n     * @dev See {IERC20-transferFrom}.\n     *\n     * Emits an {Approval} event indicating the updated allowance. This is not\n     * required by the EIP. See the note at the beginning of {ERC20}.\n     *\n     * Requirements:\n     *\n     * - `sender` and `recipient` cannot be the zero address.\n     * - `sender` must have a balance of at least `amount`.\n     * - the caller must have allowance for ``sender``'s tokens of at least\n     * `amount`.\n     */\n    function transferFrom(\n        address sender,\n        address recipient,\n        uint256 amount\n    ) public virtual override returns (bool) {\n        _transfer(sender, recipient, amount);\n\n        uint256 currentAllowance = _allowances[sender][_msgSender()];\n        require(currentAllowance >= amount, \"ERC20: transfer amount exceeds allowance\");\n        unchecked {\n            _approve(sender, _msgSender(), currentAllowance - amount);\n        }\n\n        return true;\n    }\n\n    /**\n     * @dev Atomically increases the allowance granted to `spender` by the caller.\n     *\n     * This is an alternative to {approve} that can be used as a mitigation for\n     * problems described in {IERC20-approve}.\n     *\n     * Emits an {Approval} event indicating the updated allowance.\n     *\n     * Requirements:\n     *\n     * - `spender` cannot be the zero address.\n     */\n    function increaseAllowance(address spender, uint256 addedValue) public virtual returns (bool) {\n        _approve(_msgSender(), spender, _allowances[_msgSender()][spender] + addedValue);\n        return true;\n    }\n\n    /**\n     * @dev Atomically decreases the allowance granted to `spender` by the caller.\n     *\n     * This is an alternative to {approve} that can be used as a mitigation for\n     * problems described in {IERC20-approve}.\n     *\n     * Emits an {Approval} event indicating the updated allowance.\n     *\n     * Requirements:\n     *\n     * - `spender` cannot be the zero address.\n     * - `spender` must have allowance for the caller of at least\n     * `subtractedValue`.\n     */\n    function decreaseAllowance(address spender, uint256 subtractedValue) public virtual returns (bool) {\n        uint256 currentAllowance = _allowances[_msgSender()][spender];\n        require(currentAllowance >= subtractedValue, \"ERC20: decreased allowance below zero\");\n        unchecked {\n            _approve(_msgSender(), spender, currentAllowance - subtractedValue);\n        }\n\n        return true;\n    }\n\n    /**\n     * @dev Moves `amount` of tokens from `sender` to `recipient`.\n     *\n     * This internal function is equivalent to {transfer}, and can be used to\n     * e.g. implement automatic token fees, slashing mechanisms, etc.\n     *\n     * Emits a {Transfer} event.\n     *\n     * Requirements:\n     *\n     * - `sender` cannot be the zero address.\n     * - `recipient` cannot be the zero address.\n     * - `sender` must have a balance of at least `amount`.\n     */\n    function _transfer(\n        address sender,\n        address recipient,\n        uint256 amount\n    ) internal virtual {\n        require(sender != address(0), \"ERC20: transfer from the zero address\");\n        require(recipient != address(0), \"ERC20: transfer to the zero address\");\n\n        _beforeTokenTransfer(sender, recipient, amount);\n\n        uint256 senderBalance = _balances[sender];\n        require(senderBalance >= amount, \"ERC20: transfer amount exceeds balance\");\n        unchecked {\n            _balances[sender] = senderBalance - amount;\n        }\n        _balances[recipient] += amount;\n\n        emit Transfer(sender, recipient, amount);\n\n        _afterTokenTransfer(sender, recipient, amount);\n    }\n\n    /** @dev Creates `amount` tokens and assigns them to `account`, increasing\n     * the total supply.\n     *\n     * Emits a {Transfer} event with `from` set to the zero address.\n     *\n     * Requirements:\n     *\n     * - `account` cannot be the zero address.\n     */\n    function _mint(address account, uint256 amount) internal virtual {\n        require(account != address(0), \"ERC20: mint to the zero address\");\n\n        _beforeTokenTransfer(address(0), account, amount);\n\n        _totalSupply += amount;\n        _balances[account] += amount;\n        emit Transfer(address(0), account, amount);\n\n        _afterTokenTransfer(address(0), account, amount);\n    }\n\n    /**\n     * @dev Destroys `amount` tokens from `account`, reducing the\n     * total supply.\n     *\n     * Emits a {Transfer} event with `to` set to the zero address.\n     *\n     * Requirements:\n     *\n     * - `account` cannot be the zero address.\n     * - `account` must have at least `amount` tokens.\n     */\n    function _burn(address account, uint256 amount) internal virtual {\n        require(account != address(0), \"ERC20: burn from the zero address\");\n\n        _beforeTokenTransfer(account, address(0), amount);\n\n        uint256 accountBalance = _balances[account];\n        require(accountBalance >= amount, \"ERC20: burn amount exceeds balance\");\n        unchecked {\n            _balances[account] = accountBalance - amount;\n        }\n        _totalSupply -= amount;\n\n        emit Transfer(account, address(0), amount);\n\n        _afterTokenTransfer(account, address(0), amount);\n    }\n\n    /**\n     * @dev Sets `amount` as the allowance of `spender` over the `owner` s tokens.\n     *\n     * This internal function is equivalent to `approve`, and can be used to\n     * e.g. set automatic allowances for certain subsystems, etc.\n     *\n     * Emits an {Approval} event.\n     *\n     * Requirements:\n     *\n     * - `owner` cannot be the zero address.\n     * - `spender` cannot be the zero address.\n     */\n    function _approve(\n        address owner,\n        address spender,\n        uint256 amount\n    ) internal virtual {\n        require(owner != address(0), \"ERC20: approve from the zero address\");\n        require(spender != address(0), \"ERC20: approve to the zero address\");\n\n        _allowances[owner][spender] = amount;\n        emit Approval(owner, spender, amount);\n    }\n\n    /**\n     * @dev Hook that is called before any transfer of tokens. This includes\n     * minting and burning.\n     *\n     * Calling conditions:\n     *\n     * - when `from` and `to` are both non-zero, `amount` of ``from``'s tokens\n     * will be transferred to `to`.\n     * - when `from` is zero, `amount` tokens will be minted for `to`.\n     * - when `to` is zero, `amount` of ``from``'s tokens will be burned.\n     * - `from` and `to` are never both zero.\n     *\n     * To learn more about hooks, head to xref:ROOT:extending-contracts.adoc#using-hooks[Using Hooks].\n     */\n    function _beforeTokenTransfer(\n        address from,\n        address to,\n        uint256 amount\n    ) internal virtual {}\n\n    /**\n     * @dev Hook that is called after any transfer of tokens. This includes\n     * minting and burning.\n     *\n     * Calling conditions:\n     *\n     * - when `from` and `to` are both non-zero, `amount` of ``from``'s tokens\n     * has been transferred to `to`.\n     * - when `from` is zero, `amount` tokens have been minted for `to`.\n     * - when `to` is zero, `amount` of ``from``'s tokens have been burned.\n     * - `from` and `to` are never both zero.\n     *\n     * To learn more about hooks, head to xref:ROOT:extending-contracts.adoc#using-hooks[Using Hooks].\n     */\n    function _afterTokenTransfer(\n        address from,\n        address to,\n        uint256 amount\n    ) internal virtual {}\n}\n"
    },
    "@openzeppelin/contracts/token/ERC20/extensions/IERC20Metadata.sol": {
      "content": "// SPDX-License-Identifier: MIT\n// OpenZeppelin Contracts v4.4.1 (token/ERC20/extensions/IERC20Metadata.sol)\n\npragma solidity ^0.8.0;\n\nimport \"../IERC20.sol\";\n\n/**\n * @dev Interface for the optional metadata functions from the ERC20 standard.\n *\n * _Available since v4.1._\n */\ninterface IERC20Metadata is IERC20 {\n    /**\n     * @dev Returns the name of the token.\n     */\n    function name() external view returns (string memory);\n\n    /**\n     * @dev Returns the symbol of the token.\n     */\n    function symbol() external view returns (string memory);\n\n    /**\n     * @dev Returns the decimals places of the token.\n     */\n    function decimals() external view returns (uint8);\n}\n"
    },
    "contracts/Test.sol": {
      "content": "// SPDX-License-Identifier: MIT\npragma solidity ^0.8.0;\n\nimport \"@openzeppelin/contracts/token/ERC20/ERC20.sol\";\n\ncontract Test is ERC20 {\n    uint8 private _decimals;\n\n    constructor() ERC20(\"Test\", \"TST\") {\n        _decimals = 18;\n    }\n}\n"
    }
  },
  "settings": {
    "metadata": {
      "bytecodeHash": "none",
      "useLiteralContent": true
    },
    "optimizer": {
      "enabled": true,
      "runs": 200
    },
    "outputSelection": {
      "*": {
        "*": [
          "abi",
          "evm.bytecode",
          "evm.deployedBytecode",
          "evm.methodIdentifiers",
          "metadata",
          "devdoc",
          "userdoc",
          "storageLayout",
          "evm.gasEstimates"
        ],
        "": [
          "ast"
        ]
      }
    },
    "libraries": {
      "": {
        "__CACHE_BREAKER__": "0x00000000d41867734bbee4c6863d9255b2b06ac1"
      }
    }
  }
}