{

"model": "lab_2.note", 
"pk": 1,
"fields": {"receiver": "Budi", 
           "sender": "Ahmad", 
           "title": "Perkenalan dari Ahmad", 
           "message": "Assalamualaikum, halo saya Ahmad dari Bogor"}

}