Motif,Mutability,SubA,SubC,SubG,SubT
TCGGG,0.000289019723543189,0.6875,0.25,0,0.0625
GCCGG,0.000325568279063364,0.24591754244139,0,0.178496362166532,0.575586095392078
CCGGG,0.000589013736469055,0.545454545454545,0.181818181818182,0,0.272727272727273
CCCGC,0.00059071323051805,0.245755860953921,0,0.178658043654002,0.575586095392078
GCCGC,0.000692302214313099,0.472527472527473,0,0.21978021978022,0.307692307692308
CCCGT,0.000739762228083137,0.384615384615385,0,0.384615384615385,0.230769230769231
AGGTC,0.00076015537010631,0.545517902256294,0.352818189737782,0,0.101663908005924
GGGGC,0.000761941970022853,0.432258064516129,0.258064516129032,0,0.309677419354839
CCCGA,0.000790746069745948,0.245475113122172,0,0.178894634776988,0.57563025210084
CAGGG,0.000810862990797111,0.620689655172414,0.241379310344828,0,0.137931034482759
GCCGA,0.000838344858021314,0.38265306122449,0,0.255102040816327,0.362244897959184
CTGAC,0.000906459238433359,0.551724137931034,0.189655172413793,0,0.258620689655172
ATGGG,0.000909744060904084,0.588329979879276,0.200704225352113,0,0.210965794768612
GAGGG,0.000917270866093557,0.62421185372005,0.171500630517024,0,0.204287515762926
GTCGA,0.000955959381182377,0.214285714285714,0,0.214285714285714,0.571428571428571
GGCGG,0.000962935396695466,0.23015873015873,0,0.126984126984127,0.642857142857143
CCCGG,0.000975348265734272,0.55,0,0.15,0.3
CCCTA,0.000981580119102504,0.181590506280342,0,0.371657547969484,0.446751945750173
CCCTT,0.000991776887435066,0.181590506280342,0,0.371657547969484,0.446751945750173
CCCCC,0.000996104965050622,0.443243243243243,0,0.162162162162162,0.394594594594595
GCCAA,0.00101418390726475,0.309782608695652,0,0.342391304347826,0.347826086956522
GCCCT,0.00104904419253441,0.724137931034483,0,0.0862068965517241,0.189655172413793
CAGAC,0.00110541790321145,0.551724137931034,0.189655172413793,0,0.258620689655172
ATGGC,0.00110827833520124,0.588329979879276,0.200704225352113,0,0.210965794768612
GCCAT,0.00111878011373308,0.447674418604651,0,0.174418604651163,0.377906976744186
GCGAC,0.0011570963186427,0.427618880505352,0.452886471310756,0,0.119494648183892
TTGGG,0.00116241114290418,0.588329979879276,0.200704225352113,0,0.210965794768612
CAGGC,0.00116696703672099,0.567283431455004,0.2263456686291,0,0.206370899915896
GTCCG,0.00117712386729674,0.270880361173815,0,0.200902934537246,0.528216704288939
GCCCC,0.00117964846056216,0.445736434108527,0,0.193798449612403,0.36046511627907
GGCGC,0.00119091146241831,0.23828125,0,0.12890625,0.6328125
GACGA,0.00123489277079443,0.38265306122449,0,0.255102040816327,0.362244897959184
TTGGC,0.00125959463759932,0.588329979879276,0.200704225352113,0,0.210965794768612
GCCGT,0.00127158272578559,0.384615384615385,0,0.136363636363636,0.479020979020979
CTGGC,0.0012827515378189,0.588329979879276,0.200704225352113,0,0.210965794768612
AAGGG,0.00129968805154357,0.547703180212014,0.258494156020658,0,0.193802663767328
AGGAG,0.0013105695829934,0.641263792966579,0.249662618083671,0,0.10907358894975
GCGGG,0.00132811006020304,0.525569760978321,0.28071150639244,0,0.193718732629238
AGAAC,0.00134050463538258,0,0.366107764935699,0.528731889956048,0.105160345108253
AAGGC,0.00136514561155518,0.509090909090909,0.275,0,0.215909090909091
TCGGC,0.00137999915560256,0.525569760978321,0.28071150639244,0,0.193718732629238
AGGGG,0.00138575926558189,0.69433669511249,0.145073700543057,0,0.160589604344453
GACAG,0.00139032880384298,0.261074458058435,0,0.309142318567389,0.429783223374175
GCGGC,0.00139592599885988,0.524694783573807,0.281076581576027,0,0.194228634850166
CCGGC,0.00145100986189642,0.525569760978321,0.28071150639244,0,0.193718732629238
AGGAC,0.00147593132893444,0.641263792966579,0.249662618083671,0,0.10907358894975
TAGGC,0.00149795063595791,0.465077373483898,0.304475115014638,0,0.230447511501464
GCCTC,0.00150786610400484,0.207777777777778,0,0.513333333333333,0.278888888888889
GCCCG,0.00151761266909593,0.299536730641959,0,0.218927862342819,0.481535407015222
CACGG,0.00153725308749154,0.55,0,0.15,0.3
GGCAA,0.00154508041279225,0.276785714285714,0,0.446428571428571,0.276785714285714
TGGGC,0.00155239464441699,0.69433669511249,0.145073700543057,0,0.160589604344453
GACTG,0.00157730250505251,0.157283288650581,0,0.390527256478999,0.45218945487042
GCCCA,0.00158014025736015,0.55,0,0.15,0.3
TGGGG,0.00158789293118196,0.69433669511249,0.145073700543057,0,0.160589604344453
GTCAG,0.00159167274729035,0.307692307692308,0,0.173076923076923,0.519230769230769
AGGGC,0.00159627834656403,0.69433669511249,0.145073700543057,0,0.160589604344453
CCCAC,0.00160597190612644,0.339622641509434,0,0.30188679245283,0.358490566037736
ACGGC,0.00160799257083768,0.509090909090909,0.275,0,0.215909090909091
GAGGC,0.00160799257083768,0.418454935622318,0.227467811158798,0,0.354077253218884
CGGGC,0.00164875154634099,0.69433669511249,0.145073700543057,0,0.160589604344453
CGGGG,0.00165160950463947,0.69433669511249,0.145073700543057,0,0.160589604344453
GTCAA,0.00168569270049759,0.41304347826087,0,0.402173913043478,0.184782608695652
GACGG,0.00171234952263259,0.249184104434632,0,0.269725475139182,0.481090420426185
GCCAC,0.00172486621909976,0.529850746268657,0,0.164179104477612,0.305970149253731
GGCCC,0.00173696564790988,0.10989010989011,0,0.478021978021978,0.412087912087912
CCCAG,0.0017542862229792,0.210572085222685,0,0.269706192931238,0.519721721846077
TCGAG,0.00175937232495593,0.428646563814867,0.452138849929874,0,0.119214586255259
TTGAC,0.00176040747123344,0.473402267347702,0.332004484863585,0,0.194593247788713
ATGAC,0.0017623244893184,0.473402267347702,0.332004484863585,0,0.194593247788713
CTGTC,0.00177653789429702,0.46643109540636,0.34982332155477,0,0.183745583038869
TGCGA,0.00179147084516984,0.23015873015873,0,0.126984126984127,0.642857142857143
GTCCT,0.00179764257003005,0.355140186915888,0,0.177570093457944,0.467289719626168
GGCCT,0.0018442621201239,0.308219178082192,0,0.287671232876712,0.404109589041096
AAGTC,0.00186684401992192,0.456521739130435,0.409537166900421,0,0.133941093969144
TCGCA,0.00186825037659036,0.523809523809524,0.19047619047619,0,0.285714285714286
CTGGG,0.00187377913826843,0.666666666666667,0.277777777777778,0,0.0555555555555556
TGGAC,0.00187533578624642,0.641263792966579,0.249662618083671,0,0.10907358894975
CCCCG,0.00187625961119436,0.299536730641959,0,0.218927862342819,0.481535407015222
CTCAC,0.00188229909408787,0.310169491525424,0,0.274576271186441,0.415254237288136
GTCAC,0.00188348394542448,0.319983980776932,0,0.243091710052062,0.436924309171005
CTTGT,0.00189376417822938,0.207196749854904,0.500290191526407,0.292513058618688,0
CCCAA,0.00192837019343128,0.210572085222685,0,0.269706192931238,0.519721721846077
CCCAT,0.00193686750037508,0.210572085222685,0,0.269706192931238,0.519721721846077
TAGGG,0.00194474835159403,0.6875,0.25,0,0.0625
GGGGG,0.00195007979280698,0.712204007285975,0.12568306010929,0,0.162112932604736
AAGCC,0.00195322822843828,0.611418411694982,0.242328460424075,0,0.146253127880943
CCGCC,0.00195322822843828,0.640905107162776,0.218946697474305,0,0.140148195362919
CTGCC,0.00195322822843828,0.592433537832311,0.261145194274029,0,0.146421267893661
GGCCA,0.00196539958967563,0.286311389759666,0,0.171368861024033,0.542319749216301
TCCGG,0.00197648046763531,0.277777777777778,0,0.185185185185185,0.537037037037037
ACGGG,0.00200021066517604,0.525569760978321,0.28071150639244,0,0.193718732629238
TTGAT,0.00200472122547427,0.473402267347702,0.332004484863585,0,0.194593247788713
TAGAC,0.0020270795558264,0.501664816870144,0.320199778024417,0,0.178135405105438
CCCCA,0.00203001468361058,0.299536730641959,0,0.218927862342819,0.481535407015222
TCGAC,0.00203418345486307,0.427893904795363,0.452661162831548,0,0.11944493237309
GGGTC,0.00203587198465478,0.653685674547983,0.182197496522949,0,0.164116828929068
AAGAC,0.00203721554119259,0.480771737713466,0.372180941207144,0,0.14704732107939
CCCCT,0.00203851199055439,0.299536730641959,0,0.218927862342819,0.481535407015222
GACAA,0.00204614002987775,0.314,0,0.4,0.286
AGAAT,0.00205218502523983,0,0.366107764935699,0.528731889956048,0.105160345108253
ACCGT,0.00206021469386181,0.269035532994924,0,0.153299492385787,0.577664974619289
AGACT,0.00209687160125122,0,0.311750599520384,0.578577138289369,0.109672262190248
GGCAT,0.0021003305018768,0.511494252873563,0,0.32183908045977,0.166666666666667
GAGAC,0.00211834927914819,0.511976047904192,0.317365269461078,0,0.170658682634731
CCAGA,0.00212000364988084,0,0.622641509433962,0.292452830188679,0.0849056603773585
ACGAC,0.0021452274627829,0.427893904795363,0.452661162831548,0,0.11944493237309
GCCTT,0.00215057534327065,0.246575342465753,0,0.205479452054795,0.547945205479452
GGCGT,0.00216864506316522,0.221774193548387,0,0.125,0.653225806451613
GTCTT,0.00220026644235338,0.153846153846154,0,0.576923076923077,0.269230769230769
GGCTG,0.00222108560643117,0.163865546218487,0,0.36344537815126,0.472689075630252
GTGGC,0.00222594200411124,0.419672131147541,0.20655737704918,0,0.373770491803279
TTGGA,0.00223467278394841,0.588329979879276,0.200704225352113,0,0.210965794768612
TCGGA,0.00224397792733738,0.447089947089947,0.44973544973545,0,0.103174603174603
TGCAG,0.00224469870613653,0.743950478334271,0,0.121553179516038,0.134496342149691
GGGCC,0.00227923427035082,0.60646517090055,0.27671673156561,0,0.11681809753384
TGGCC,0.00227923427035082,0.606502657930523,0.276672023735938,0,0.116825318333539
CTCCA,0.00229047968477595,0.101851851851852,0,0.462962962962963,0.435185185185185
CGGAC,0.00231003439395843,0.641263792966579,0.249662618083671,0,0.10907358894975
GTCCA,0.00233799898802729,0.2018779342723,0,0.586854460093897,0.211267605633803
ACCGG,0.00234571860755516,0.299145299145299,0,0.128205128205128,0.572649572649573
CGGTC,0.00238729795791292,0.458333333333333,0.416666666666667,0,0.125
GCTGA,0.00239829252844954,0.263269639065817,0.511677282377919,0.225053078556263,0
CCGAC,0.00244548140847934,0.427893904795363,0.452661162831548,0,0.11944493237309
GTCGT,0.00246806832090712,0.214285714285714,0,0.214285714285714,0.571428571428571
ACTGA,0.00248220047147771,0.232876712328767,0.506849315068493,0.26027397260274,0
TTGAA,0.00248551008640802,0.473402267347702,0.332004484863585,0,0.194593247788713
GCGCC,0.00251198004874176,0.640905107162776,0.218946697474305,0,0.140148195362919
GTGCC,0.00251198004874176,0.592433537832311,0.261145194274029,0,0.146421267893661
TCGCC,0.00251198004874176,0.640905107162776,0.218946697474305,0,0.140148195362919
TTGCC,0.00251198004874176,0.592433537832311,0.261145194274029,0,0.146421267893661
GTCTG,0.00257632894027749,0.152733118971061,0,0.408360128617363,0.438906752411576
AGGCC,0.00260524031226336,0.606502657930523,0.276672023735938,0,0.116825318333539
CAGCC,0.00260524031226336,0.578184363127375,0.291441711657668,0,0.130373925214957
CACCC,0.0026089786132818,0.443243243243243,0,0.162162162162162,0.394594594594595
CCCTG,0.00261418784970337,0.182584269662921,0,0.348314606741573,0.469101123595506
CACTT,0.00262722118334575,0.181428455876405,0,0.407425382188789,0.411146161934805
GCCAG,0.00266026817930426,0.210627599478552,0,0.269724998448073,0.519647402073375
GGGAC,0.00266843445627125,0.687565308254963,0.22466039707419,0,0.0877742946708464
TGCGC,0.00269792656710323,0.23015873015873,0,0.126984126984127,0.642857142857143
TTGAG,0.00275747639552799,0.473402267347702,0.332004484863585,0,0.194593247788713
ACGCC,0.0027913559588935,0.640905107162776,0.218946697474305,0,0.140148195362919
ATGCC,0.0027913559588935,0.592433537832311,0.261145194274029,0,0.146421267893661
ACCGA,0.00280037158030055,0.124137931034483,0,0.517241379310345,0.358620689655172
GTCTC,0.00286187018512118,0.115669797330697,0,0.454028670291646,0.430301532377657
GCCTG,0.00289073338657034,0.142857142857143,0,0.476190476190476,0.380952380952381
GGCCG,0.00289446020408815,0.190199335548173,0,0.274916943521595,0.534883720930233
ACTCC,0.00290950365756553,0.296296296296296,0.62962962962963,0.0740740740740741,0
GCTCT,0.00290950365756553,0.103174603174603,0.655806182121972,0.241019214703425,0
TCCGC,0.0029174513217415,0.0806451612903226,0,0.32258064516129,0.596774193548387
AGGCA,0.00292722719679615,0.606502657930523,0.276672023735938,0,0.116825318333539
CGGCC,0.00297747160552363,0.606500648829018,0.276710127912006,0,0.116789223258975
GAGCC,0.00297747160552363,0.59375,0.268640350877193,0,0.137609649122807
TAGCC,0.00297747160552363,0.518518518518518,0.259259259259259,0,0.222222222222222
TCGGT,0.00301328173273864,0.308056872037915,0.402843601895735,0,0.289099526066351
TAGTC,0.00305750598029952,0.488573193329216,0.369054972205065,0,0.14237183446572
GGCAG,0.00306466211164324,0.258258258258258,0,0.316316316316316,0.425425425425425
GCAGC,0.00312998710875877,0,0.18343653250774,0.520123839009288,0.296439628482972
GCGAG,0.00318401345899155,0.349817803227486,0.514315460697553,0,0.135866736074961
CTTGA,0.00320873649474986,0.223739495798319,0.418067226890756,0.358193277310924,0
TCGTC,0.00322576979262538,0.465028773793714,0.379592740150509,0,0.155378486055777
CTCGG,0.00323198053705978,0.214285714285714,0,0.214285714285714,0.571428571428571
CTCTC,0.0032594097255034,0.0879828326180258,0,0.574391988555079,0.337625178826896
ACCAT,0.00326688362000714,0.23568281938326,0,0.21334172435494,0.5509754562618
GTGAA,0.00328084885093003,0.518109427176984,0.200359619830465,0,0.281530952992551
GGCTC,0.00329337380049241,0.120071684587814,0,0.333333333333333,0.546594982078853
GCTGG,0.00330186132820675,0.25,0.6875,0.0625,0
CCGTC,0.00330681950707988,0.346153846153846,0.524291497975709,0,0.129554655870445
CCTGC,0.00331717896734574,0.178258714686932,0.372583842722617,0.449157442590451,0
CTCTA,0.00332995999895181,0.108491228070175,0,0.488982456140351,0.402526315789474
CTCTT,0.00333270267595646,0.108491228070175,0,0.488982456140351,0.402526315789474
GCCTA,0.00334001253637032,0.123700623700624,0,0.511434511434511,0.364864864864865
AGTTA,0.00334583985293589,0.216353478923311,0.545454545454545,0.238191975622143,0
GGTTG,0.00334583985293589,0.216353478923311,0.545454545454545,0.238191975622143,0
AGATC,0.00336032804424055,0,0.312980816048301,0.555068653228162,0.131950530723537
GTGGG,0.00336612073883166,0.426229508196721,0.274590163934426,0,0.299180327868852
GCTCA,0.00339597877667593,0.103174603174603,0.655806182121972,0.241019214703425,0
GAAGG,0.00343309124648937,0,0.29860302677532,0.546565774155995,0.154831199068685
GAGAG,0.00344693450055038,0.492627345844504,0.401306970509383,0,0.106065683646113
GGCTT,0.00345978137605917,0.15702479338843,0,0.459710743801653,0.383264462809917
CTCCG,0.00346735575013073,0.235239852398524,0,0.376383763837638,0.388376383763838
TCCAG,0.00348528673550446,0.150073206442167,0,0.104685212298682,0.745241581259151
AGGCG,0.00348956637740156,0.606502657930523,0.276672023735938,0,0.116825318333539
GTGCG,0.00348956637740156,0.487719298245614,0.285087719298246,0,0.22719298245614
ATCGC,0.00350590901990061,0.214285714285714,0,0.214285714285714,0.571428571428571
CTCGT,0.0035116517612481,0.214285714285714,0,0.214285714285714,0.571428571428571
CTCGA,0.00354579597210363,0.214285714285714,0,0.214285714285714,0.571428571428571
AAGAG,0.00355454059738447,0.487483530961792,0.355731225296443,0,0.156785243741765
AGAAA,0.00356594844191318,0,0.366107764935699,0.528731889956048,0.105160345108253
ACTGT,0.00357198638055292,0.269642857142857,0.548214285714286,0.182142857142857,0
CTGGT,0.00364567210277563,0.597531526697075,0.212235041588409,0,0.190233431714516
AGAGC,0.00366093135448353,0,0.355311355311355,0.526425954997384,0.118262689691261
CACTC,0.00368484737420762,0.093716719914803,0,0.535676251331203,0.370607028753994
TCTCG,0.00369911871666327,0.103174603174603,0.655806182121972,0.241019214703425,0
TCCCC,0.00371318970010964,0.0810810810810811,0,0.378378378378378,0.540540540540541
GTGTC,0.00372807723511165,0.372479574998994,0.412081941481869,0,0.215438483519137
TTTGT,0.00373312186339617,0.207238762405137,0.498540572095738,0.294220665499124,0
TCCGA,0.00373505756595837,0.166666666666667,0,0.333333333333333,0.5
AAGAA,0.00374344439578996,0.556263908101281,0.264509532687797,0,0.179226559210922
CGGAG,0.00374990761553416,0.641263792966579,0.249662618083671,0,0.10907358894975
ACCCT,0.00375337415743714,0.270948012232416,0,0.303058103975535,0.425993883792049
CTCCT,0.00375588617654253,0.235239852398524,0,0.376383763837638,0.388376383763838
CCTCG,0.00376023044303763,0.103174603174603,0.655806182121972,0.241019214703425,0
GCGGA,0.00376784003829021,0.580536912751678,0.237136465324385,0,0.182326621923937
GACTT,0.00379630404667843,0.163074039362699,0,0.445173383317713,0.391752577319588
GTTCA,0.00382376835999139,0.0917431192660551,0.495412844036697,0.412844036697248,0
CTCAT,0.00383863157936859,0.188172043010753,0,0.456989247311828,0.354838709677419
TCCCT,0.00384524274024247,0.301583042661658,0,0.150523209015294,0.547893748323048
GACCT,0.00385714765210514,0.37199124726477,0,0.236323851203501,0.391684901531729
ACGGT,0.00387654769127133,0.589238845144357,0.224409448818898,0,0.186351706036745
TCTCT,0.00388245389578633,0.146997929606625,0.523809523809524,0.329192546583851,0
ATCCA,0.00391625080044287,0.235239852398524,0,0.376383763837638,0.388376383763838
TTGTC,0.00391628103435624,0.372479574998994,0.412081941481869,0,0.215438483519137
TCCAT,0.00391661746134149,0.254019292604502,0,0.162379421221865,0.583601286173633
GTGAC,0.00392747643685023,0.277227722772277,0.43988684582744,0,0.282885431400283
CTCGC,0.00395336666545318,0.214285714285714,0,0.214285714285714,0.571428571428571
GACAT,0.00395831311350354,0.479768786127168,0,0.248554913294798,0.271676300578035
ATCGG,0.00395914483077853,0.214285714285714,0,0.214285714285714,0.571428571428571
CAGAA,0.00396590200781529,0.557559478127398,0.240982348426708,0,0.201458173445894
GGAGG,0.00397079163312105,0,0.307171853856563,0.569688768606225,0.123139377537212
GTTGG,0.00401224731027498,0.234567901234568,0.648148148148148,0.117283950617284,0
ACCGC,0.00402373344490979,0.159256265157639,0,0.244947453516572,0.595796281325788
GTCGC,0.00402558446484969,0.214285714285714,0,0.214285714285714,0.571428571428571
GACGT,0.0040345738266659,0.333333333333333,0,0.134292565947242,0.532374100719424
CACAT,0.00403770396440864,0.156363636363636,0,0.436363636363636,0.407272727272727
ATTGA,0.00406086115985004,0.207238762405137,0.498540572095738,0.294220665499124,0
ATCAT,0.00409544603405595,0.261639344262295,0,0.343825136612022,0.394535519125683
ATTTT,0.00409951504403493,0.0727848101265823,0.706487341772152,0.220727848101266,0
CGCCA,0.00414636947364348,0.166741979213737,0,0.267058291911432,0.56619972887483
CGCTT,0.00414636947364348,0.154255319148936,0,0.363475177304965,0.482269503546099
ACTCG,0.00418559383577367,0.103174603174603,0.655806182121972,0.241019214703425,0
AGTCT,0.00419719388260674,0.147727272727273,0.570075757575758,0.28219696969697,0
ACTGG,0.00420834939986973,0.170542635658915,0.434108527131783,0.395348837209302,0
TATCT,0.00422748359110302,0.146997929606625,0.523809523809524,0.329192546583851,0
AAGGA,0.00426290789708397,0.582587749483827,0.231589814177564,0,0.18582243633861
CTCAG,0.00426894932339896,0.136054421768707,0,0.527210884353742,0.336734693877551
GTTGA,0.00432007505811134,0.206755969714619,0.499708794408853,0.293535235876529,0
GTCCC,0.00433084828507614,0.235239852398524,0,0.376383763837638,0.388376383763838
AGTGC,0.00435124573935487,0.308649530803754,0.437984496124031,0.253365973072215,0
CTCCC,0.00436908841062249,0.235239852398524,0,0.376383763837638,0.388376383763838
ACACA,0.00437821615764281,0,0.244360902255639,0.481203007518797,0.274436090225564
TTTGC,0.00438405929609531,0.207238762405137,0.498540572095738,0.294220665499124,0
GCTGT,0.00441209447065725,0.35509138381201,0.447780678851175,0.197127937336815,0
TTTCC,0.00444624586067592,0.0956521739130435,0.430434782608696,0.473913043478261,0
TTTCG,0.00444624586067592,0.0956521739130435,0.430434782608696,0.473913043478261,0
TTTCT,0.00444624586067592,0.0956521739130435,0.430434782608696,0.473913043478261,0
ACAGG,0.00444996091560974,0,0.324786324786325,0.52991452991453,0.145299145299145
TTGGT,0.00446160705760578,0.588329979879276,0.200704225352113,0,0.210965794768612
ATGTC,0.00446424500200611,0.372479574998994,0.412081941481869,0,0.215438483519137
CTCTG,0.00447969013815933,0.130434782608696,0,0.5,0.369565217391304
GCTCC,0.00448873377576102,0.0894878706199461,0.689487870619946,0.221024258760108,0
CACCG,0.0044972660687175,0.195117070242145,0,0.286972183309986,0.517910746447869
CAGAG,0.00450072759043999,0.444973299280241,0.409681913164616,0,0.145344787555143
GTCGG,0.00451498632778266,0.214285714285714,0,0.214285714285714,0.571428571428571
GATCT,0.00451609776015926,0.189189189189189,0.486486486486487,0.324324324324324,0
GGAAC,0.0045247855142186,0,0.357339765678842,0.531357684355617,0.111302549965541
GACGC,0.00454696429192585,0.484210526315789,0,0.221052631578947,0.294736842105263
TGGTC,0.00454853455583274,0.545517902256294,0.352818189737782,0,0.101663908005924
CTGGA,0.00457146877488435,0.622987765614939,0.162588538312943,0,0.214423696072118
TGCAT,0.00459613619908253,0.743950478334271,0,0.121553179516038,0.134496342149691
TCCTG,0.00462609846734637,0.284883720930233,0,0.19656699889258,0.518549280177187
CCTGA,0.00464461858499642,0.238095238095238,0.547619047619048,0.214285714285714,0
CCTCA,0.00464794853224725,0.103174603174603,0.655806182121972,0.241019214703425,0
AATCC,0.00465964865844986,0.296296296296296,0.62962962962963,0.0740740740740741,0
AGATT,0.00467464989898493,0,0.312980816048301,0.555068653228162,0.131950530723537
CTTCC,0.00468331463831558,0.0956521739130435,0.430434782608696,0.473913043478261,0
CTTCG,0.00468331463831558,0.0956521739130435,0.430434782608696,0.473913043478261,0
CTTCT,0.00468331463831558,0.0956521739130435,0.430434782608696,0.473913043478261,0
GGTCC,0.00474113663805984,0.127659574468085,0.617021276595745,0.25531914893617,0
TGTGT,0.00474493158848145,0.308649530803754,0.437984496124031,0.253365973072215,0
ACCAC,0.0047451894201168,0.30234375,0,0.1796875,0.51796875
GTCAT,0.00479120513748829,0.261639344262295,0,0.343825136612022,0.394535519125683
ATTGC,0.00480359619972866,0.207238762405137,0.498540572095738,0.294220665499124,0
ATTCA,0.00481178421266387,0.0956521739130435,0.430434782608696,0.473913043478261,0
ATTCC,0.00481178421266387,0.0956521739130435,0.430434782608696,0.473913043478261,0
ATTCG,0.00481178421266387,0.0956521739130435,0.430434782608696,0.473913043478261,0
ATTCT,0.00481178421266387,0.0956521739130435,0.430434782608696,0.473913043478261,0
GCGCT,0.00485611144938935,0.770833333333333,0.145833333333333,0,0.0833333333333333
TGGAG,0.00485965215796769,0.641263792966579,0.249662618083671,0,0.10907358894975
TACGA,0.00486988027272663,0.166666666666667,0,0.333333333333333,0.5
GATCA,0.00487175484041512,0.0917431192660551,0.495412844036697,0.412844036697248,0
GACCG,0.00488144104649749,0.211900425015179,0,0.255009107468124,0.533090467516697
CTCAA,0.00488908260156307,0.099537037037037,0,0.599537037037037,0.300925925925926
TATGA,0.00489334673927256,0.275196137598069,0.500301750150875,0.224502112251056,0
CCTCT,0.00490311341106755,0.103174603174603,0.655806182121972,0.241019214703425,0
TCTCA,0.00490311341106755,0.103174603174603,0.655806182121972,0.241019214703425,0
GACCC,0.00496437582419762,0.306818181818182,0,0.311363636363636,0.381818181818182
CCGAG,0.00500493151287195,0.427893904795363,0.452661162831548,0,0.11944493237309
GGCGA,0.00500755087307365,0.23015873015873,0,0.126984126984127,0.642857142857143
ATCGT,0.00501914002721396,0.214285714285714,0,0.214285714285714,0.571428571428571
AGAGT,0.00503653009276401,0,0.355311355311355,0.526425954997384,0.118262689691261
CACCT,0.00504705595901951,0.136363636363636,0,0.272727272727273,0.590909090909091
GTTGC,0.00505812553250773,0.207238762405137,0.498540572095738,0.294220665499124,0
CTTCA,0.00506872336136044,0.0991735537190083,0.371900826446281,0.528925619834711,0
GTGCA,0.00507179055009013,0.683863885839737,0.136114160263447,0,0.180021953896817
ACGAG,0.0050915903821572,0.487483530961792,0.355731225296443,0,0.156785243741765
CACAA,0.00512587465959121,0.099537037037037,0,0.599537037037037,0.300925925925926
GGTCG,0.00516538983952672,0.147727272727273,0.570075757575758,0.28219696969697,0
CGATG,0.00517006777758528,0,0.312980816048301,0.555068653228162,0.131950530723537
CAGAT,0.00517115185088731,0.437735849056604,0.392452830188679,0,0.169811320754717
TCTGA,0.00518152388037049,0.275196137598069,0.500301750150875,0.224502112251056,0
AATGA,0.00519810875862003,0.232876712328767,0.506849315068493,0.26027397260274,0
GGTCA,0.0052008307827001,0.147727272727273,0.570075757575758,0.28219696969697,0
ACTCA,0.00522743015714115,0.103174603174603,0.655806182121972,0.241019214703425,0
TATCA,0.0052353646240873,0.221788617886179,0.509918699186992,0.268292682926829,0
CGTCG,0.00528313073393668,0.147727272727273,0.570075757575758,0.28219696969697,0
GCGTC,0.00530179924090441,0.503424657534247,0.383561643835616,0,0.113013698630137
GTTCC,0.00530579213900011,0.0956521739130435,0.430434782608696,0.473913043478261,0
GTTCG,0.00530579213900011,0.0956521739130435,0.430434782608696,0.473913043478261,0
GTTCT,0.00530579213900011,0.0956521739130435,0.430434782608696,0.473913043478261,0
AATCG,0.00533750916465431,0.237492465340567,0.539481615430982,0.223025919228451,0
CATCA,0.00536304529979606,0.136283185840708,0.529203539823009,0.334513274336283,0
ATGAG,0.0053976680794045,0.473402267347702,0.332004484863585,0,0.194593247788713
GACTC,0.00541466482730606,0.131177325581395,0,0.451489825581395,0.417332848837209
ATCAA,0.00541813672818828,0.261639344262295,0,0.343825136612022,0.394535519125683
GGACA,0.00544299967380998,0,0.291525423728814,0.575593220338983,0.132881355932203
CGTCT,0.00547280216042666,0.147727272727273,0.570075757575758,0.28219696969697,0
CATCC,0.00547821888921962,0.155489614243323,0.600148367952522,0.244362017804154,0
TCTGT,0.00547869273282515,0.205561613958561,0.582333696837514,0.212104689203926,0
TGTCG,0.00549574449956419,0.147727272727273,0.570075757575758,0.28219696969697,0
TGTCA,0.00551346497115088,0.147727272727273,0.570075757575758,0.28219696969697,0
TATCC,0.00551602608972723,0.0868160710680396,0.763577629719362,0.149606299212598,0
GCGAA,0.00553416304865371,0.541414141414141,0.367676767676768,0,0.0909090909090909
GAGTC,0.0055403946729771,0.61028684470821,0.240356083086053,0,0.149357072205737
TTTCA,0.00554286091663978,0.0956521739130435,0.430434782608696,0.473913043478261,0
CACGC,0.00554714613440293,0.18235156066651,0,0.374325275756865,0.443323163576625
TAGAG,0.00555065137161891,0.464713887628799,0.403991964227853,0,0.131294148143348
AGATA,0.00557314593783213,0,0.312980816048301,0.555068653228162,0.131950530723537
CCTCC,0.00559677834783122,0.103174603174603,0.655806182121972,0.241019214703425,0
TATGT,0.00560192337188985,0.205561613958561,0.582333696837514,0.212104689203926,0
ACCAA,0.00563825773300111,0.188751926040062,0,0.356702619414484,0.454545454545455
CCCTC,0.00565410462149823,0.110416666666667,0,0.422916666666667,0.466666666666667
CACCA,0.00565897540442027,0.16372253339078,0,0.276174062903921,0.560103403705299
TGTCT,0.00569306337243334,0.147727272727273,0.570075757575758,0.28219696969697,0
GGGGT,0.00569447400156265,0.69433669511249,0.145073700543057,0,0.160589604344453
TCTGG,0.00570614968084456,0.212239583333333,0.5234375,0.264322916666667,0
ATTGT,0.00571881077317641,0.207238762405137,0.498540572095738,0.294220665499124,0
CACGA,0.00571999394034083,0.164908256880734,0,0.339449541284404,0.495642201834862
GATCG,0.00572820097161161,0.0689655172413793,0.724137931034483,0.206896551724138,0
TCACA,0.0057500325246665,0,0.156914893617021,0.579787234042553,0.263297872340426
ACACT,0.00576440471757843,0,0.26271186440678,0.483050847457627,0.254237288135593
CATCG,0.00577024590080007,0.0989803531459836,0.243803365663599,0.657216281190417,0
CGTCC,0.00577090774884789,0.147727272727273,0.570075757575758,0.28219696969697,0
CGAAG,0.00579321150422814,0,0.366107764935699,0.528731889956048,0.105160345108253
AGTCA,0.00582609915960165,0.147727272727273,0.570075757575758,0.28219696969697,0
ACGTC,0.00583405990714131,0.456521739130435,0.409537166900421,0,0.133941093969144
TAGAA,0.0058382651528335,0.126984126984127,0.53968253968254,0,0.333333333333333
CCGAA,0.00584896663092603,0.427893904795363,0.452661162831548,0,0.11944493237309
TCCCA,0.00585193170181367,0.299536730641959,0,0.218927862342819,0.481535407015222
TGAGA,0.00585544461202344,0,0.355311355311355,0.526425954997384,0.118262689691261
TGTCC,0.00586157726074759,0.147727272727273,0.570075757575758,0.28219696969697,0
ACTCT,0.00589991828781856,0.103174603174603,0.655806182121972,0.241019214703425,0
TGGAA,0.00590742482438123,0.641263792966579,0.249662618083671,0,0.10907358894975
CGCTC,0.00590756291628684,0.154255319148936,0,0.363475177304965,0.482269503546099
ACCCG,0.00591172903922517,0.299536730641959,0,0.218927862342819,0.481535407015222
TTAGA,0.00592533706488396,0,0.174467310143872,0.564924421781096,0.260608268075032
GCAAA,0.00592934785355079,0,0.218354430379747,0.582278481012658,0.199367088607595
CGACG,0.00593199838613893,0,0.311750599520384,0.578577138289369,0.109672262190248
TAGGT,0.00594301768170841,0.308056872037915,0.402843601895735,0,0.289099526066351
AATCT,0.00598132149066976,0.205447470817121,0.566536964980545,0.228015564202335,0
ACGAA,0.00598900112424053,0.427893904795363,0.452661162831548,0,0.11944493237309
GTTGT,0.00600970143920964,0.207238762405137,0.498540572095738,0.294220665499124,0
CGCCT,0.00602170490216969,0.136363636363636,0,0.272727272727273,0.590909090909091
TGAAG,0.00605811088176751,0,0.366107764935699,0.528731889956048,0.105160345108253
ACCCA,0.00607612203533476,0.299536730641959,0,0.218927862342819,0.481535407015222
GGATT,0.00609627817774258,0,0.278371710526316,0.512746710526316,0.208881578947368
ACAAA,0.00611510606475247,0,0.354140127388535,0.414012738853503,0.231847133757962
GGTGT,0.00612326916177999,0.384364820846906,0.407166123778502,0.208469055374593,0
CGTCA,0.0061335857964467,0.146396396396396,0.572072072072072,0.281531531531532,0
GGATA,0.00614593682912619,0,0.332813717848792,0.540140296180826,0.127045985970382
GTGAG,0.00615245253418786,0.392045454545455,0.403409090909091,0,0.204545454545455
TGATG,0.00618792070814706,0,0.312980816048301,0.555068653228162,0.131950530723537
AGTCG,0.00620446768279347,0.147727272727273,0.570075757575758,0.28219696969697,0
AGTGT,0.00622341540326727,0.308649530803754,0.437984496124031,0.253365973072215,0
TCCGT,0.00622624671913434,0.200745804847732,0,0.128029832193909,0.671224362958359
CGGAA,0.00623044159012439,0.641263792966579,0.249662618083671,0,0.10907358894975
GGCTA,0.00623351192714289,0.17814371257485,0,0.381736526946108,0.440119760479042
TGAAT,0.00623749914988889,0,0.366107764935699,0.528731889956048,0.105160345108253
AGGAA,0.00623850467976529,0.641263792966579,0.249662618083671,0,0.10907358894975
GCAGG,0.00625430753060799,0,0.230769230769231,0.538461538461538,0.230769230769231
CGAAA,0.00627927476752661,0,0.366107764935699,0.528731889956048,0.105160345108253
ATTGG,0.00630769587076887,0.207238762405137,0.498540572095738,0.294220665499124,0
CTGAG,0.0063156638171174,0.444973299280241,0.409681913164616,0,0.145344787555143
TTCAT,0.00631927568429454,0.261639344262295,0,0.343825136612022,0.394535519125683
TGTTG,0.0063254758861823,0.216353478923311,0.545454545454545,0.238191975622143,0
CACAC,0.00633981338725404,0.314655172413793,0,0.278735632183908,0.406609195402299
AGTGA,0.0063499909639085,0.308649530803754,0.437984496124031,0.253365973072215,0
CACAG,0.00636265303260966,0.136054421768707,0,0.527210884353742,0.336734693877551
ATCAC,0.00639797736613665,0.261639344262295,0,0.343825136612022,0.394535519125683
GCTGC,0.00640666396357586,0.372477064220184,0.445871559633028,0.181651376146789,0
AATTA,0.00640788547427953,0.223970944309927,0.603510895883777,0.172518159806295,0
ACCCC,0.00643050431390616,0.299536730641959,0,0.218927862342819,0.481535407015222
AGAAG,0.00643919501802021,0,0.366107764935699,0.528731889956048,0.105160345108253
GGAGC,0.00644655662668889,0,0.193548387096774,0.693548387096774,0.112903225806452
TCCAA,0.00645497667257166,0.123994638069705,0,0.48558981233244,0.390415549597855
CATCT,0.00646947351338454,0.217175672148264,0.564865570347168,0.217958757504568,0
TGAAA,0.00647473653602334,0,0.366107764935699,0.528731889956048,0.105160345108253
CGGGA,0.00648101741300432,0.69433669511249,0.145073700543057,0,0.160589604344453
CACGT,0.00648662678652826,0.384615384615385,0,0.384615384615385,0.230769230769231
AGTCC,0.00652232373879508,0.147727272727273,0.570075757575758,0.28219696969697,0
GTTTG,0.00652585487415735,0.0727848101265823,0.706487341772152,0.220727848101266,0
TATCG,0.00654753369996096,0.20641312453393,0.52662192393736,0.26696495152871,0
TTTTA,0.00657611007442346,0.0727848101265823,0.706487341772152,0.220727848101266,0
GCAGA,0.0066347178610302,0,0.175962576466355,0.550917596257647,0.273119827275999
TTCAC,0.00663559360801721,0.261639344262295,0,0.343825136612022,0.394535519125683
CGAGG,0.00664133498653326,0,0.355311355311355,0.526425954997384,0.118262689691261
AGTAA,0.00664980364333932,0.336770754880945,0.423324256995539,0.239904988123515,0
CCAGG,0.00667604137121054,0,0.50632183908046,0.334099616858238,0.159578544061303
ATCCG,0.00669353667164703,0.235239852398524,0,0.376383763837638,0.388376383763838
ACCAG,0.00669539744194322,0.205051369863014,0,0.277397260273973,0.517551369863014
GCTTG,0.00670288888663517,0.0793650793650794,0.825396825396825,0.0952380952380952,0
CCTTT,0.00673481337913183,0.0728155339805825,0.863738993000677,0.0634454730187401,0
CGTGA,0.00683015291903474,0.308649530803754,0.437984496124031,0.253365973072215,0
CTGAA,0.00685625402762697,0.557559478127398,0.240982348426708,0,0.201458173445894
TGTGG,0.00686095369715699,0.308649530803754,0.437984496124031,0.253365973072215,0
CTTGG,0.00688503500068269,0.0731707317073171,0.621951219512195,0.304878048780488,0
TTCGA,0.00688590046707323,0.214285714285714,0,0.214285714285714,0.571428571428571
CCAAC,0.00688762107444072,0,0.326086956521739,0.326086956521739,0.347826086956522
ATCCC,0.00689655836189152,0.235239852398524,0,0.376383763837638,0.388376383763838
GGTCT,0.00691106168114345,0.189189189189189,0.486486486486487,0.324324324324324,0
TGAGG,0.00692375536258864,0,0.355311355311355,0.526425954997384,0.118262689691261
GGACT,0.00692518243149899,0,0.285632839224629,0.596921322690992,0.117445838084379
GCTTA,0.00694921564122818,0.273255813953488,0.584302325581395,0.142441860465116,0
TTTGA,0.00696612685729577,0.207238762405137,0.498540572095738,0.294220665499124,0
CGGGT,0.0069954861764295,0.69433669511249,0.145073700543057,0,0.160589604344453
TGACG,0.00701553621274513,0,0.311750599520384,0.578577138289369,0.109672262190248
GTGCT,0.007053999744179,0.644444444444444,0.222222222222222,0,0.133333333333333
TGCTA,0.00707300873457962,0.154255319148936,0,0.363475177304965,0.482269503546099
CAGGA,0.0070929598208027,0.622987765614939,0.162588538312943,0,0.214423696072118
ATTTA,0.00711170216555578,0.0727848101265823,0.706487341772152,0.220727848101266,0
TGACA,0.00714860442351509,0,0.311750599520384,0.578577138289369,0.109672262190248
GCGGT,0.00717004187150831,0.525569760978321,0.28071150639244,0,0.193718732629238
CTTTA,0.00717285585390942,0.0727848101265823,0.706487341772152,0.220727848101266,0
GGATC,0.00717499373259102,0,0.312980816048301,0.555068653228162,0.131950530723537
TTAGT,0.00717988585842376,0,0.174467310143872,0.564924421781096,0.260608268075032
ACTTT,0.00718027304413637,0.122302158273381,0.827338129496403,0.0503597122302158,0
GATCC,0.00719257375819474,0.0904311251314406,0.687697160883281,0.221871713985279,0
GACAC,0.00719892141673003,0.682365657813465,0,0.118900555898703,0.198733786287832
GTGGA,0.00720993868048588,0.577617328519856,0.248194945848375,0,0.174187725631769
TCACG,0.00721302020211166,0,0.360759493670886,0.493670886075949,0.145569620253165
CTTGC,0.00722979185603119,0.190854870775348,0.572564612326044,0.236580516898608,0
CGACC,0.00723035055647015,0,0.311750599520384,0.578577138289369,0.109672262190248
CCAGT,0.00726344483262282,0,0.306672698484506,0.42456457814974,0.268762723365754
GGGAA,0.0072815551571915,0.708422810785015,0.161298019565736,0,0.130279169649248
GCTCG,0.0073111027998761,0.0689655172413793,0.724137931034483,0.206896551724138,0
TCTCC,0.0073111027998761,0.103174603174603,0.655806182121972,0.241019214703425,0
CTTTC,0.00731997523503459,0.0727848101265823,0.706487341772152,0.220727848101266,0
GGAGA,0.00733973449545571,0,0.355311355311355,0.526425954997384,0.118262689691261
ACAAC,0.00734913756759718,0,0.238095238095238,0.471861471861472,0.29004329004329
CGAGC,0.00735794900065682,0,0.355311355311355,0.526425954997384,0.118262689691261
AGGAT,0.00737267458178024,0.641263792966579,0.249662618083671,0,0.10907358894975
TCTAA,0.00738970155786929,0.329842931937173,0.445026178010471,0.225130890052356,0
GGTGC,0.00739456754589343,0.308649530803754,0.437984496124031,0.253365973072215,0
CGTGT,0.0074022599609898,0.53125,0.3125,0.15625,0
TTTGG,0.00740966283508905,0.207238762405137,0.498540572095738,0.294220665499124,0
CCTGT,0.00742318047166026,0.31992337164751,0.477011494252874,0.203065134099617,0
TCCTC,0.00745983524102215,0.130579891531081,0,0.401752190237797,0.467667918231122
CACTA,0.00746473352393311,0.148459383753501,0,0.239495798319328,0.612044817927171
GCACA,0.00747474729585542,0,0.254891304347826,0.471195652173913,0.273913043478261
GCAAT,0.00748289119080102,0,0.429545862502244,0.378388081134446,0.19206605636331
CCTTC,0.0074944008468897,0.0408472012102874,0.853252647503782,0.10590015128593,0
AGTTG,0.00752097151609478,0.216353478923311,0.545454545454545,0.238191975622143,0
CGTGC,0.00753915654579808,0.308649530803754,0.437984496124031,0.253365973072215,0
CGCAT,0.00755461437304736,0.0898876404494382,0,0.393258426966292,0.51685393258427
GGACC,0.00756983298613889,0,0.311750599520384,0.578577138289369,0.109672262190248
TGTGA,0.00759383338894043,0.308649530803754,0.437984496124031,0.253365973072215,0
AACGC,0.00760801238546743,0.159256265157639,0,0.244947453516572,0.595796281325788
ACAGA,0.00763993268914643,0,0.205250596658711,0.51909307875895,0.275656324582339
CGAAT,0.00764750714700378,0,0.555555555555556,0.375,0.0694444444444444
GTGGT,0.00767665616061103,0.560055865921788,0.201815642458101,0,0.238128491620112
TGGGA,0.00767864706040453,0.69433669511249,0.145073700543057,0,0.160589604344453
TGAAC,0.00768278974107613,0,0.366107764935699,0.528731889956048,0.105160345108253
CGAAC,0.00768867017342152,0,0.366107764935699,0.528731889956048,0.105160345108253
AAACT,0.00770682508731072,0,0.26271186440678,0.483050847457627,0.254237288135593
CAACC,0.00770682508731072,0,0.222222222222222,0.611111111111111,0.166666666666667
TGGGT,0.00772263975155807,0.69433669511249,0.145073700543057,0,0.160589604344453
ATGGT,0.00772421566692824,0.588329979879276,0.200704225352113,0,0.210965794768612
GTTTT,0.00773902478921856,0.0727848101265823,0.706487341772152,0.220727848101266,0
CCTTG,0.00774038412177805,0.0728484300880958,0.863677433928168,0.0634741359837362,0
TGTGC,0.00775126079085169,0.308649530803754,0.437984496124031,0.253365973072215,0
TTTTG,0.00775315770247894,0.0727848101265823,0.706487341772152,0.220727848101266,0
TGAGT,0.00776606128238426,0,0.355311355311355,0.526425954997384,0.118262689691261
TGCCA,0.00781500955137792,0.216063154281792,0,0.244894456838854,0.539042388879355
ATGAA,0.00782406067452503,0.473402267347702,0.332004484863585,0,0.194593247788713
ACATC,0.00782813962675691,0,0.189931350114416,0.47254004576659,0.337528604118993
AGATG,0.00783980012260826,0,0.312980816048301,0.555068653228162,0.131950530723537
ACGCG,0.00784860994206581,0.640905107162776,0.218946697474305,0,0.140148195362919
CAGCG,0.00784860994206581,0.519330971238016,0.33982909545644,0,0.140839933305544
TAGCG,0.00784860994206581,0.487972508591065,0.316838487972509,0,0.195189003436426
CGTTT,0.00785277939713752,0.216353478923311,0.545454545454545,0.238191975622143,0
GCTAG,0.00787362149799475,0.22962962962963,0.622222222222222,0.148148148148148,0
CTTTG,0.00787579564455942,0.0727848101265823,0.706487341772152,0.220727848101266,0
AGGGA,0.00789652728961559,0.69433669511249,0.145073700543057,0,0.160589604344453
TCAAG,0.00789683566892831,0,0.37741935483871,0.416129032258065,0.206451612903226
AGACG,0.00790595654149297,0,0.311750599520384,0.578577138289369,0.109672262190248
TGACC,0.00791690671692012,0,0.311750599520384,0.578577138289369,0.109672262190248
ACAAG,0.00793363843489502,0,0.251054852320675,0.455696202531646,0.293248945147679
AATCA,0.00793392958152888,0.144702842377261,0.525839793281654,0.329457364341085,0
AGAGA,0.00797332914940221,0,0.355311355311355,0.526425954997384,0.118262689691261
TATGC,0.00797996943203403,0.0967741935483871,0.731182795698925,0.172043010752688,0
GATTG,0.00798125338671499,0.0793650793650794,0.825396825396825,0.0952380952380952,0
GACCA,0.0080271199586736,0.273305084745763,0,0.246186440677966,0.480508474576271
AGTAC,0.00802928187457718,0.336770754880945,0.423324256995539,0.239904988123515,0
TCAGA,0.00804171219294169,0,0.306672698484506,0.42456457814974,0.268762723365754
TCAAT,0.00808424473997141,0,0.429545862502244,0.378388081134446,0.19206605636331
CCACT,0.00814927195690174,0,0.287376638680218,0.425246722639564,0.287376638680218
CAGGT,0.00819213813834019,0.597531526697075,0.212235041588409,0,0.190233431714516
AAGTG,0.0082011593908052,0.468797564687976,0.360078277886497,0,0.171124157425527
TCAGG,0.0082088165644402,0,0.44,0.344615384615385,0.215384615384615
CAGTC,0.00821328664850758,0.392009987515606,0.459425717852684,0,0.14856429463171
TGTTT,0.00823460527487633,0.216353478923311,0.545454545454545,0.238191975622143,0
GAGCA,0.00824147109163236,0.605004468275246,0.110813226094727,0,0.284182305630027
CCAAT,0.00828924201355999,0,0.429545862502244,0.378388081134446,0.19206605636331
TTTTC,0.00836634741288135,0.0727848101265823,0.706487341772152,0.220727848101266,0
TAGGA,0.00837850743575771,0.447089947089947,0.44973544973545,0,0.103174603174603
CGATC,0.00844498395305904,0,0.312980816048301,0.555068653228162,0.131950530723537
CGATA,0.00846654126064436,0,0.312980816048301,0.555068653228162,0.131950530723537
ATCAG,0.00850856114987124,0.261639344262295,0,0.343825136612022,0.394535519125683
AGGGT,0.00857319477217564,0.69433669511249,0.145073700543057,0,0.160589604344453
CGCGG,0.00860830399707635,0.23015873015873,0,0.126984126984127,0.642857142857143
TCAAC,0.00863708887604278,0,0.429545862502244,0.378388081134446,0.19206605636331
ACCTC,0.00864010388929286,0.135650224215247,0,0.381165919282511,0.483183856502242
GCAAG,0.00866605320884908,0,0.274809160305344,0.557251908396947,0.16793893129771
TGATT,0.00870357993320206,0,0.312980816048301,0.555068653228162,0.131950530723537
CCAGC,0.00871069578387129,0,0.306672698484506,0.42456457814974,0.268762723365754
TCAAA,0.00871500833419239,0,0.298969072164948,0.529209621993127,0.171821305841924
CCGGT,0.00873125648134853,0.525569760978321,0.28071150639244,0,0.193718732629238
CTTTT,0.00881986579469055,0.0727848101265823,0.706487341772152,0.220727848101266,0
TCTTG,0.00891050532556507,0.0728484300880958,0.863677433928168,0.0634741359837362,0
TACAC,0.00891449787232467,0.218594355285003,0,0.209739900387382,0.571665744327615
TGATC,0.00891701752104187,0,0.312980816048301,0.555068653228162,0.131950530723537
TGAGC,0.00894392992661658,0,0.355311355311355,0.526425954997384,0.118262689691261
CGCAG,0.00895953387175268,0.743950478334271,0,0.121553179516038,0.134496342149691
TCTTT,0.00896401244865168,0.0730413185820727,0.863513208399187,0.0634454730187401,0
TTTTT,0.00897103858862695,0.0727848101265823,0.706487341772152,0.220727848101266,0
TGATA,0.00902867008070669,0,0.312980816048301,0.555068653228162,0.131950530723537
AGACC,0.0090354072155685,0,0.311750599520384,0.578577138289369,0.109672262190248
CGACT,0.00904323291653352,0,0.311750599520384,0.578577138289369,0.109672262190248
GTTTC,0.009052705104812,0.0710616438356164,0.720890410958904,0.208047945205479,0
CAAGA,0.0090594519297118,0,0.598484848484849,0.25,0.151515151515152
CCACG,0.00910807034826004,0,0.287376638680218,0.425246722639564,0.287376638680218
GCTTT,0.00917115629527705,0.225806451612903,0.680351906158358,0.093841642228739,0
CGGCG,0.00920161628689538,0.606502657930523,0.276672023735938,0,0.116825318333539
TGGCG,0.00920161628689538,0.606502657930523,0.276672023735938,0,0.116825318333539
AGTGG,0.00920711165103037,0.308649530803754,0.437984496124031,0.253365973072215,0
GCACC,0.00920805748402432,0,0.151685393258427,0.48876404494382,0.359550561797753
AGACA,0.00926293983799552,0,0.311750599520384,0.578577138289369,0.109672262190248
GCGTG,0.00928452552663949,0.465028773793714,0.379592740150509,0,0.155378486055777
GGGTG,0.00928452552663949,0.545517902256294,0.352818189737782,0,0.101663908005924
ACAGC,0.00929129132807847,0,0.178029257521391,0.484405189069832,0.337565553408777
TGCTG,0.00929901118497451,0.154255319148936,0,0.363475177304965,0.482269503546099
TCCCG,0.00933450877325206,0.299536730641959,0,0.218927862342819,0.481535407015222
AAGAT,0.0093498141012078,0.454470877768663,0.449958982772765,0,0.0955701394585726
ACTTC,0.00938418928413211,0.0728484300880958,0.863677433928168,0.0634741359837362,0
ATTTG,0.00938925367106881,0.0727848101265823,0.706487341772152,0.220727848101266,0
CCAAG,0.00939311793566234,0,0.429545862502244,0.378388081134446,0.19206605636331
GGTTA,0.00940430999988968,0.245425188374596,0.585575888051668,0.168998923573735,0
GGTGG,0.00940983609847752,0.309655353854249,0.441462772954486,0.248881873191265,0
AGTTT,0.00946569520555231,0.216353478923311,0.545454545454545,0.238191975622143,0
CGTTC,0.00949360988714127,0.216353478923311,0.545454545454545,0.238191975622143,0
AAAGG,0.0095413305462532,0,0.324786324786325,0.52991452991453,0.145299145299145
AGCGC,0.00959943280947824,0.23015873015873,0,0.126984126984127,0.642857142857143
TGACT,0.00961984656719263,0,0.311750599520384,0.578577138289369,0.109672262190248
TCTAG,0.00962982819922004,0.142857142857143,0.836734693877551,0.0204081632653061,0
TTCTG,0.00970543276358137,0.108491228070175,0,0.488982456140351,0.402526315789474
GCGAT,0.00974739194615466,0.427893904795363,0.452661162831548,0,0.11944493237309
ACGGA,0.00978709493441899,0.525569760978321,0.28071150639244,0,0.193718732629238
GCTAA,0.00986619379139791,0.259259259259259,0.57037037037037,0.17037037037037,0
CCGGA,0.00986959603292108,0.525569760978321,0.28071150639244,0,0.193718732629238
CACTG,0.00987064015106323,0.171875,0,0.379464285714286,0.448660714285714
ACCTT,0.00987096902337604,0.20842255531763,0,0.388722341184868,0.402855103497502
GAGCG,0.00994195994334681,0.482587064676617,0.320540156361052,0,0.196872778962331
ACAGT,0.00997169827002527,0,0.201729106628242,0.420749279538905,0.377521613832853
TTCAG,0.00997365334697403,0.261639344262295,0,0.343825136612022,0.394535519125683
TCAGT,0.0100074336138094,0,0.341683884297521,0.399793388429752,0.258522727272727
CCAAA,0.0100159621123585,0,0.429545862502244,0.378388081134446,0.19206605636331
ATCTC,0.0100180000865435,0.108491228070175,0,0.488982456140351,0.402526315789474
TCTGC,0.0101103319067484,0.0967741935483871,0.731182795698925,0.172043010752688,0
GCATC,0.0101338837330412,0,0.21551724137931,0.433908045977011,0.350574712643678
ATGGA,0.0101436614665646,0.588329979879276,0.200704225352113,0,0.210965794768612
CCGCG,0.0102036286935069,0.640905107162776,0.218946697474305,0,0.140148195362919
TCGCG,0.0102036286935069,0.640905107162776,0.218946697474305,0,0.140148195362919
CGAGT,0.0102068815965814,0,0.404802744425386,0.489422527158376,0.105774728416238
ACTGC,0.0102539516404657,0.222868217054264,0.304263565891473,0.472868217054264,0
TCGAA,0.0102747465434932,0.126984126984127,0.53968253968254,0,0.333333333333333
GACTA,0.0102825813406047,0.120186697782964,0,0.496304939712174,0.383508362504862
TGTTC,0.010285643387381,0.216353478923311,0.545454545454545,0.238191975622143,0
TCACC,0.0102939492078014,0,0.287376638680218,0.425246722639564,0.287376638680218
CCACC,0.0103391104385299,0,0.222222222222222,0.611111111111111,0.166666666666667
CAGTG,0.0103678916624738,0.460226104830421,0.382476875642343,0,0.157297019527235
GTGTG,0.0103809715498169,0.34051724137931,0.306034482758621,0,0.353448275862069
TAGTG,0.0103809715498169,0.382239382239382,0.297297297297297,0,0.32046332046332
CTGTT,0.0104043749598024,0.617079889807163,0.214876033057851,0,0.168044077134986
CGTGG,0.0104396957076832,0.28343949044586,0.496815286624204,0.219745222929936,0
ACTAT,0.0105271027667736,0.256410256410256,0.461538461538462,0.282051282051282,0
CGCGC,0.0106382978661688,0.23015873015873,0,0.126984126984127,0.642857142857143
ACACG,0.0106588303335215,0,0.287376638680218,0.425246722639564,0.287376638680218
GGTGA,0.0107155409536415,0.25,0.397321428571429,0.352678571428571,0
ACATA,0.0107375398692424,0,0.288050314465409,0.335220125786164,0.376729559748428
ATTTC,0.0107487084955131,0.0727848101265823,0.706487341772152,0.220727848101266,0
GTTTA,0.0107487084955131,0.09375,0.53125,0.375,0
TCCTT,0.0107533331843685,0.211477151965994,0,0.383634431455898,0.404888416578108
GGAAA,0.0107557141430575,0,0.308362369337979,0.599303135888502,0.0923344947735192
GATAA,0.0107724196347302,0.372217275155833,0.368210151380231,0.259572573463936,0
CGCGA,0.0107781975392519,0.23015873015873,0,0.126984126984127,0.642857142857143
CTAGA,0.0107852698353226,0,0.5,0.0769230769230769,0.423076923076923
GGAAG,0.0107988471467413,0,0.398961038961039,0.51012987012987,0.0909090909090909
AGAGG,0.0108705740708609,0,0.355311355311355,0.526425954997384,0.118262689691261
GGAGT,0.0108752180838375,0,0.365180467091295,0.484076433121019,0.150743099787686
ACTTA,0.010935762231476,0.0728484300880958,0.863677433928168,0.0634741359837362,0
TATAA,0.010965347560438,0.329842931937173,0.445026178010471,0.225130890052356,0
AAGGT,0.0109775972866443,0.589238845144357,0.224409448818898,0,0.186351706036745
CCTAA,0.0110284718448739,0.334143377885784,0.398541919805589,0.267314702308627,0
GATGA,0.0110356249043913,0.255687973997833,0.458288190682557,0.28602383531961,0
ACACC,0.0110817320596327,0,0.0833333333333333,0.416666666666667,0.5
GTAGC,0.0112333255735405,0,0.174467310143872,0.564924421781096,0.260608268075032
TATTC,0.0112388655316686,0.0471111111111111,0.901777777777778,0.0511111111111111,0
GGGAG,0.011249618454266,0.568070266081116,0.34513045724619,0,0.0867992766726944
TGTAA,0.0112528460560466,0.336770754880945,0.423324256995539,0.239904988123515,0
CGATT,0.011277185360956,0,0.395790097835755,0.526237770530685,0.0779721316335606
TCCAC,0.011306035718229,0.218594355285003,0,0.209739900387382,0.571665744327615
CGACA,0.0113496875191699,0,0.341949004540692,0.563395040167656,0.0946559552916521
ACTAC,0.01135750519085,0.292837356549268,0.542276744492811,0.164885898957921,0
CCACA,0.0113730124564795,0,0.287376638680218,0.425246722639564,0.287376638680218
TTCTT,0.0114047748044387,0.108491228070175,0,0.488982456140351,0.402526315789474
CGCAC,0.0114092187394492,0.743950478334271,0,0.121553179516038,0.134496342149691
AGCCT,0.011419043335257,0.216063154281792,0,0.244894456838854,0.539042388879355
TCATG,0.0114198260116283,0,0.260883905013193,0.449208443271768,0.28990765171504
TCATT,0.0114198260116283,0,0.260883905013193,0.449208443271768,0.28990765171504
TGCAC,0.011448090902056,0.743950478334271,0,0.121553179516038,0.134496342149691
CGTTG,0.0115722254410036,0.216353478923311,0.545454545454545,0.238191975622143,0
GCTAT,0.0116190879360148,0.360356865787432,0.518231186966641,0.121411947245927,0
TCGTG,0.0117357063777247,0.465028773793714,0.379592740150509,0,0.155378486055777
TGGTG,0.0117357063777247,0.545517902256294,0.352818189737782,0,0.101663908005924
TATTG,0.011803810923534,0.166530707376763,0.628015382822515,0.205453909800723,0
CGTTA,0.0118462998283664,0.216353478923311,0.545454545454545,0.238191975622143,0
CATTC,0.0118960959690035,0.0408472012102874,0.853252647503782,0.10590015128593,0
GAGGT,0.0119672271297059,0.560055865921788,0.201815642458101,0,0.238128491620112
CCATA,0.0119832781796836,0,0.260883905013193,0.449208443271768,0.28990765171504
ATCGA,0.0120125098818913,0.214285714285714,0,0.214285714285714,0.571428571428571
CCATG,0.0120542158116413,0,0.260883905013193,0.449208443271768,0.28990765171504
CCATT,0.0120542158116413,0,0.260883905013193,0.449208443271768,0.28990765171504
GAGAA,0.0120639366154714,0.612425690639935,0.190931343979485,0,0.19664296538058
CCGAT,0.0120828409433487,0.427893904795363,0.452661162831548,0,0.11944493237309
TATTA,0.0121181216173795,0.0714285714285714,0.685714285714286,0.242857142857143,0
AATGT,0.0121304097035968,0.269642857142857,0.548214285714286,0.182142857142857,0
CGCCG,0.0121325708062461,0.216063154281792,0,0.244894456838854,0.539042388879355
GCTAC,0.0121328227508708,0.333333333333333,0.541666666666667,0.125,0
CATTT,0.0121476359415451,0.183292008392142,0.664886515353805,0.151821476254053,0
ACCTA,0.0121598379481604,0.134382566585956,0,0.369249394673124,0.49636803874092
CATGT,0.0121792224975044,0.329787234042553,0.473404255319149,0.196808510638298,0
TTGTG,0.012187284653694,0.372479574998994,0.412081941481869,0,0.215438483519137
CCGTG,0.0121916446161417,0.465028773793714,0.379592740150509,0,0.155378486055777
CGGTG,0.0121916446161417,0.545517902256294,0.352818189737782,0,0.101663908005924
TCACT,0.0122002144672322,0,0.292016806722689,0.379831932773109,0.328151260504202
AGTTC,0.0122004126888919,0.216353478923311,0.545454545454545,0.238191975622143,0
ATGCG,0.0122076535067301,0.592433537832311,0.261145194274029,0,0.146421267893661
GGGCG,0.0122076535067301,0.460674157303371,0.471910112359551,0,0.0674157303370786
TCTAT,0.0123193350157311,0.166666666666667,0.75,0.0833333333333333,0
ACTAG,0.0123358756123148,0.245756958587916,0.543109300746775,0.211133740665309,0
CCTTA,0.0123522020633338,0.0728484300880958,0.863677433928168,0.0634741359837362,0
GAACA,0.0123691268824441,0,0.238421395955643,0.521037181996086,0.240541422048271
TAACA,0.0123691268824441,0,0.156914893617021,0.579787234042553,0.263297872340426
CGCAA,0.0123899891223542,0.743950478334271,0,0.121553179516038,0.134496342149691
AGTAT,0.0123947547707955,0.336770754880945,0.423324256995539,0.239904988123515,0
TGCCT,0.0124141107855564,0.216063154281792,0,0.244894456838854,0.539042388879355
CCTGG,0.0124234901428678,0.0797723642172524,0.178614217252396,0.741613418530351,0
GGACG,0.0124237592377951,0,0.245398773006135,0.674846625766871,0.0797546012269939
GAAAG,0.0124352156029515,0,0.384087791495199,0.515775034293553,0.100137174211248
CATTA,0.0124935278736337,0.18748785700408,0.587526714591024,0.224985428404896,0
TCAGC,0.0124985446633108,0,0.280986372485399,0.448410123296561,0.27060350421804
GGAAT,0.0125201312655571,0,0.338805970149254,0.526865671641791,0.134328358208955
CATGG,0.0125218023241953,0.0858624663849405,0.191701882443335,0.722435651171725,0
ATAAG,0.0125788788401637,0,0.254396248534584,0.593200468933177,0.152403282532239
ACTTG,0.0125804222334128,0.0728402032749859,0.86369282891022,0.0634669678147939,0
GCATA,0.0126152621383821,0,0.1625,0.5625,0.275
AATTC,0.0126186659617987,0.0725614591593973,0.816712926249009,0.110725614591594,0
GATGG,0.012643463224753,0.305686615346412,0.453687608641669,0.24062577601192,0
GGTTC,0.012667299730585,0.204347826086957,0.502898550724638,0.292753623188406,0
TTCTC,0.0127383511396925,0.108491228070175,0,0.488982456140351,0.402526315789474
TTCCC,0.0127442371552975,0.235239852398524,0,0.376383763837638,0.388376383763838
TTCCT,0.012806323536921,0.235239852398524,0,0.376383763837638,0.388376383763838
ACGTG,0.0129138887066979,0.465028773793714,0.379592740150509,0,0.155378486055777
AGGTG,0.0129138887066979,0.545517902256294,0.352818189737782,0,0.101663908005924
CGGCA,0.0129678704337603,0.583620096352374,0.301445285615967,0,0.114934618031659
TCATA,0.0130226583231724,0,0.282475490196078,0.512867647058823,0.204656862745098
ACCTG,0.01303688817695,0.158825894652191,0,0.371934057096904,0.469240048250905
GCATG,0.0130720907378286,0,0.260883905013193,0.449208443271768,0.28990765171504
GCATT,0.0130720907378286,0,0.260883905013193,0.449208443271768,0.28990765171504
CTGTG,0.0130969811493041,0.372479574998994,0.412081941481869,0,0.215438483519137
CAAGT,0.0131497118354489,0,0.403271291596165,0.488437676254935,0.1082910321489
CAAGC,0.0131605982572857,0,0.343331511341897,0.42894233397103,0.227726154687073
TGCCG,0.0131928856857019,0.216063154281792,0,0.244894456838854,0.539042388879355
TGCTT,0.0131928856857019,0.154255319148936,0,0.363475177304965,0.482269503546099
CGCGT,0.013205056685209,0.23015873015873,0,0.126984126984127,0.642857142857143
GTAGT,0.0132263782661184,0,0.174467310143872,0.564924421781096,0.260608268075032
AATGC,0.0133219725701977,0.222868217054264,0.304263565891473,0.472868217054264,0
ATAGA,0.0133636327384489,0,0.174467310143872,0.564924421781096,0.260608268075032
GAAGT,0.0134470643153817,0,0.275502008032128,0.350200803212851,0.37429718875502
CTGCG,0.0135606598515596,0.592433537832311,0.261145194274029,0,0.146421267893661
TTGCG,0.0135606598515596,0.592433537832311,0.261145194274029,0,0.146421267893661
AACAT,0.0135882821829274,0.23568281938326,0,0.21334172435494,0.5509754562618
GAACC,0.0135996144812687,0,0.151685393258427,0.48876404494382,0.359550561797753
TAACC,0.0135996144812687,0,0.276522405208732,0.432592876292608,0.29088471849866
TTCAA,0.0136430582224406,0.261639344262295,0,0.343825136612022,0.394535519125683
CGAGA,0.0136741848597489,0,0.355311355311355,0.526425954997384,0.118262689691261
TGTTA,0.0136865744757612,0.216353478923311,0.545454545454545,0.238191975622143,0
AATAA,0.0136939545908401,0.322600619195046,0.432404540763674,0.24499484004128,0
GCAAC,0.0137088089757146,0,0.315217391304348,0.478260869565217,0.206521739130435
ACATG,0.0139087840129134,0,0.260883905013193,0.449208443271768,0.28990765171504
ACATT,0.0139087840129134,0,0.260883905013193,0.449208443271768,0.28990765171504
GAACG,0.0139614403408956,0,0.297225891677675,0.520475561426684,0.182298546895641
TAACG,0.0139614403408956,0,0.360759493670886,0.493670886075949,0.145569620253165
AAAAC,0.0140165821812963,0,0.238095238095238,0.471861471861472,0.29004329004329
ACTAA,0.0140441889960492,0.292837356549268,0.542276744492811,0.164885898957921,0
GATTC,0.0140946161664178,0.0740613749357106,0.821532659009086,0.104405966055203,0
AACAG,0.0141242432422428,0.205051369863014,0,0.277397260273973,0.517551369863014
AAACA,0.0141575389905704,0,0.244360902255639,0.481203007518797,0.274436090225564
CAACG,0.0141575389905704,0,0.432885166409522,0.426383072514878,0.140731761075601
ATGTG,0.0141803472851384,0.372479574998994,0.412081941481869,0,0.215438483519137
CGCCC,0.0143411383183436,0.216063154281792,0,0.244894456838854,0.539042388879355
ATAAT,0.0143956472255752,0,0.254396248534584,0.593200468933177,0.152403282532239
GTTAT,0.0144573220034108,0.156363636363636,0.634805194805195,0.208831168831169,0
CTAGG,0.0144582329597811,0,0.174467310143872,0.564924421781096,0.260608268075032
TTCGG,0.0144944601699586,0.214285714285714,0,0.214285714285714,0.571428571428571
GAGTT,0.0145063320950561,0.63961038961039,0.291486291486291,0,0.0689033189033189
TACCT,0.0145338714301784,0.301583042661658,0,0.150523209015294,0.547893748323048
ACAAT,0.0145412988181666,0,0.611157368859284,0.244379683597002,0.144462947543714
TTCCG,0.0145477653051888,0.235239852398524,0,0.376383763837638,0.388376383763838
AAAGA,0.0145820694419991,0,0.205250596658711,0.51909307875895,0.275656324582339
CATGC,0.0146043333721867,0.190196078431373,0.572549019607843,0.237254901960784,0
GATGC,0.0146108948434305,0.372477064220184,0.445871559633028,0.181651376146789,0
AATAC,0.0146820996212186,0.304655195411498,0.415499533146592,0.27984527144191,0
TAAGG,0.0147402086478135,0,0.44,0.344615384615385,0.215384615384615
CCTAC,0.0147769313781999,0.25,0.557692307692308,0.192307692307692,0
GCACG,0.0148715580771097,0,0.314647377938517,0.49005424954792,0.195298372513562
AAGCG,0.0149136661963892,0.616986301369863,0.236369863013699,0,0.146643835616438
GCGCG,0.0149136661963892,0.640905107162776,0.218946697474305,0,0.140148195362919
TACAT,0.0149395626474891,0.254019292604502,0,0.162379421221865,0.583601286173633
GATAG,0.0150239174178567,0.332610146862483,0.424232309746328,0.243157543391188,0
TTCGT,0.0151124073029435,0.214285714285714,0,0.214285714285714,0.571428571428571
ATAGC,0.0151520966287355,0,0.174467310143872,0.564924421781096,0.260608268075032
CTGCA,0.0152025363593826,0.596824570536179,0.272644456012493,0,0.130530973451327
CCTAT,0.0152317084649632,0.235399820305481,0.633423180592992,0.131176999101527,0
TAAGC,0.0152390259667161,0,0.280986372485399,0.448410123296561,0.27060350421804
AAACC,0.0152430165694512,0,0.0833333333333333,0.416666666666667,0.5
CAACT,0.0152430165694512,0,0.352582900969998,0.495525979396947,0.151891119633055
TCGAT,0.0152672784740463,0.427893904795363,0.452661162831548,0,0.11944493237309
ATTAA,0.0154056226181629,0.212389380530973,0.511897738446411,0.275712881022616,0
TTCGC,0.0155239549508492,0.214285714285714,0,0.214285714285714,0.571428571428571
CATAC,0.0155277902082866,0.265120132560066,0.414664457332229,0.320215410107705,0
TAAGT,0.0155972928066465,0,0.341683884297521,0.399793388429752,0.258522727272727
AACAC,0.0156847072873381,0.30234375,0,0.1796875,0.51796875
TGGTT,0.01569875490847,0.545517902256294,0.352818189737782,0,0.101663908005924
TTAAA,0.0157485409221003,0,0.254396248534584,0.593200468933177,0.152403282532239
CCATC,0.0157843046907187,0,0.261875761266748,0.475030450669915,0.263093788063337
TAAGA,0.015797240699766,0,0.242814318462352,0.503497325574561,0.253688355963087
GATTA,0.0158415491404446,0.241782322863404,0.581446311176041,0.176771365960555,0
GCTTC,0.0159331727467273,0.0523270440251572,0.906415094339623,0.0412578616352201,0
GATTT,0.0159603132779577,0.204457364341085,0.626937984496124,0.168604651162791,0
TGCCC,0.0159748454862077,0.216063154281792,0,0.244894456838854,0.539042388879355
TATAG,0.0159977692582449,0.142857142857143,0.836734693877551,0.0204081632653061,0
CATAG,0.016001215696196,0.209082308420057,0.591296121097446,0.199621570482498,0
CTTAG,0.0160222326867843,0.217391304347826,0.493788819875776,0.288819875776398,0
TACAA,0.0160557759421525,0.123994638069705,0,0.48558981233244,0.390415549597855
TGGAT,0.0160701059623026,0.641263792966579,0.249662618083671,0,0.10907358894975
GTGAT,0.0160843180880223,0.473402267347702,0.332004484863585,0,0.194593247788713
GAATT,0.016088374259921,0,0.278371710526316,0.512746710526316,0.208881578947368
GAACT,0.0161116783086489,0,0.329046898638427,0.494704992435703,0.17624810892587
TAACT,0.0161116783086489,0,0.292016806722689,0.379831932773109,0.328151260504202
TATAT,0.016116767728699,0.166666666666667,0.75,0.0833333333333333,0
AATTT,0.0161984435616478,0.122302158273381,0.827338129496403,0.0503597122302158,0
CTAAC,0.0162333958919766,0,0.254396248534584,0.593200468933177,0.152403282532239
TATTT,0.0163541162238141,0.135724090597117,0.71636925188744,0.147906657515443,0
GCGCA,0.0164166558141583,0.640905107162776,0.218946697474305,0,0.140148195362919
CATGA,0.016452552927609,0.224346076458753,0.423541247484909,0.352112676056338,0
AAAGT,0.0164526631441328,0,0.201729106628242,0.420749279538905,0.377521613832853
ATAGT,0.0164583997014405,0,0.174467310143872,0.564924421781096,0.260608268075032
CGTAT,0.0164653121053506,0.213861386138614,0.586138613861386,0.2,0
GCAGT,0.0165186988263011,0,0.254581475978207,0.318969787023279,0.426448736998514
CTAGC,0.0166542048728789,0,0.174467310143872,0.564924421781096,0.260608268075032
CGCTA,0.0167105272394449,0.148459383753501,0,0.239495798319328,0.612044817927171
TTTAG,0.0168083355426431,0.212389380530973,0.511897738446411,0.275712881022616,0
CTTAT,0.0168099228212177,0.236363636363636,0.472727272727273,0.290909090909091,0
GAGAT,0.0169763364283727,0.644732870510112,0.245698762450951,0,0.109568367038938
AATTG,0.0172239552716683,0.224930747922438,0.567313019390582,0.207756232686981,0
ATTAC,0.0172834899930873,0.212389380530973,0.511897738446411,0.275712881022616,0
GAAAC,0.0173756580713828,0,0.356045424181697,0.529726118904476,0.114228456913828
GAAGC,0.0174981462517236,0,0.184322033898305,0.535310734463277,0.280367231638418
CTAAT,0.0177022582607233,0,0.254396248534584,0.593200468933177,0.152403282532239
CTACA,0.0177478154718385,0,0.344827586206897,0.5,0.155172413793103
GTACC,0.0177478154718385,0,0.203703703703704,0.521604938271605,0.274691358024691
GTACT,0.0177478154718385,0,0.203703703703704,0.521604938271605,0.274691358024691
TACAG,0.0177580909986866,0.150073206442167,0,0.104685212298682,0.745241581259151
TGGCA,0.0178149929975813,0.606502657930523,0.276672023735938,0,0.116825318333539
AAAAG,0.0178577332837434,0,0.251054852320675,0.455696202531646,0.293248945147679
AATAT,0.0179361175644051,0.256410256410256,0.461538461538462,0.282051282051282,0
TCATC,0.0179878111792527,0,0.300536672629696,0.474060822898032,0.225402504472272
GAGTG,0.0179928029078029,0.34051724137931,0.306034482758621,0,0.353448275862069
CGTAG,0.0180211921675051,0.336770754880945,0.423324256995539,0.239904988123515,0
CAAAA,0.0180603211354751,0,0.253521126760563,0.603286384976526,0.143192488262911
CTAAG,0.0181564503570762,0,0.254396248534584,0.593200468933177,0.152403282532239
ATCTT,0.0181789343295879,0.108491228070175,0,0.488982456140351,0.402526315789474
GTTAC,0.0182035085092693,0.162520729684909,0.570480928689884,0.266998341625207,0
CCTAG,0.0182214282344661,0.205442176870748,0.634013605442177,0.160544217687075,0
GATAT,0.0182390778490033,0.293908872901679,0.508393285371703,0.197697841726619,0
AAGTT,0.0182434497422323,0.578044878368954,0.295319358411617,0,0.126635763219428
CTAGT,0.0182486470269413,0,0.291666666666667,0.416666666666667,0.291666666666667
AGTAG,0.018261077244926,0.336770754880945,0.423324256995539,0.239904988123515,0
AATGG,0.0183104629271411,0.170542635658915,0.434108527131783,0.395348837209302,0
ATCTA,0.0183155525178352,0.108491228070175,0,0.488982456140351,0.402526315789474
CATAT,0.0183169484453037,0.225436179981635,0.607438016528926,0.16712580348944,0
TGTAG,0.0183711645204531,0.336770754880945,0.423324256995539,0.239904988123515,0
ATAAA,0.0183913775518634,0,0.254396248534584,0.593200468933177,0.152403282532239
AAAGC,0.0183916267442558,0,0.178029257521391,0.484405189069832,0.337565553408777
TAAAT,0.0184271111539865,0,0.395818745623687,0.370311093327998,0.233870161048314
GGGGA,0.0184467623955125,0.710779082177161,0.141408751334045,0,0.147812166488794
CAATC,0.0184739795925901,0,0.261875761266748,0.475030450669915,0.263093788063337
TTAGG,0.0185043262503798,0,0.174467310143872,0.564924421781096,0.260608268075032
AGCTC,0.0187568580013207,0.154255319148936,0,0.363475177304965,0.482269503546099
CGCTG,0.0187582733425387,0.154255319148936,0,0.363475177304965,0.482269503546099
TAAAA,0.018760897187529,0,0.298969072164948,0.529209621993127,0.171821305841924
AACCG,0.0188323101634186,0.21751039870143,0,0.304250786243279,0.478238815055291
GTCTA,0.0188379494630246,0.075451647183847,0,0.562167906482466,0.362380446333688
TACCG,0.0189193547639083,0.260940342813368,0,0.177918222732931,0.561141434453701
AAACG,0.0189344793659249,0,0.281808622502629,0.494216614090431,0.22397476340694
CAACA,0.0189344793659249,0,0.342006162273194,0.562136254707292,0.0958575830195139
GAAAT,0.018940460291675,0,0.338805970149254,0.526865671641791,0.134328358208955
GCACT,0.0189808197908207,0,0.414606741573034,0.293258426966292,0.292134831460674
TTCCA,0.0189809612949405,0.235239852398524,0,0.376383763837638,0.388376383763838
CTTAA,0.0189867734184404,0.212389380530973,0.511897738446411,0.275712881022616,0
TCTTA,0.0190066773807423,0.0714285714285714,0.685714285714286,0.242857142857143,0
CTGTA,0.01901178757342,0.487400619862552,0.322059021695189,0,0.190540358442258
ATACG,0.0190175168893131,0,0.203703703703704,0.521604938271605,0.274691358024691
TTACG,0.0190175168893131,0,0.203703703703704,0.521604938271605,0.274691358024691
GCGTT,0.0190323351040097,0.465028773793714,0.379592740150509,0,0.155378486055777
GAGGA,0.0191667671508801,0.642672858617131,0.194014447884417,0,0.163312693498452
TGCGT,0.0191937188385031,0.23015873015873,0,0.126984126984127,0.642857142857143
GTAAC,0.0192113053715959,0,0.254396248534584,0.593200468933177,0.152403282532239
CAAAT,0.0192619103693948,0,0.555555555555556,0.375,0.0694444444444444
TTAAC,0.0192825802873375,0,0.254396248534584,0.593200468933177,0.152403282532239
TGCTC,0.0193127626368242,0.154255319148936,0,0.363475177304965,0.482269503546099
TATAC,0.0193195997914499,0.323232323232323,0.54040404040404,0.136363636363636,0
TGTAT,0.0193273332761845,0.336770754880945,0.423324256995539,0.239904988123515,0
GTAGG,0.0195473796184741,0,0.247663551401869,0.38785046728972,0.364485981308411
GTAAA,0.0195676799503042,0,0.255269320843091,0.583138173302108,0.161592505854801
CAGTT,0.0196408628367893,0.463393990689801,0.456199746085485,0,0.0804062632247143
GGATG,0.0197349089216094,0,0.243634077334172,0.624017604526878,0.13234831813895
GAAGA,0.0198004411982468,0,0.171621284036972,0.566824881338996,0.261553834624032
ATGAT,0.0198713012290811,0.473402267347702,0.332004484863585,0,0.194593247788713
TTTAA,0.0199341719020392,0.212389380530973,0.511897738446411,0.275712881022616,0
CTGAT,0.0200039986206832,0.473402267347702,0.332004484863585,0,0.194593247788713
AACTT,0.0202033424151999,0.20842255531763,0,0.388722341184868,0.402855103497502
GAAAA,0.0202223090278921,0,0.259644825474587,0.588487446417636,0.151867728107777
TTAGC,0.0202377678191024,0,0.174467310143872,0.564924421781096,0.260608268075032
ATAAC,0.020271096700562,0,0.254396248534584,0.593200468933177,0.152403282532239
CTACG,0.0202872183067876,0,0.203703703703704,0.521604938271605,0.274691358024691
GTACA,0.0202872183067876,0,0.199858004969826,0.525026624068158,0.275115370962016
CAAAC,0.0203018225301194,0,0.326086956521739,0.326086956521739,0.347826086956522
TAAAG,0.020310305273728,0,0.37741935483871,0.416129032258065,0.206451612903226
TCGTT,0.020380291897855,0.465028773793714,0.379592740150509,0,0.155378486055777
TAAAC,0.0204420232335122,0,0.325024925224327,0.492522432701894,0.182452642073779
ACGTT,0.020444582868327,0.465028773793714,0.379592740150509,0,0.155378486055777
TTAAT,0.0204576701823349,0,0.254396248534584,0.593200468933177,0.152403282532239
TACCC,0.0205218659770198,0.0810810810810811,0,0.378378378378378,0.540540540540541
GGGCT,0.0205625508543982,0.616680707666386,0.274431339511373,0,0.108887952822241
CGTAA,0.020588477641108,0.336770754880945,0.423324256995539,0.239904988123515,0
AACCT,0.0206111785737466,0.270948012232416,0,0.303058103975535,0.425993883792049
TTTAT,0.0206129301846348,0.212389380530973,0.511897738446411,0.275712881022616,0
GTTAG,0.0206290718100811,0.212389380530973,0.511897738446411,0.275712881022616,0
AACTA,0.0206562626509979,0.134382566585956,0,0.369249394673124,0.49636803874092
GTAAT,0.0206801677403426,0,0.254396248534584,0.593200468933177,0.152403282532239
GTTAA,0.0208160712477242,0.212389380530973,0.511897738446411,0.275712881022616,0
ATACC,0.0208183227440689,0,0.203703703703704,0.521604938271605,0.274691358024691
ATACT,0.0208183227440689,0,0.203703703703704,0.521604938271605,0.274691358024691
TTACC,0.0208183227440689,0,0.203703703703704,0.521604938271605,0.274691358024691
TTACT,0.0208183227440689,0,0.203703703703704,0.521604938271605,0.274691358024691
TTAAG,0.0208210238594172,0,0.254396248534584,0.593200468933177,0.152403282532239
GGTTT,0.0208714521806037,0.162857142857143,0.522857142857143,0.314285714285714,0
ATTAT,0.0209360800713268,0.212389380530973,0.511897738446411,0.275712881022616,0
CGTAC,0.0209873919838096,0.159340659340659,0.659340659340659,0.181318681318681,0
ATAGG,0.0210428095355316,0,0.174467310143872,0.564924421781096,0.260608268075032
TTATC,0.021085629589968,0,0.320252593594948,0.319801533603969,0.359945872801083
GTAAG,0.0211343598366954,0,0.254396248534584,0.593200468933177,0.152403282532239
GTGTT,0.0211893251400615,0.372479574998994,0.412081941481869,0,0.215438483519137
CATAA,0.0211904604848033,0.334143377885784,0.398541919805589,0.267314702308627,0
TACGG,0.0213032868003164,0.277777777777778,0,0.185185185185185,0.537037037037037
AACGA,0.0213565383358362,0.124137931034483,0,0.517241379310345,0.358620689655172
TACCA,0.0215010957389228,0.217872778779294,0,0.286462357283887,0.495664863936819
TATGG,0.0216191590776995,0.212239583333333,0.5234375,0.264322916666667,0
CCGTT,0.0219848741770715,0.465028773793714,0.379592740150509,0,0.155378486055777
TTTAC,0.0220257903898321,0.212389380530973,0.511897738446411,0.275712881022616,0
TTGTT,0.0220429447208637,0.372479574998994,0.412081941481869,0,0.215438483519137
ATCTG,0.022051539699212,0.108491228070175,0,0.488982456140351,0.402526315789474
AGGTT,0.0221956792011174,0.545517902256294,0.352818189737782,0,0.101663908005924
CTACC,0.0223535763801841,0,0.203703703703704,0.521604938271605,0.274691358024691
CTACT,0.0223535763801841,0,0.203703703703704,0.521604938271605,0.274691358024691
ATATA,0.0223745920887802,0,0.320252593594948,0.319801533603969,0.359945872801083
TACGC,0.0223988928687098,0.0806451612903226,0,0.32258064516129,0.596774193548387
CAAAG,0.0224633403179863,0,0.443799111718483,0.402118209771097,0.15408267851042
AGCCA,0.0224877195408122,0.216063154281792,0,0.244894456838854,0.539042388879355
TAGCT,0.0225358440928651,0.62555912905253,0.24960260249159,0,0.12483826845588
TAGTT,0.0225678496527267,0.548634493078938,0.368686868686869,0,0.0826786382341938
AAATG,0.022687717838909,0,0.249518922386145,0.514592687620269,0.235888389993586
TCTTC,0.0227735193438929,0.0471111111111111,0.901777777777778,0.0511111111111111,0
TCTAC,0.0228680835066639,0.323232323232323,0.54040404040404,0.136363636363636,0
AATAG,0.022909194836051,0.245756958587916,0.543109300746775,0.211133740665309,0
TACGT,0.0229241265482909,0.200745804847732,0,0.128029832193909,0.671224362958359
ATGTT,0.0229546348454581,0.372479574998994,0.412081941481869,0,0.215438483519137
AACGG,0.0230643392701991,0.299145299145299,0,0.128205128205128,0.572649572649573
GGTAG,0.0231172141083408,0.334983780092197,0.419668772409083,0.245347447498719,0
CAGCA,0.0231684924466226,0.594724745540112,0.277224471927328,0,0.12805078253256
TGTAC,0.0234000792095296,0.336770754880945,0.423324256995539,0.239904988123515,0
TACTT,0.0234954018111146,0.211477151965994,0,0.383634431455898,0.404888416578108
GGTAA,0.0235258355061661,0.379441023211748,0.355281856939839,0.265277119848413,0
AAATC,0.0235568444864991,0,0.189931350114416,0.47254004576659,0.337528604118993
TAATA,0.0237389366398407,0,0.282475490196078,0.512867647058823,0.204656862745098
GCGTA,0.0238559457904821,0.612903225806452,0.233870967741935,0,0.153225806451613
TAGAT,0.0238761945882372,0.546262498016188,0.338993810506269,0,0.114743691477543
AACGT,0.0240918454908886,0.269035532994924,0,0.153299492385787,0.577664974619289
TGCGG,0.0241410726652673,0.23015873015873,0,0.126984126984127,0.642857142857143
GGTAT,0.024196207707454,0.309692671394799,0.463019250253293,0.227288078351908,0
AAGCT,0.0242400411676023,0.640099726556217,0.219559272961235,0,0.140341000482548
ATACA,0.0244199344535807,0,0.203703703703704,0.521604938271605,0.274691358024691
GTACG,0.0244199344535807,0,0.268292682926829,0.317073170731707,0.414634146341463
TTACA,0.0244199344535807,0,0.203703703703704,0.521604938271605,0.274691358024691
GGCAC,0.0244530364890382,0.923016905071521,0,0.0366710013003901,0.0403120936280884
AAAAA,0.0246189395926528,0,0.354140127388535,0.414012738853503,0.231847133757962
CGGTT,0.0246773087801068,0.4355,0.5,0,0.0645
CGGAT,0.0248385979714237,0.437735849056604,0.392452830188679,0,0.169811320754717
TAATT,0.0249484340484485,0,0.32699326221224,0.461538461538462,0.211468276249298
TAATG,0.0250170450380549,0,0.279156528791565,0.552473641524736,0.168369829683698
CAATA,0.0250551759016533,0,0.333614153327717,0.477253580454928,0.189132266217355
ATTAG,0.0251421940723998,0.212389380530973,0.511897738446411,0.275712881022616,0
ATCCT,0.0252720352380758,0.235239852398524,0,0.376383763837638,0.388376383763838
CGGCT,0.0254114442053465,0.606502657930523,0.276672023735938,0,0.116825318333539
ATGCT,0.0254201930615586,0.592433537832311,0.261145194274029,0,0.146421267893661
GTATG,0.0255758648872285,0,0.320252593594948,0.319801533603969,0.359945872801083
TGGCT,0.0256111239577105,0.606502657930523,0.276672023735938,0,0.116825318333539
GAATG,0.0257106058758346,0,0.243634077334172,0.624017604526878,0.13234831813895
CAATG,0.0261075559456323,0,0.394442238983724,0.467963477570464,0.137594283445812
AACCC,0.0262755381321302,0.246696635335785,0,0.278572401580166,0.474730963084048
GAATC,0.0262867140959726,0,0.208389715832206,0.483085250338295,0.308525033829499
AAATA,0.0265228286600285,0,0.288050314465409,0.335220125786164,0.376729559748428
CAATT,0.0265670476624131,0,0.395790097835755,0.526237770530685,0.0779721316335606
CAGCT,0.0266095227195304,0.60783155307685,0.263989980149352,0,0.128178466773797
TAATC,0.0267004442728306,0,0.300536672629696,0.474060822898032,0.225402504472272
GTATA,0.0272044937902625,0,0.345564074479737,0.275465498357065,0.378970427163198
AACTC,0.0277180311939795,0.135650224215247,0,0.381165919282511,0.483183856502242
AAAAT,0.027736277381802,0,0.611157368859284,0.244379683597002,0.144462947543714
AACAA,0.0277385652798011,0.188751926040062,0,0.356702619414484,0.454545454545455
TTCTA,0.0277981191228482,0.108491228070175,0,0.488982456140351,0.402526315789474
AAGCA,0.0278171526342299,0.608082593500181,0.245932591491584,0,0.145984815008235
TCGCT,0.02784512978039,0.640905107162776,0.218946697474305,0,0.140148195362919
CCGCT,0.0280922511925619,0.640905107162776,0.218946697474305,0,0.140148195362919
TACTC,0.0290634651329089,0.130579891531081,0,0.401752190237797,0.467667918231122
CTATG,0.0291677701581228,0,0.320252593594948,0.319801533603969,0.359945872801083
TTGCT,0.0294467674043137,0.592433537832311,0.261145194274029,0,0.146421267893661
TAGCA,0.0295102540191927,0.523809523809524,0.19047619047619,0,0.285714285714286
GTAGA,0.0295756122870813,0,0.169313181557299,0.575282188635929,0.255404629806773
GGGAT,0.0296041538649323,0.644732870510112,0.245698762450951,0,0.109568367038938
AACCA,0.0297889881642197,0.223581213307241,0,0.299021526418787,0.477397260273973
GAATA,0.0299018034071522,0,0.32756046581069,0.39743206927441,0.2750074649149
CTGCT,0.0299196415184442,0.592433537832311,0.261145194274029,0,0.146421267893661
ATATT,0.0300656285729656,0,0.320252593594948,0.319801533603969,0.359945872801083
AACTG,0.0307484279763991,0.158825894652191,0,0.371934057096904,0.469240048250905
GTATT,0.0310515533140061,0,0.320252593594948,0.319801533603969,0.359945872801083
TTATG,0.0311883053001615,0,0.320252593594948,0.319801533603969,0.359945872801083
TCCTA,0.0312410250749016,0.0673076923076923,0,0.418269230769231,0.514423076923077
AGCGG,0.0313773773493744,0.23015873015873,0,0.126984126984127,0.642857142857143
CTAAA,0.0314793178687812,0,0.253521126760563,0.603286384976526,0.143192488262911
TACTA,0.0316173615638401,0.0673076923076923,0,0.418269230769231,0.514423076923077
CTTAC,0.0316205332281054,0.274311926605505,0.390825688073395,0.334862385321101,0
CTATT,0.0322195782308255,0,0.320252593594948,0.319801533603969,0.359945872801083
CTATC,0.032352568157794,0,0.320252593594948,0.319801533603969,0.359945872801083
GGGTT,0.0329940356698803,0.63961038961039,0.291486291486291,0,0.0689033189033189
ATATC,0.0332673729829371,0,0.320252593594948,0.319801533603969,0.359945872801083
ACGCA,0.0335585070691579,0.640905107162776,0.218946697474305,0,0.140148195362919
ACGAT,0.0336893519348127,0.454470877768663,0.449958982772765,0,0.0955701394585726
TACTG,0.0341355677798326,0.284883720930233,0,0.19656699889258,0.518549280177187
AAATT,0.0342887707642206,0,0.377604166666667,0.427262931034483,0.195132902298851
TTATT,0.034446367958997,0,0.320252593594948,0.319801533603969,0.359945872801083
GATAC,0.0345603534453718,0.38339222614841,0.358657243816254,0.257950530035336,0
GGTAC,0.0347207285721327,0.445617255621845,0.296007342817806,0.258375401560349,0
AGGTA,0.035563351067092,0.545517902256294,0.352818189737782,0,0.101663908005924
TTGCA,0.0356525176534686,0.592433537832311,0.261145194274029,0,0.146421267893661
CTATA,0.0359345958764776,0,0.320252593594948,0.319801533603969,0.359945872801083
CCGCA,0.0367995039842626,0.640905107162776,0.218946697474305,0,0.140148195362919
CAAGG,0.0368097330889304,0,0.50632183908046,0.334099616858238,0.159578544061303
TGCAA,0.0368340544284786,0.743950478334271,0,0.121553179516038,0.134496342149691
ATGCA,0.0373466147032268,0.592433537832311,0.261145194274029,0,0.146421267893661
AGCTG,0.0374430399281318,0.154255319148936,0,0.363475177304965,0.482269503546099
GATGT,0.0375325779737264,0.359978249048396,0.44100054377379,0.199021207177814,0
AGCCG,0.0377761319368171,0.216063154281792,0,0.244894456838854,0.539042388879355
AGCTA,0.0383395510889653,0.154255319148936,0,0.363475177304965,0.482269503546099
AGGCT,0.0389520769737134,0.606502657930523,0.276672023735938,0,0.116825318333539
AGCGT,0.0399090766149548,0.23015873015873,0,0.126984126984127,0.642857142857143
AGCGA,0.0400546939190142,0.23015873015873,0,0.126984126984127,0.642857142857143
CATTG,0.0403108881653752,0.091297923633253,0.295979469632164,0.612722606734583,0
TGGTA,0.0407573298869612,0.545517902256294,0.352818189737782,0,0.101663908005924
AAGTA,0.0407916628749083,0.483959670027498,0.335013748854262,0,0.18102658111824
TTATA,0.0408842513053142,0,0.320252593594948,0.319801533603969,0.359945872801083
ACGCT,0.0412544814426455,0.640099726556217,0.219559272961235,0,0.140341000482548
GTATC,0.0419067623386662,0,0.202046035805627,0.526854219948849,0.271099744245524
ATGTA,0.0427804279483277,0.372479574998994,0.412081941481869,0,0.215438483519137
GAGTA,0.0434312268374792,0.372154244677042,0.420571572984015,0,0.207274182338942
AGCTT,0.0445213411614396,0.154255319148936,0,0.363475177304965,0.482269503546099
TAGTA,0.0449468459308036,0.39153402377146,0.404862028219921,0,0.203603948008619
TCGTA,0.0449497932514296,0.465028773793714,0.379592740150509,0,0.155378486055777
TTGTA,0.0452529888297704,0.372479574998994,0.412081941481869,0,0.215438483519137
CGGTA,0.0473176302010488,0.545517902256294,0.352818189737782,0,0.101663908005924
ATATG,0.0474786185943392,0,0.320252593594948,0.319801533603969,0.359945872801083
AGCAC,0.0485310364877644,0.743950478334271,0,0.121553179516038,0.134496342149691
AGCAA,0.0493164397215977,0.743950478334271,0,0.121553179516038,0.134496342149691
GAGCT,0.0496525872229165,0.617796315606535,0.273409801876955,0,0.10879388251651
CAGTA,0.0501950861820737,0.487400619862552,0.322059021695189,0,0.190540358442258
AGCAG,0.0513179499537331,0.743950478334271,0,0.121553179516038,0.134496342149691
AGCCC,0.0530800181973134,0.216063154281792,0,0.244894456838854,0.539042388879355
CCGTA,0.0536968603368798,0.465028773793714,0.379592740150509,0,0.155378486055777
GTGTA,0.0541326820746956,0.349269235414905,0.430969923903853,0,0.219760840681242
AGCAT,0.0553682642871536,0.743950478334271,0,0.121553179516038,0.134496342149691
GGGTA,0.0617049101061733,0.525989268947015,0.352280348759222,0,0.121730382293763
ACGTA,0.066028904109247,0.483959670027498,0.335013748854262,0,0.18102658111824
GGGCA,0.111381845555934,0.60209935310631,0.27316001464665,0,0.12474063224704
