Genotype,Mutation type,REL from replicate 1,REL from replicate 2,REL from replicate 3,REL from replicate 4
1-C-A,Nonsynonymous_mutation,0.920794,0.882265,0.972176,0.943619
1-C-G,Nonsynonymous_mutation,0.985031,0.921612,0.848297,0.876365
10-A-C,Nonsynonymous_mutation,0.994439,0.931579,0.889149,0.914677
10-A-G,Nonsynonymous_mutation,0.903545,0.895476,0.898901,1.03413
10-A-T,Nonsynonymous_mutation,0.900733,0.955153,0.960882,0.97319
100-G-A,Nonsynonymous_mutation,0.940427,0.911309,0.93079,0.997273
100-G-C,Nonsynonymous_mutation,1.19171,0.993347,1.01569,0.936662
100-G-T,Nonsynonymous_mutation,0.910499,0.943044,0.872495,0.902734
101-C-A,Nonsynonymous_mutation,0.968521,1.05734,0.612102,1.06704
101-C-G,Nonsynonymous_mutation,0.909181,1.02247,1.089,0.987241
101-C-T,Nonsynonymous_mutation,0.89335,0.933978,0.916373,0.995465
102-C-A,Synonymous_mutation,0.976828,0.976544,0.883414,1.02005
102-C-G,Synonymous_mutation,0.934404,0.836194,0.955041,1.02242
102-C-T,Synonymous_mutation,0.952096,0.857582,1.03029,0.910118
103-G-A,Nonsynonymous_mutation,0.900063,0.929353,0.985218,0.929575
103-G-C,Nonsynonymous_mutation,1.01757,1.02135,0.893422,0.886652
103-G-T,Nonsynonymous_mutation,0.928515,0.959422,1.04268,1.01412
104-T-A,Nonsynonymous_mutation,0.956456,0.955332,0.881282,0.89034
104-T-C,Nonsynonymous_mutation,1.06425,1.01493,0.957599,1.00346
105-A-C,Synonymous_mutation,0.988567,1.02484,1.0337,0.990557
105-A-G,Synonymous_mutation,1.04815,0.963853,0.923688,1.03427
105-A-T,Synonymous_mutation,1.01542,1.00506,1.03031,1.00694
106-G-A,Nonsynonymous_mutation,0.846623,0.783258,0.85031,0.87766
106-G-C,Nonsynonymous_mutation,0.926625,0.901667,1.0369,0.843522
107-A-C,Nonsynonymous_mutation,0.957965,0.876362,0.909891,0.971524
107-A-G,Nonsynonymous_mutation,1.02365,0.946266,0.89603,0.920745
107-A-T,Nonsynonymous_mutation,0.842676,1.00464,0.754208,0.997286
108-A-C,Nonsynonymous_mutation,0.99743,0.929576,0.950893,0.848636
108-A-G,Synonymous_mutation,0.959592,0.901488,0.987931,0.910138
108-A-T,Nonsynonymous_mutation,0.947564,0.933527,0.949183,0.944425
109-A-C,Nonsynonymous_mutation,0.96157,0.933622,1.08004,0.983869
109-A-G,Nonsynonymous_mutation,1.08415,0.994515,0.981781,1.01461
109-A-T,Nonsynonymous_mutation,0.866316,0.963501,0.891248,0.927984
11-C-A,Nonsynonymous_mutation,0.917875,0.925797,1.01403,0.912508
11-C-G,Nonsynonymous_mutation,0.882968,0.934926,0.874597,0.856182
11-C-T,Nonsynonymous_mutation,0.899106,0.878786,1.03195,0.960982
110-A-C,Nonsynonymous_mutation,1.03924,0.975566,0.877194,1.04223
110-A-G,Nonsynonymous_mutation,0.962523,0.896373,0.956125,0.943519
110-A-T,Nonsynonymous_mutation,0.976422,0.949162,0.895458,0.878938
111-C-A,Nonsynonymous_mutation,0.825999,0.993197,0.877529,0.97964
111-C-G,Nonsynonymous_mutation,0.841134,0.964453,0.926943,0.950406
111-C-T,Synonymous_mutation,0.872072,0.829556,1.02965,0.952256
112-A-C,Nonsynonymous_mutation,0.962454,0.934552,1.01913,0.915456
112-A-G,Nonsynonymous_mutation,1.22602,1.10908,1.16767,1.219
112-A-T,Nonsynonymous_mutation,0.926037,0.973581,1.02837,1.01197
113-G-A,Nonsynonymous_mutation,0.979124,1.0305,1.06101,0.957053
113-G-C,Nonsynonymous_mutation,1.01796,1.02482,1.03164,1.11538
113-G-T,Nonsynonymous_mutation,1.12288,1.012,0.989519,1.09321
114-T-A,Nonsynonymous_mutation,0.991014,0.989876,1.09894,1.0788
114-T-C,Synonymous_mutation,0.966184,0.905025,0.965456,0.972891
114-T-G,Nonsynonymous_mutation,0.895757,0.915029,1.00544,0.985967
115-T-A,Nonsynonymous_mutation,1.17243,0.862587,1.04042,0.861354
115-T-C,Nonsynonymous_mutation,0.771729,0.968517,1.07511,1.09494
115-T-G,Nonsynonymous_mutation,1.08278,1.03387,1.04511,0.946398
116-G-C,Nonsynonymous_mutation,1.03736,0.889914,1.05648,1.11383
116-G-T,Nonsynonymous_mutation,1.07009,1.03738,1.04045,1.06548
117-G-C,Nonsynonymous_mutation,1.02241,0.942154,0.985437,0.93815
117-G-T,Nonsynonymous_mutation,0.978105,0.996265,0.964695,0.988477
118-G-A,Nonsynonymous_mutation,0.958956,0.907226,0.975619,0.918128
118-G-C,Nonsynonymous_mutation,0.76943,0.6153,0.588274,0.817374
118-G-T,Nonsynonymous_mutation,0.87752,0.861774,0.881199,0.87484
119-G-C,Nonsynonymous_mutation,1.00067,0.952516,1.00557,0.902686
119-G-T,Nonsynonymous_mutation,0.986016,1.1173,1.14972,1.04916
12-C-A,Synonymous_mutation,0.984125,0.996331,1.08704,0.97422
12-C-G,Synonymous_mutation,0.948696,1.04305,0.977179,0.899576
12-C-T,Synonymous_mutation,0.931711,0.858918,0.88598,0.864577
120-T-A,Synonymous_mutation,1.04309,0.96784,0.925154,0.917918
120-T-C,Synonymous_mutation,0.89737,0.899335,0.985633,0.955331
120-T-G,Synonymous_mutation,0.958503,0.928079,0.982162,0.900675
121-G-A,Nonsynonymous_mutation,1.03585,0.984497,1.17853,0.981831
121-G-C,Nonsynonymous_mutation,1.09049,1.04222,0.893726,1.08178
121-G-T,Nonsynonymous_mutation,0.930547,1.14035,1.03272,0.879685
122-G-A,Nonsynonymous_mutation,1.03162,0.959298,1.09495,0.972626
122-G-C,Nonsynonymous_mutation,0.991816,0.985288,0.938179,0.983287
122-G-T,Nonsynonymous_mutation,0.931321,0.818476,1.06497,0.899993
123-T-A,Synonymous_mutation,0.953688,0.911547,0.958689,0.947655
123-T-C,Synonymous_mutation,0.951678,0.940755,0.959361,1.0207
123-T-G,Synonymous_mutation,1.01707,0.940169,1.04717,0.944394
124-C-A,Nonsynonymous_mutation,0.927493,0.926383,1.02059,0.98097
124-C-G,Nonsynonymous_mutation,0.895263,0.906127,0.989355,0.878645
124-C-T,Nonsynonymous_mutation,1.05591,0.774006,1.14978,1.03929
125-C-A,Nonsynonymous_mutation,0.935234,0.98524,0.991416,0.956054
125-C-G,Nonsynonymous_mutation,0.865489,0.900807,0.922474,0.935123
125-C-T,Nonsynonymous_mutation,0.942726,0.915706,0.898937,0.88421
126-A-C,Synonymous_mutation,0.933636,0.938265,0.83083,0.899156
126-A-G,Synonymous_mutation,0.880942,0.865846,1.13598,0.961674
126-A-T,Synonymous_mutation,0.958047,0.964006,1.1656,1.0512
127-G-A,Nonsynonymous_mutation,0.949209,1.00884,1.06133,0.848774
127-G-C,Nonsynonymous_mutation,0.920803,0.897292,1.06141,1.05042
127-G-T,Nonsynonymous_mutation,0.892838,0.893923,0.932582,0.93762
128-A-C,Nonsynonymous_mutation,0.92114,0.974427,0.908259,0.938694
128-A-G,Nonsynonymous_mutation,0.91272,0.858922,1.04887,0.949817
128-A-T,Nonsynonymous_mutation,0.927301,0.925336,1.0315,1.0901
129-C-A,Nonsynonymous_mutation,0.95303,0.962985,0.842124,0.913758
129-C-G,Nonsynonymous_mutation,0.915626,0.819523,0.984355,0.930405
129-C-T,Synonymous_mutation,0.940097,0.92203,0.943019,0.906664
13-A-C,Nonsynonymous_mutation,0.877196,1.02549,0.973125,0.93949
13-A-G,Nonsynonymous_mutation,0.925571,0.889438,0.95935,0.869354
13-A-T,Nonsynonymous_mutation,0.977703,0.862012,0.988244,0.987465
130-T-A,Nonsynonymous_mutation,0.930673,0.944241,0.954289,0.936597
130-T-C,Nonsynonymous_mutation,0.854071,0.921056,1.01697,0.856281
130-T-G,Nonsynonymous_mutation,0.940518,0.913846,0.873231,0.917157
131-C-T,Nonsynonymous_mutation,0.802695,0.924406,0.931943,1.04056
132-A-C,Synonymous_mutation,0.942839,0.962223,0.916567,0.952452
132-A-G,Synonymous_mutation,0.909801,0.95081,1.03179,0.909491
132-A-T,Synonymous_mutation,0.985352,0.896025,0.928318,0.945244
133-G-A,Nonsynonymous_mutation,0.905067,0.960528,0.861998,0.936246
133-G-C,Nonsynonymous_mutation,0.952128,0.885,1.02813,0.921489
133-G-T,Nonsynonymous_mutation,0.97608,0.908042,0.900903,0.982771
134-C-A,Nonsynonymous_mutation,0.943607,1.02743,0.985608,0.976531
134-C-G,Nonsynonymous_mutation,0.956887,1.03032,1.14509,1.01518
134-C-T,Nonsynonymous_mutation,0.88699,1.00457,0.865709,1.06625
135-T-A,Synonymous_mutation,0.913238,0.92114,0.946695,0.978242
135-T-C,Synonymous_mutation,0.962611,0.924787,1.04138,1.0089
135-T-G,Synonymous_mutation,0.862507,0.952432,0.990467,0.961051
136-G-A,Nonsynonymous_mutation,0.927204,1.10406,0.968592,0.99812
136-G-C,Nonsynonymous_mutation,1.03695,0.910891,0.984001,1.01391
137-A-C,Nonsynonymous_mutation,0.969213,0.857574,0.899224,0.893691
137-A-G,Nonsynonymous_mutation,0.914572,0.942919,0.970276,0.935891
137-A-T,Nonsynonymous_mutation,0.859462,0.97743,0.891705,0.977447
138-G-A,Synonymous_mutation,1.02719,0.890199,0.905192,0.967047
138-G-C,Nonsynonymous_mutation,0.951187,0.837769,1.02084,0.971678
138-G-T,Nonsynonymous_mutation,1.14167,0.944018,1.01524,0.990723
139-A-C,Nonsynonymous_mutation,0.92393,1.02272,1.01837,0.980908
139-A-G,Nonsynonymous_mutation,1.00213,0.835103,0.706746,1.21569
14-A-C,Nonsynonymous_mutation,0.858349,0.979008,1.0943,0.900165
14-A-G,Nonsynonymous_mutation,1.01111,0.876681,0.990705,0.991535
14-A-T,Nonsynonymous_mutation,0.862189,0.970454,1.06793,0.995792
140-A-C,Nonsynonymous_mutation,1.00839,1.02183,1.0489,0.912315
140-A-G,Nonsynonymous_mutation,0.95951,1.00718,0.971938,0.999594
140-A-T,Nonsynonymous_mutation,1.02107,0.89761,0.977234,1.00754
141-G-A,Synonymous_mutation,1.05247,0.882228,0.786797,0.999724
141-G-C,Nonsynonymous_mutation,0.964275,1.04748,0.676671,0.955052
141-G-T,Nonsynonymous_mutation,0.979555,0.8792,0.869603,0.803251
142-A-C,Synonymous_mutation,0.900125,0.888731,0.896973,1.02264
142-A-G,Nonsynonymous_mutation,0.930689,0.951905,1.15115,1.10776
143-G-A,Nonsynonymous_mutation,0.950744,0.957924,0.991125,0.876751
143-G-C,Nonsynonymous_mutation,0.928987,0.82049,0.982934,0.907514
143-G-T,Nonsynonymous_mutation,0.816871,0.849977,0.950411,0.811178
144-A-C,Nonsynonymous_mutation,0.924137,0.992801,0.995099,0.864953
144-A-G,Synonymous_mutation,0.852115,0.991963,0.977962,0.976658
144-A-T,Nonsynonymous_mutation,0.968559,0.892905,0.866583,0.821734
145-G-A,Nonsynonymous_mutation,0.923788,0.992179,1.05175,0.999828
145-G-C,Nonsynonymous_mutation,1.03443,1.07553,1.06753,0.964626
145-G-T,Nonsynonymous_mutation,0.909348,0.894978,0.967195,0.941194
146-A-C,Nonsynonymous_mutation,1.00286,0.953648,1.05434,1.04666
146-A-G,Nonsynonymous_mutation,0.890664,0.937112,0.950823,0.871437
146-A-T,Nonsynonymous_mutation,1.00682,0.810786,0.995102,0.992272
147-C-A,Nonsynonymous_mutation,1.02354,1.00893,0.935032,1.00729
147-C-G,Nonsynonymous_mutation,0.949413,0.973076,0.989021,0.765432
147-C-T,Synonymous_mutation,0.938304,0.926116,0.971039,0.840829
148-T-A,Nonsynonymous_mutation,0.709039,0.895926,0.839417,0.842878
148-T-G,Nonsynonymous_mutation,1.00507,0.912627,1.03451,0.816258
149-G-T,Nonsynonymous_mutation,1.02549,0.895948,0.862556,0.94646
15-T-A,Nonsynonymous_mutation,0.96325,0.959539,0.954297,0.920945
15-T-C,Synonymous_mutation,0.919784,1.0012,1.15864,1.02278
15-T-G,Nonsynonymous_mutation,0.992049,0.923787,0.855576,0.949291
150-G-C,Nonsynonymous_mutation,0.88555,0.946669,0.855789,0.984503
150-G-T,Nonsynonymous_mutation,0.935105,0.957459,0.818147,0.929899
16-C-A,Nonsynonymous_mutation,0.84622,0.901071,0.868237,0.878229
16-C-G,Nonsynonymous_mutation,0.906149,0.974328,1.03945,0.942871
16-C-T,Synonymous_mutation,0.837467,0.902733,0.8595,1.00143
17-T-A,Nonsynonymous_mutation,0.921335,0.926237,1.05304,0.965989
17-T-C,Nonsynonymous_mutation,1.00561,0.921872,0.951316,0.987272
17-T-G,Nonsynonymous_mutation,1.03723,0.905893,1.04984,0.943209
18-A-C,Synonymous_mutation,1.0155,0.932216,0.956061,0.844838
18-A-G,Synonymous_mutation,0.989334,1.01246,1.07447,0.955538
18-A-T,Synonymous_mutation,0.954075,1.02087,1.06485,1.03731
19-A-C,Nonsynonymous_mutation,0.920734,0.967492,0.973293,0.928363
19-A-G,Nonsynonymous_mutation,0.968175,0.999011,0.928174,0.873803
19-A-T,Nonsynonymous_mutation,0.968276,0.922326,0.945821,0.898092
2-A-C,Nonsynonymous_mutation,0.988843,1.0036,0.931841,0.836001
2-A-G,Nonsynonymous_mutation,0.923772,0.899386,1.00705,0.831376
2-A-T,Nonsynonymous_mutation,0.906753,0.861467,1.06555,0.94553
20-T-A,Nonsynonymous_mutation,0.841323,0.91705,0.957162,0.982158
20-T-C,Nonsynonymous_mutation,0.97099,0.95728,0.864334,0.891487
20-T-G,Nonsynonymous_mutation,0.811414,0.910448,0.878311,0.87183
21-G-A,Nonsynonymous_mutation,0.884591,0.84968,0.779264,0.790096
21-G-C,Nonsynonymous_mutation,1.02276,0.980788,0.852172,0.970828
21-G-T,Nonsynonymous_mutation,0.925924,0.847439,0.888906,0.908954
22-T-A,Nonsynonymous_mutation,0.881134,0.886007,0.956999,0.952321
22-T-C,Nonsynonymous_mutation,0.931491,0.904417,0.935928,0.983959
22-T-G,Nonsynonymous_mutation,1.06123,0.972219,0.995088,0.833887
23-T-A,Nonsynonymous_mutation,0.839134,0.866941,0.964499,0.887248
23-T-C,Nonsynonymous_mutation,0.86786,0.946354,0.949551,0.93908
23-T-G,Nonsynonymous_mutation,0.903375,0.957793,0.938661,0.89324
24-C-A,Nonsynonymous_mutation,0.925141,0.887413,0.932947,0.927815
24-C-G,Nonsynonymous_mutation,1.04454,1.00488,0.92173,0.910214
24-C-T,Synonymous_mutation,0.994411,0.838256,0.878994,0.96757
25-T-A,Nonsynonymous_mutation,0.92526,0.96051,0.940984,0.977388
25-T-C,Nonsynonymous_mutation,0.842584,1.01779,0.930378,0.981535
25-T-G,Nonsynonymous_mutation,0.943607,1.00498,0.918743,0.948443
26-C-A,Nonsynonymous_mutation,1.00474,0.952326,0.842144,0.842816
26-C-G,Nonsynonymous_mutation,0.838404,0.899372,0.877612,0.891428
26-C-T,Nonsynonymous_mutation,0.926298,0.917138,0.936512,0.957525
27-T-A,Synonymous_mutation,0.863048,0.903821,1.00654,0.840716
27-T-C,Synonymous_mutation,0.953207,0.913161,0.939529,0.9418
27-T-G,Synonymous_mutation,0.981087,0.817564,0.813723,0.8108
28-G-A,Nonsynonymous_mutation,0.868383,1.03719,0.914545,0.985092
28-G-C,Nonsynonymous_mutation,0.881452,0.945098,1.01949,0.975732
28-G-T,Nonsynonymous_mutation,0.994433,0.939781,0.947599,0.926706
29-A-C,Nonsynonymous_mutation,1.00457,0.999678,0.940447,0.960862
29-A-G,Nonsynonymous_mutation,0.976319,0.916233,0.95498,0.920907
29-A-T,Nonsynonymous_mutation,1.04809,0.880518,0.922399,0.938023
3-A-C,Nonsynonymous_mutation,0.951911,0.915402,1.00455,0.906905
3-A-G,Synonymous_mutation,0.57515,0.608911,0.679094,0.634744
3-A-T,Nonsynonymous_mutation,0.906407,1.01558,0.904036,0.946773
30-C-A,Nonsynonymous_mutation,0.943607,0.965032,0.969718,0.924378
30-C-G,Nonsynonymous_mutation,0.909395,0.907094,0.878535,0.937589
30-C-T,Synonymous_mutation,1.04161,0.917174,0.908447,0.998144
31-G-A,Nonsynonymous_mutation,0.925037,0.795755,1.00046,0.980312
31-G-C,Nonsynonymous_mutation,0.993873,0.924992,0.865324,0.960218
32-A-C,Nonsynonymous_mutation,0.863916,0.916892,0.939283,0.967739
32-A-G,Nonsynonymous_mutation,0.983449,1.03148,0.886959,0.918879
32-A-T,Nonsynonymous_mutation,0.875658,0.823943,0.736686,0.837485
33-A-C,Nonsynonymous_mutation,0.817176,0.787806,0.8671,0.828762
33-A-G,Synonymous_mutation,0.963523,0.852152,0.947953,0.916261
33-A-T,Nonsynonymous_mutation,0.832217,0.918086,0.858571,0.982977
34-A-C,Nonsynonymous_mutation,1.01512,0.941169,0.942073,0.887289
34-A-G,Nonsynonymous_mutation,0.953571,0.908079,0.908633,0.9812
35-A-C,Nonsynonymous_mutation,0.905017,0.84685,0.955865,0.851405
35-A-G,Nonsynonymous_mutation,0.885962,0.918815,1.03887,1.00055
35-A-T,Nonsynonymous_mutation,0.954987,0.94672,0.973824,1.02889
36-G-A,Synonymous_mutation,0.96776,0.86823,0.843405,0.9707
36-G-C,Nonsynonymous_mutation,0.885802,0.884681,0.914952,0.908389
36-G-T,Nonsynonymous_mutation,0.92872,0.878288,1.03153,0.9629
37-C-A,Nonsynonymous_mutation,0.894209,0.896054,0.998518,0.954715
37-C-G,Nonsynonymous_mutation,0.961803,0.840288,1.06662,0.944177
38-A-C,Nonsynonymous_mutation,0.875611,0.841797,0.948055,0.987761
38-A-G,Nonsynonymous_mutation,0.787044,0.79938,0.779574,0.822577
38-A-T,Nonsynonymous_mutation,0.817843,0.858259,0.863969,0.988918
39-A-C,Nonsynonymous_mutation,1.0016,0.890998,0.876293,0.985595
39-A-G,Synonymous_mutation,0.899185,0.914117,0.964798,0.877746
39-A-T,Nonsynonymous_mutation,0.923958,0.908969,0.979236,0.933966
4-G-A,Nonsynonymous_mutation,0.888595,0.907684,0.843283,0.820625
4-G-C,Nonsynonymous_mutation,0.98126,0.917328,0.858781,0.98606
4-G-T,Nonsynonymous_mutation,0.853864,0.900942,0.918594,0.875081
40-C-A,Nonsynonymous_mutation,0.937637,0.924315,0.91832,0.907872
40-C-G,Nonsynonymous_mutation,1.03957,0.918745,1.02764,1.0399
41-A-G,Nonsynonymous_mutation,0.928651,0.960184,0.923655,0.964422
41-A-T,Nonsynonymous_mutation,0.995773,0.924933,0.939905,0.935684
42-G-A,Synonymous_mutation,0.935737,0.974845,0.92441,0.990419
42-G-C,Nonsynonymous_mutation,0.99543,0.944636,1.12268,1.00548
42-G-T,Nonsynonymous_mutation,1.06486,0.997378,1.08602,0.969784
43-G-A,Nonsynonymous_mutation,0.996776,0.92058,0.921227,0.87361
43-G-C,Nonsynonymous_mutation,0.956729,0.891767,0.894025,0.960128
43-G-T,Nonsynonymous_mutation,1.01813,0.938544,0.956501,1.06129
44-C-A,Nonsynonymous_mutation,0.935894,1.02435,1.05344,1.00591
44-C-G,Nonsynonymous_mutation,1.06364,0.990315,0.979657,1.05739
44-C-T,Nonsynonymous_mutation,0.929009,1.02007,0.994945,1.00262
45-A-C,Synonymous_mutation,1.00203,0.941766,1.004,1.00331
45-A-G,Synonymous_mutation,0.954981,0.9169,1.05965,0.94887
45-A-T,Synonymous_mutation,1.1043,0.903766,1.07934,1.05641
46-C-A,Nonsynonymous_mutation,1.01247,0.968946,1.05379,0.971744
46-C-G,Nonsynonymous_mutation,0.926575,0.962296,0.94441,1.03795
46-C-T,Nonsynonymous_mutation,0.924555,0.952421,0.903057,0.921692
47-G-A,Nonsynonymous_mutation,0.841946,0.913103,0.976988,1.03045
47-G-C,Nonsynonymous_mutation,0.812955,0.8937,0.965177,1.00947
47-G-T,Nonsynonymous_mutation,0.918743,1.08822,0.965464,0.977109
48-T-A,Synonymous_mutation,0.89519,0.892708,0.960771,0.913376
48-T-C,Synonymous_mutation,0.931601,0.841262,0.971866,0.97297
48-T-G,Synonymous_mutation,1.02847,0.887303,1.02598,0.899852
49-T-A,Nonsynonymous_mutation,0.711124,0.795199,0.848344,0.911106
49-T-C,Nonsynonymous_mutation,0.919164,0.834667,0.883818,0.909715
49-T-G,Nonsynonymous_mutation,0.845189,0.720949,1.1356,1.17876
5-G-A,Nonsynonymous_mutation,0.903176,0.990553,0.877637,0.881917
5-G-C,Nonsynonymous_mutation,0.969971,0.878896,1.06281,0.994373
5-G-T,Nonsynonymous_mutation,0.926672,0.880837,0.913102,0.980071
50-T-A,Nonsynonymous_mutation,0.917154,0.882594,0.958592,0.910696
50-T-C,Nonsynonymous_mutation,1.10717,1.07825,0.943675,1.06101
50-T-G,Nonsynonymous_mutation,1.12057,1.05444,0.991195,1.00347
51-T-A,Nonsynonymous_mutation,0.918724,0.904377,0.937134,0.921375
51-T-C,Synonymous_mutation,0.880055,0.912279,1.04711,1.00392
51-T-G,Nonsynonymous_mutation,0.84405,1.09011,0.948456,0.924289
52-G-A,Nonsynonymous_mutation,0.968936,0.90924,0.915068,0.919461
52-G-C,Nonsynonymous_mutation,0.936366,0.931956,1.07175,0.906182
53-A-C,Nonsynonymous_mutation,1.0021,0.935102,0.973517,0.909488
53-A-G,Nonsynonymous_mutation,1.00462,0.87459,0.920668,0.912039
53-A-T,Nonsynonymous_mutation,0.879416,0.881609,1.0056,0.936239
54-G-A,Synonymous_mutation,0.898204,0.923989,0.899332,0.901233
54-G-C,Nonsynonymous_mutation,0.919787,0.865377,0.852938,1.01088
54-G-T,Nonsynonymous_mutation,0.945183,0.872664,0.878168,0.909284
55-C-A,Nonsynonymous_mutation,0.964149,0.886494,0.859105,0.916013
55-C-G,Nonsynonymous_mutation,0.879869,0.846165,0.939792,0.870714
55-C-T,Nonsynonymous_mutation,0.869867,0.954918,0.916581,0.987571
56-T-A,Nonsynonymous_mutation,0.901944,0.886443,0.916127,0.869103
56-T-G,Nonsynonymous_mutation,0.792969,0.861924,0.863884,0.878859
57-C-A,Synonymous_mutation,0.949247,0.975855,1.00749,0.943068
57-C-G,Synonymous_mutation,0.947183,0.859892,0.884371,0.894858
57-C-T,Synonymous_mutation,0.901189,0.903524,0.963039,0.844762
58-G-A,Nonsynonymous_mutation,0.913912,0.977126,1.07023,0.972753
58-G-C,Nonsynonymous_mutation,0.936218,1.02454,1.02502,0.961044
58-G-T,Nonsynonymous_mutation,0.909681,0.902938,0.968827,0.886011
59-G-A,Nonsynonymous_mutation,1.52302,1.13118,0.659473,0.864825
59-G-C,Nonsynonymous_mutation,0.971786,0.979374,0.974518,0.903599
59-G-T,Nonsynonymous_mutation,1.00802,0.849186,0.938674,0.964316
6-T-A,Synonymous_mutation,0.902881,0.880372,0.8024,0.857797
6-T-C,Synonymous_mutation,1.00923,0.979971,1.02272,0.942351
6-T-G,Synonymous_mutation,1.0171,0.869372,1.03863,0.918545
60-T-A,Synonymous_mutation,0.939442,0.820859,0.885894,0.886487
60-T-C,Synonymous_mutation,0.935662,0.910331,0.978634,0.945485
60-T-G,Synonymous_mutation,0.883685,0.900624,0.949297,0.899997
61-G-A,Nonsynonymous_mutation,0.988051,0.90523,0.976595,0.930136
61-G-C,Nonsynonymous_mutation,0.980945,1.01328,1.03937,0.866716
62-T-C,Nonsynonymous_mutation,0.929877,0.993687,0.979745,0.891735
62-T-G,Nonsynonymous_mutation,0.945806,0.797465,1.127,0.957962
63-T-A,Synonymous_mutation,0.875334,0.94921,0.966371,0.861347
63-T-C,Synonymous_mutation,0.983304,0.817392,0.924324,0.924833
63-T-G,Synonymous_mutation,1.0157,0.917321,0.762914,0.859181
64-T-A,Nonsynonymous_mutation,0.958723,0.827721,0.819627,0.868283
64-T-G,Nonsynonymous_mutation,0.926751,0.916391,0.809334,0.930729
65-C-A,Nonsynonymous_mutation,0.841163,0.951418,0.917297,0.857339
65-C-G,Nonsynonymous_mutation,0.946806,0.945182,0.886193,0.903055
65-C-T,Nonsynonymous_mutation,0.914912,0.905779,0.923547,0.849811
66-C-A,Synonymous_mutation,0.885937,0.866388,0.868461,0.842751
66-C-G,Synonymous_mutation,0.987227,0.928921,1.03769,0.964422
66-C-T,Synonymous_mutation,0.832305,0.979466,0.900071,0.880154
67-A-C,Nonsynonymous_mutation,0.856223,0.877091,1.14974,0.973197
67-A-G,Nonsynonymous_mutation,0.951307,0.860028,0.979411,0.845609
67-A-T,Nonsynonymous_mutation,1.05848,0.953563,0.993338,1.08448
68-T-A,Nonsynonymous_mutation,0.99883,0.998766,0.936506,1.02508
68-T-C,Nonsynonymous_mutation,0.922187,0.917628,1.02391,0.963658
68-T-G,Nonsynonymous_mutation,0.990775,1.04681,0.972314,0.897362
69-G-A,Nonsynonymous_mutation,0.964234,0.954808,0.984939,0.929486
69-G-C,Nonsynonymous_mutation,0.967043,0.851533,1.02562,0.905741
69-G-T,Nonsynonymous_mutation,0.955493,1.0628,1.01937,0.997937
7-A-C,Nonsynonymous_mutation,0.910096,0.990736,1.00803,1.03065
7-A-G,Nonsynonymous_mutation,0.95978,0.895721,1.11624,0.880291
70-G-A,Nonsynonymous_mutation,0.971601,0.942048,1.03312,0.904966
70-G-C,Nonsynonymous_mutation,1.05422,0.92304,0.993825,1.05023
70-G-T,Nonsynonymous_mutation,0.997069,0.868724,1.09436,0.964973
71-T-A,Nonsynonymous_mutation,1.09314,0.860478,1.30125,1.12705
71-T-C,Nonsynonymous_mutation,0.902296,1.04605,0.98539,0.968679
71-T-G,Nonsynonymous_mutation,0.972076,0.941773,1.06334,0.90165
72-T-A,Synonymous_mutation,0.925597,0.863206,0.952309,0.955579
72-T-C,Synonymous_mutation,1.02224,0.958851,0.996004,0.975604
72-T-G,Synonymous_mutation,0.914531,0.902327,0.952621,0.926837
73-A-C,Nonsynonymous_mutation,0.989296,0.925552,0.895814,0.876011
73-A-G,Nonsynonymous_mutation,0.962592,0.938489,0.916243,0.982967
73-A-T,Nonsynonymous_mutation,0.941742,0.837117,1.05871,0.852156
74-T-A,Nonsynonymous_mutation,0.924754,1.01813,1.08197,1.05243
74-T-C,Nonsynonymous_mutation,0.928368,0.87905,0.968166,0.899394
74-T-G,Nonsynonymous_mutation,0.907854,1.05173,1.12299,1.04421
75-T-A,Synonymous_mutation,0.882644,0.899006,1.00983,0.934599
75-T-C,Synonymous_mutation,0.997588,0.954325,1.06435,1.09402
75-T-G,Nonsynonymous_mutation,0.952625,0.931693,1.14584,0.912163
76-T-A,Nonsynonymous_mutation,0.794218,0.905999,0.966933,0.98109
76-T-C,Nonsynonymous_mutation,0.932715,0.904773,0.897662,0.983177
76-T-G,Nonsynonymous_mutation,0.985717,0.952945,1.02959,0.958871
77-A-C,Nonsynonymous_mutation,0.961271,0.8988,0.974626,0.895313
77-A-G,Nonsynonymous_mutation,0.977891,0.951747,0.956811,1.06234
77-A-T,Nonsynonymous_mutation,0.89815,0.875494,0.907795,0.927013
78-T-C,Synonymous_mutation,0.952599,0.864685,0.935837,0.960906
79-A-C,Nonsynonymous_mutation,0.960809,0.991487,0.932698,1.03199
79-A-G,Nonsynonymous_mutation,1.02152,0.922616,1.00717,0.884128
8-A-C,Nonsynonymous_mutation,0.910927,0.93189,0.905527,0.979947
8-A-G,Nonsynonymous_mutation,0.990599,0.845561,0.951573,0.883287
8-A-T,Nonsynonymous_mutation,0.963681,0.915831,0.934382,0.985822
80-A-C,Nonsynonymous_mutation,0.89833,0.967276,1.04016,0.861974
80-A-G,Nonsynonymous_mutation,0.865486,0.96282,0.92178,0.973958
80-A-T,Nonsynonymous_mutation,0.940304,1.01571,0.837664,1.00506
81-G-A,Synonymous_mutation,0.946576,0.924534,0.95001,0.877426
81-G-C,Nonsynonymous_mutation,1.00148,1.06422,1.0324,1.05319
81-G-T,Nonsynonymous_mutation,0.883081,1.00271,1.00507,0.923187
82-T-G,Nonsynonymous_mutation,1.39251,0.971289,0.618175,0.573259
83-G-T,Nonsynonymous_mutation,0.948073,0.964058,0.927045,0.845334
84-G-C,Nonsynonymous_mutation,0.941437,0.876172,0.809762,0.883683
84-G-T,Nonsynonymous_mutation,0.998377,0.80718,0.624868,1.05888
85-G-A,Nonsynonymous_mutation,1.01659,0.899833,0.942308,0.994593
85-G-C,Nonsynonymous_mutation,0.922822,0.879141,0.897219,0.968999
85-G-T,Nonsynonymous_mutation,0.926018,0.903495,0.942073,0.820074
86-A-C,Nonsynonymous_mutation,0.973482,0.961008,0.959352,0.936311
86-A-G,Nonsynonymous_mutation,0.956386,0.808113,0.974333,0.757483
86-A-T,Nonsynonymous_mutation,0.958179,0.928064,0.828338,0.86695
87-T-A,Nonsynonymous_mutation,0.937238,0.900624,1.1287,0.876283
87-T-C,Synonymous_mutation,0.833762,0.801266,0.71282,0.915204
87-T-G,Nonsynonymous_mutation,0.9082,0.91382,1.07548,0.963376
88-G-A,Nonsynonymous_mutation,0.984641,0.973457,0.913749,1.02137
88-G-C,Nonsynonymous_mutation,0.945859,0.951641,1.09078,0.872471
88-G-T,Nonsynonymous_mutation,0.963375,0.833638,0.94397,0.886149
89-C-A,Nonsynonymous_mutation,0.949916,1.01932,1.05493,0.996219
89-C-G,Nonsynonymous_mutation,1.1264,0.969462,1.08769,0.948588
89-C-T,Nonsynonymous_mutation,0.892863,0.883956,0.772934,0.937279
9-A-C,Nonsynonymous_mutation,0.845057,0.887226,0.925159,0.965797
9-A-G,Synonymous_mutation,0.952908,0.900558,0.823383,0.961537
9-A-T,Nonsynonymous_mutation,0.898009,0.999594,0.968072,1.05044
90-G-A,Synonymous_mutation,0.963646,0.936471,1.04927,0.993564
90-G-C,Synonymous_mutation,0.922618,1.00792,1.05722,0.898915
90-G-T,Synonymous_mutation,0.945079,0.806433,0.833947,0.845031
91-T-A,Nonsynonymous_mutation,0.980102,0.880881,0.954502,0.973907
91-T-C,Synonymous_mutation,0.969672,0.95215,0.99031,1.07751
91-T-G,Nonsynonymous_mutation,0.839235,0.981967,0.904401,0.93689
92-T-C,Nonsynonymous_mutation,1.01005,0.948532,0.768891,0.950499
93-G-A,Synonymous_mutation,0.929956,1.0067,0.937181,0.871472
94-G-A,Nonsynonymous_mutation,0.913452,0.929338,0.981872,1.02545
94-G-C,Nonsynonymous_mutation,0.986506,0.937438,0.972301,1.02501
94-G-T,Nonsynonymous_mutation,0.997499,0.907467,0.962889,0.876138
95-A-C,Nonsynonymous_mutation,0.953531,1.01344,0.977682,1.08054
95-A-G,Nonsynonymous_mutation,0.897414,0.905051,0.932903,0.905007
95-A-T,Nonsynonymous_mutation,0.984553,1.04586,1.0106,0.966317
96-T-A,Nonsynonymous_mutation,1.02334,1.01899,0.971886,0.989603
96-T-C,Synonymous_mutation,0.871603,0.933967,1.12622,0.921517
96-T-G,Nonsynonymous_mutation,0.988158,0.834975,0.868693,0.927798
97-G-A,Nonsynonymous_mutation,0.929154,0.859771,0.944728,0.872801
97-G-C,Nonsynonymous_mutation,0.735092,0.91263,0.839658,0.820842
97-G-T,Nonsynonymous_mutation,1.01985,0.825019,0.892681,0.976665
98-T-A,Nonsynonymous_mutation,0.966772,0.950455,0.869348,0.914023
98-T-C,Nonsynonymous_mutation,0.942541,0.961949,0.947228,0.909119
98-T-G,Nonsynonymous_mutation,0.936307,0.931363,0.972931,0.942758
99-T-A,Synonymous_mutation,0.854112,0.946888,0.87366,0.952273
99-T-C,Synonymous_mutation,0.965753,0.921012,0.917228,0.983804
99-T-G,Synonymous_mutation,0.824326,0.96152,0.794867,0.949167
