Genotype,Mutation type,REL from replicate 1,REL from replicate 2,REL from replicate 3,REL from replicate 4
1-G-A,Nonsynonymous_mutation,1.23395,1.2453,1.1223,1.34455
1-G-C,Nonsynonymous_mutation,1.1617,1.11183,1.3776,1.31594
1-G-T,Nonsynonymous_mutation,1.18388,1.19563,1.32137,1.28909
10-T-G,Nonsynonymous_mutation,1.17134,1.15532,1.09087,1.21001
100-T-A,Nonsynonymous_mutation,1.73442,1.79446,1.59852,1.99896
100-T-C,Synonymous_mutation,1.617,1.86979,1.65474,1.73553
100-T-G,Nonsynonymous_mutation,1.72563,1.8912,1.73357,1.85582
101-T-C,Nonsynonymous_mutation,1.85668,1.89517,1.49599,1.78087
101-T-G,Nonsynonymous_mutation,1.58588,1.82281,1.66821,2.07845
102-G-A,Synonymous_mutation,1.72894,1.77365,1.6189,1.80146
102-G-C,Nonsynonymous_mutation,1.78462,1.85125,1.64063,1.82186
102-G-T,Nonsynonymous_mutation,1.56071,1.7715,1.54884,1.65544
103-G-A,Nonsynonymous_mutation,1.71314,1.87137,1.61027,1.83915
103-G-C,Nonsynonymous_mutation,1.65676,1.76741,1.64627,1.70342
104-A-C,Nonsynonymous_mutation,1.78483,1.90226,1.61779,1.698
104-A-G,Nonsynonymous_mutation,1.78739,1.92923,1.61224,1.89815
104-A-T,Nonsynonymous_mutation,1.77318,1.84977,1.75903,1.78301
105-G-A,Synonymous_mutation,1.72849,1.91765,1.70434,1.89657
105-G-C,Nonsynonymous_mutation,1.85367,1.99599,1.70549,1.75927
105-G-T,Nonsynonymous_mutation,1.75998,2.03405,1.87771,1.9125
106-T-A,Nonsynonymous_mutation,1.77039,1.91379,1.60041,1.8844
106-T-C,Nonsynonymous_mutation,1.54105,1.58546,1.22776,1.35877
106-T-G,Nonsynonymous_mutation,1.56899,1.73927,1.56015,1.73481
107-T-A,Nonsynonymous_mutation,1.40138,1.73436,1.5176,1.67482
107-T-G,Nonsynonymous_mutation,1.27287,1.26113,1.23461,1.19408
108-T-A,Nonsynonymous_mutation,1.42407,1.39909,1.24287,1.35107
108-T-C,Synonymous_mutation,0.186006,0.232068,0.191007,0.201351
108-T-G,Nonsynonymous_mutation,1.35961,1.27527,1.23994,1.32468
109-G-A,Nonsynonymous_mutation,1.30069,1.26383,1.32132,1.22132
109-G-C,Nonsynonymous_mutation,0.597212,0.669283,0.531273,0.567718
109-G-T,Nonsynonymous_mutation,1.45968,1.55196,1.50992,1.46339
11-C-T,Nonsynonymous_mutation,1.16711,1.18947,1.21568,1.16319
110-A-C,Nonsynonymous_mutation,0.47878,0.413746,0.431787,0.397091
110-A-G,Nonsynonymous_mutation,1.23114,1.34999,1.25187,1.30055
110-A-T,Nonsynonymous_mutation,0.89577,0.768548,0.837257,0.813482
111-T-A,Nonsynonymous_mutation,1.53613,1.60902,1.31925,1.52325
111-T-C,Synonymous_mutation,1.31226,1.32437,1.15397,1.23308
111-T-G,Nonsynonymous_mutation,1.4455,1.43996,1.20875,1.36721
112-G-A,Nonsynonymous_mutation,1.5808,1.62662,1.43399,1.69449
112-G-C,Nonsynonymous_mutation,0.869476,0.991139,0.847044,0.864882
113-A-C,Nonsynonymous_mutation,0.509246,0.276412,0.369726,0.384479
113-A-G,Nonsynonymous_mutation,1.11668,1.09861,1.05648,1.08099
113-A-T,Nonsynonymous_mutation,0.791115,0.611923,0.702316,0.781023
114-A-C,Nonsynonymous_mutation,1.1861,1.10946,1.14671,1.26557
114-A-G,Synonymous_mutation,1.20066,1.09356,1.03537,1.22079
114-A-T,Nonsynonymous_mutation,1.3119,1.38617,1.21288,1.35998
115-G-A,Nonsynonymous_mutation,1.33645,1.14316,1.14259,1.09755
115-G-C,Nonsynonymous_mutation,1.30642,1.59055,1.36585,1.46757
116-A-C,Nonsynonymous_mutation,0.566971,0.581361,0.678193,0.515325
116-A-G,Nonsynonymous_mutation,1.35285,1.38731,1.23944,1.22945
116-A-T,Nonsynonymous_mutation,1.36197,1.67254,1.43098,1.44855
117-A-C,Nonsynonymous_mutation,1.55251,1.86287,1.56174,1.72393
117-A-G,Synonymous_mutation,1.29736,1.43567,1.33833,1.4011
117-A-T,Nonsynonymous_mutation,1.54097,1.90657,1.56264,1.61879
118-T-C,Nonsynonymous_mutation,1.68405,2.01629,1.76611,1.78542
119-A-C,Nonsynonymous_mutation,2.25355,2.52357,1.82228,2.22415
119-A-G,Nonsynonymous_mutation,1.35506,1.62071,1.34189,1.44131
119-A-T,Nonsynonymous_mutation,1.10282,1.8238,1.49764,1.45441
12-A-C,Synonymous_mutation,1.22233,1.33932,1.22546,1.28004
12-A-G,Synonymous_mutation,1.21417,1.27388,1.19035,1.37503
12-A-T,Synonymous_mutation,1.40452,1.22991,1.14513,1.2057
120-T-C,Synonymous_mutation,1.61472,1.75571,1.70457,1.80155
121-C-A,Nonsynonymous_mutation,1.34107,1.94669,1.62995,1.62421
121-C-G,Nonsynonymous_mutation,1.37497,1.7655,1.51701,1.52863
121-C-T,Nonsynonymous_mutation,1.41331,1.92924,1.49884,1.63034
122-C-A,Nonsynonymous_mutation,1.51718,1.66523,1.61446,1.44279
122-C-T,Nonsynonymous_mutation,1.38411,2.15274,1.67175,1.47008
123-C-A,Synonymous_mutation,1.26663,1.23183,1.13406,1.28089
123-C-G,Synonymous_mutation,1.26134,1.29227,1.05793,1.24129
123-C-T,Synonymous_mutation,1.28119,1.14012,1.10604,1.16929
124-A-C,Nonsynonymous_mutation,1.36599,1.19269,1.16752,1.29935
124-A-G,Nonsynonymous_mutation,1.3514,1.27837,1.25402,1.42642
124-A-T,Nonsynonymous_mutation,1.3382,1.31121,1.28675,1.35009
125-A-C,Nonsynonymous_mutation,1.21836,1.27437,1.15448,1.20488
125-A-G,Nonsynonymous_mutation,1.23616,1.21856,1.17301,1.14507
125-A-T,Nonsynonymous_mutation,1.13998,1.07081,1.30942,1.23381
126-T-A,Nonsynonymous_mutation,1.29562,1.3424,1.37967,1.31361
126-T-C,Synonymous_mutation,1.21548,1.17656,1.14732,1.28807
126-T-G,Nonsynonymous_mutation,1.23637,1.31044,1.28495,1.26582
127-A-C,Nonsynonymous_mutation,1.18713,1.31428,1.18298,1.25002
127-A-G,Nonsynonymous_mutation,1.20703,1.17283,1.18797,1.21369
128-A-C,Nonsynonymous_mutation,1.16994,1.15143,1.17351,1.25457
128-A-G,Nonsynonymous_mutation,1.26096,1.34838,1.14158,1.29096
128-A-T,Nonsynonymous_mutation,1.26017,1.30273,1.24285,1.21905
129-G-A,Synonymous_mutation,1.30045,1.29082,1.10168,1.32314
129-G-C,Nonsynonymous_mutation,1.52206,1.85826,1.6673,1.73859
129-G-T,Nonsynonymous_mutation,1.30523,1.40609,1.20912,1.32851
13-C-A,Nonsynonymous_mutation,1.431,1.52205,1.40081,1.3743
13-C-G,Nonsynonymous_mutation,1.30858,1.41416,1.29686,1.29876
13-C-T,Nonsynonymous_mutation,1.32977,1.25896,1.1093,1.28011
130-C-A,Nonsynonymous_mutation,1.21643,1.34465,1.21818,1.3199
130-C-G,Nonsynonymous_mutation,1.2762,1.38998,1.15954,1.2572
130-C-T,Nonsynonymous_mutation,1.27634,1.35686,1.17625,1.42229
131-C-A,Nonsynonymous_mutation,1.51759,1.86309,1.60239,1.73463
131-C-G,Nonsynonymous_mutation,1.07564,1.57435,1.4728,1.25546
132-A-C,Synonymous_mutation,1.4862,1.79923,1.57155,1.49156
132-A-G,Synonymous_mutation,1.3166,1.35326,1.24289,1.26473
132-A-T,Synonymous_mutation,1.40158,1.49942,1.36245,1.34316
133-C-A,Nonsynonymous_mutation,1.24417,1.23602,1.14073,1.18935
133-C-G,Nonsynonymous_mutation,1.19182,1.23717,1.247,1.2039
133-C-T,Nonsynonymous_mutation,1.38507,1.32187,1.17533,1.23117
134-C-A,Nonsynonymous_mutation,1.28385,1.3117,1.23376,1.34905
134-C-T,Nonsynonymous_mutation,1.30389,1.2733,1.16227,1.26934
135-G-A,Synonymous_mutation,1.42103,1.35124,1.17129,1.18719
135-G-C,Synonymous_mutation,1.34887,1.70122,1.46901,1.56535
135-G-T,Synonymous_mutation,1.27467,1.59268,1.28227,1.32995
136-C-A,Nonsynonymous_mutation,1.15381,1.25147,1.20418,1.29433
136-C-G,Nonsynonymous_mutation,1.40031,1.23332,1.18822,1.42826
136-C-T,Nonsynonymous_mutation,1.61468,1.31968,1.50813,1.23304
137-A-C,Nonsynonymous_mutation,1.51598,1.61592,1.47178,1.32115
137-A-G,Nonsynonymous_mutation,1.36749,1.36168,1.25506,1.32108
137-A-T,Nonsynonymous_mutation,1.35143,1.47048,1.22366,1.26756
138-T-A,Nonsynonymous_mutation,1.40129,1.41992,1.21405,1.30199
138-T-C,Synonymous_mutation,1.301,1.47314,1.22312,1.38124
138-T-G,Nonsynonymous_mutation,1.3296,1.38483,1.14569,1.32897
139-G-A,Nonsynonymous_mutation,1.45421,1.39241,1.23646,1.35541
139-G-C,Nonsynonymous_mutation,1.21162,1.34484,1.27566,1.2649
139-G-T,Nonsynonymous_mutation,1.39861,1.52409,1.28785,1.26148
14-C-A,Nonsynonymous_mutation,1.34575,1.61628,1.56193,1.55048
14-C-G,Nonsynonymous_mutation,1.52976,1.55253,1.28327,1.71643
14-C-T,Nonsynonymous_mutation,1.23664,1.41588,1.39659,1.24545
140-T-A,Nonsynonymous_mutation,1.80189,1.4562,1.58448,1.70169
140-T-C,Nonsynonymous_mutation,1.30597,1.2157,1.07343,1.26793
140-T-G,Nonsynonymous_mutation,1.36752,1.26149,1.24689,1.38163
141-C-A,Synonymous_mutation,1.3605,1.35706,1.21592,1.36111
141-C-G,Synonymous_mutation,1.31479,1.17982,1.17286,1.18285
141-C-T,Synonymous_mutation,1.41394,1.44964,1.23385,1.41149
142-A-C,Nonsynonymous_mutation,1.35363,1.3071,1.18471,1.30089
142-A-G,Nonsynonymous_mutation,1.26789,1.28771,1.16815,1.2302
143-A-C,Nonsynonymous_mutation,1.26957,1.22412,1.10068,1.11093
143-A-G,Nonsynonymous_mutation,1.31736,1.15905,1.29965,1.35338
143-A-T,Nonsynonymous_mutation,1.27259,1.16305,1.16236,1.41489
144-A-C,Nonsynonymous_mutation,1.21637,1.16161,1.1095,1.14456
144-A-G,Synonymous_mutation,1.31747,1.24916,1.20208,1.29618
144-A-T,Nonsynonymous_mutation,1.31015,1.4545,1.28408,1.23595
145-T-A,Nonsynonymous_mutation,1.30903,1.46192,1.21369,1.36959
145-T-C,Nonsynonymous_mutation,1.32411,1.294,1.10763,1.28285
145-T-G,Nonsynonymous_mutation,1.15236,1.26658,1.04457,1.30155
146-T-A,Nonsynonymous_mutation,1.26193,1.30561,1.18395,1.3445
146-T-C,Nonsynonymous_mutation,1.21634,1.16137,1.13311,1.24803
146-T-G,Nonsynonymous_mutation,1.25778,1.27336,1.17862,1.21662
147-T-A,Nonsynonymous_mutation,1.27277,1.30574,1.20344,1.30706
147-T-C,Synonymous_mutation,1.22817,1.29896,1.16706,1.34502
147-T-G,Nonsynonymous_mutation,1.31778,1.28626,1.24167,1.14185
148-T-A,Nonsynonymous_mutation,1.25863,1.39255,1.2785,1.15596
148-T-C,Synonymous_mutation,1.24647,1.28255,1.21113,1.29486
148-T-G,Nonsynonymous_mutation,1.28787,1.23033,1.21066,1.30523
149-T-C,Nonsynonymous_mutation,1.37728,1.32724,1.30942,1.30654
149-T-G,Nonsynonymous_mutation,1.65319,1.80342,1.58167,1.81725
15-A-C,Synonymous_mutation,1.22348,1.25178,1.24003,1.26517
15-A-G,Synonymous_mutation,1.26429,1.32177,1.15278,1.26528
15-A-T,Synonymous_mutation,1.25733,1.28752,1.21837,1.25639
150-G-A,Synonymous_mutation,1.25691,1.23705,1.37819,1.45063
150-G-C,Nonsynonymous_mutation,1.48253,1.56486,1.5276,1.49237
150-G-T,Nonsynonymous_mutation,1.41104,1.46219,1.47212,1.48967
16-T-A,Nonsynonymous_mutation,1.21935,1.25166,1.18058,1.24936
16-T-C,Synonymous_mutation,1.23748,1.22573,1.12922,1.24796
16-T-G,Nonsynonymous_mutation,1.09336,1.18511,1.14346,1.3642
17-T-C,Nonsynonymous_mutation,1.229,1.28814,1.2005,1.25426
18-A-C,Nonsynonymous_mutation,1.24012,1.24568,1.18153,1.30293
18-A-G,Synonymous_mutation,1.28717,1.29862,1.15687,1.24259
18-A-T,Nonsynonymous_mutation,1.22892,1.20089,1.16067,1.27299
19-C-A,Nonsynonymous_mutation,1.27886,1.40508,1.21602,1.30891
19-C-G,Nonsynonymous_mutation,1.25152,1.24885,1.08659,1.36018
19-C-T,Nonsynonymous_mutation,1.26661,1.26849,1.09164,1.23934
2-T-A,Nonsynonymous_mutation,1.19271,1.24475,1.15565,1.38514
2-T-C,Nonsynonymous_mutation,0.876296,0.731179,0.729692,0.789853
2-T-G,Nonsynonymous_mutation,1.1965,1.16642,1.12989,1.21276
20-C-A,Nonsynonymous_mutation,1.17138,1.20882,1.10417,1.1998
20-C-G,Nonsynonymous_mutation,1.33917,1.33039,1.16325,1.27222
20-C-T,Nonsynonymous_mutation,1.25324,1.20816,1.12677,1.28765
21-T-A,Synonymous_mutation,1.16557,1.24533,1.17857,1.24422
21-T-C,Synonymous_mutation,1.21626,1.23769,1.19492,1.29646
21-T-G,Synonymous_mutation,1.14401,1.21786,1.05364,1.16817
22-G-A,Nonsynonymous_mutation,1.19621,1.29148,1.18964,1.25501
22-G-C,Nonsynonymous_mutation,1.31064,1.3001,1.2164,1.25117
22-G-T,Nonsynonymous_mutation,1.32996,1.2468,1.17976,1.27097
23-A-C,Nonsynonymous_mutation,1.23241,1.29906,1.14512,1.3671
23-A-G,Nonsynonymous_mutation,1.31479,1.27477,1.03007,1.24191
23-A-T,Nonsynonymous_mutation,1.21716,1.31899,1.20898,1.33385
24-T-A,Nonsynonymous_mutation,1.27157,1.30976,1.07972,1.2436
24-T-C,Synonymous_mutation,1.22298,1.10289,1.18503,1.28241
24-T-G,Nonsynonymous_mutation,1.25063,1.25521,1.11233,1.26141
25-A-C,Nonsynonymous_mutation,1.22239,1.24929,1.11244,1.15594
25-A-G,Nonsynonymous_mutation,0.840703,1.02373,0.72366,0.841992
25-A-T,Nonsynonymous_mutation,1.38185,1.43334,1.08133,1.59252
26-A-C,Nonsynonymous_mutation,1.27169,1.23561,1.20439,1.27622
26-A-G,Nonsynonymous_mutation,1.20244,1.19935,1.16509,1.33838
26-A-T,Nonsynonymous_mutation,1.28347,1.28624,1.33202,1.17132
27-C-A,Nonsynonymous_mutation,1.36486,1.13876,1.24527,1.27374
27-C-G,Nonsynonymous_mutation,1.29469,1.14717,1.24454,1.31557
27-C-T,Synonymous_mutation,1.2417,1.30624,1.17264,1.26373
28-G-A,Nonsynonymous_mutation,1.26543,1.31841,1.11148,1.31711
28-G-C,Nonsynonymous_mutation,0.900985,1.07332,0.948267,1.26862
28-G-T,Nonsynonymous_mutation,1.26223,1.35147,1.46422,1.13623
29-T-C,Nonsynonymous_mutation,1.30696,1.32349,1.27354,1.28415
29-T-G,Nonsynonymous_mutation,1.7297,1.85548,1.46645,1.71207
3-A-C,Synonymous_mutation,1.28372,1.29916,1.20552,1.25235
3-A-G,Synonymous_mutation,1.22158,1.05925,1.02494,1.24742
3-A-T,Synonymous_mutation,1.31996,1.3376,1.25502,1.41864
30-C-A,Synonymous_mutation,1.3133,1.32133,1.16755,1.2616
30-C-G,Synonymous_mutation,1.33787,1.46529,1.15687,1.26111
30-C-T,Synonymous_mutation,1.15951,1.32474,1.07029,1.17436
31-A-C,Nonsynonymous_mutation,1.19516,1.26654,1.32532,0.819648
31-A-G,Nonsynonymous_mutation,1.30638,1.08117,1.30432,1.23152
31-A-T,Nonsynonymous_mutation,1.24343,1.20228,1.20152,1.217
32-T-A,Nonsynonymous_mutation,1.20878,1.21578,1.17397,1.25545
32-T-C,Nonsynonymous_mutation,1.35004,1.23354,1.22226,1.24474
32-T-G,Nonsynonymous_mutation,1.22473,1.21522,1.29562,1.20527
33-G-A,Nonsynonymous_mutation,1.18696,1.21881,1.18808,1.16595
33-G-C,Nonsynonymous_mutation,1.20201,1.1838,1.1124,1.14598
33-G-T,Nonsynonymous_mutation,1.13542,1.29702,0.9711,1.17915
34-G-A,Nonsynonymous_mutation,1.24664,1.11485,1.19299,1.22588
34-G-C,Nonsynonymous_mutation,1.26314,1.2532,1.19412,1.26195
34-G-T,Nonsynonymous_mutation,1.31022,1.16711,1.08288,1.19054
35-T-A,Nonsynonymous_mutation,1.21747,1.20051,1.22863,1.25377
35-T-C,Nonsynonymous_mutation,1.28683,1.24747,1.23189,1.22266
35-T-G,Nonsynonymous_mutation,1.17768,1.55973,1.27705,1.53136
36-A-C,Synonymous_mutation,1.32868,1.13678,1.18245,1.32174
36-A-G,Synonymous_mutation,1.2936,1.359,1.26235,1.22252
36-A-T,Synonymous_mutation,1.26756,1.28979,1.28007,1.30424
37-T-G,Nonsynonymous_mutation,0.98314,1.19814,1.4492,1.31803
38-G-C,Nonsynonymous_mutation,1.58482,1.61173,1.26675,1.64396
38-G-T,Nonsynonymous_mutation,1.39935,1.41157,1.40199,1.44687
39-G-C,Nonsynonymous_mutation,1.50693,1.17092,1.41021,1.33278
39-G-T,Nonsynonymous_mutation,1.43781,1.41245,1.35041,1.41079
4-T-A,Nonsynonymous_mutation,1.30964,1.34629,1.1917,1.28027
4-T-C,Nonsynonymous_mutation,1.4458,1.19645,1.22774,1.47046
4-T-G,Nonsynonymous_mutation,1.29116,1.26615,1.15107,1.27357
40-A-C,Nonsynonymous_mutation,1.14424,1.13895,1.18689,1.26974
40-A-G,Nonsynonymous_mutation,1.13585,1.0765,1.05909,1.02078
40-A-T,Nonsynonymous_mutation,1.28631,1.18703,1.17202,1.26884
41-A-C,Nonsynonymous_mutation,1.42583,1.0858,0.896827,1.56047
41-A-G,Nonsynonymous_mutation,1.1842,1.21445,1.06945,1.08514
41-A-T,Nonsynonymous_mutation,1.26867,1.16272,1.05927,1.29322
42-C-T,Synonymous_mutation,1.33197,1.39229,1.19702,1.29896
43-G-A,Nonsynonymous_mutation,1.3136,1.09759,1.17185,1.2576
43-G-T,Nonsynonymous_mutation,1.25371,1.36314,1.14706,1.19669
44-C-G,Nonsynonymous_mutation,1.15129,1.13745,1.05988,1.15578
44-C-T,Nonsynonymous_mutation,1.23822,1.38108,1.08589,1.37119
45-C-A,Synonymous_mutation,1.21015,1.39044,1.21087,1.25351
45-C-G,Synonymous_mutation,1.22742,1.33278,1.15714,1.24899
45-C-T,Synonymous_mutation,1.33584,1.2781,1.20993,1.30522
46-A-C,Nonsynonymous_mutation,1.34252,1.22164,1.08191,1.27318
46-A-G,Nonsynonymous_mutation,1.1776,1.234,1.22309,1.20939
46-A-T,Nonsynonymous_mutation,1.221,1.26162,1.24413,1.25938
47-T-C,Nonsynonymous_mutation,1.22955,1.38576,1.21442,1.25953
47-T-G,Nonsynonymous_mutation,1.5053,1.23342,1.24312,1.07047
48-G-A,Nonsynonymous_mutation,1.32794,1.30031,1.2348,1.33985
48-G-C,Nonsynonymous_mutation,1.1638,1.37665,1.22002,1.19371
48-G-T,Nonsynonymous_mutation,1.34934,1.21811,1.2414,1.42255
49-A-C,Nonsynonymous_mutation,1.10043,1.29099,1.13601,1.21101
49-A-G,Nonsynonymous_mutation,1.33102,1.34466,1.1515,1.26359
49-A-T,Nonsynonymous_mutation,1.37405,1.35871,1.18312,1.48584
5-C-A,Nonsynonymous_mutation,1.30523,1.43597,1.21231,1.303
5-C-G,Nonsynonymous_mutation,1.30271,1.2627,1.2299,1.27359
5-C-T,Nonsynonymous_mutation,1.36443,1.39494,1.30834,1.30268
50-T-A,Nonsynonymous_mutation,1.19687,1.13301,1.11763,1.38935
50-T-C,Nonsynonymous_mutation,1.24541,1.20059,1.11539,1.16666
50-T-G,Nonsynonymous_mutation,1.21699,1.28241,1.19612,1.29827
51-T-A,Synonymous_mutation,1.27772,1.21785,1.1526,1.10558
51-T-C,Synonymous_mutation,1.28583,1.37566,1.14412,1.33586
51-T-G,Nonsynonymous_mutation,1.18961,1.27119,1.09544,1.19443
52-A-C,Nonsynonymous_mutation,1.27879,1.21444,1.22927,1.15121
52-A-G,Nonsynonymous_mutation,1.34924,1.39507,1.4676,1.27002
52-A-T,Nonsynonymous_mutation,1.23847,1.34053,1.22643,1.29444
53-T-A,Nonsynonymous_mutation,2.16595,1.68612,1.87147,1.53872
53-T-C,Nonsynonymous_mutation,1.18516,1.29477,1.11073,1.2628
53-T-G,Nonsynonymous_mutation,1.05778,1.19408,1.24583,1.13228
54-C-A,Synonymous_mutation,1.19628,1.30082,1.14931,1.20424
54-C-G,Nonsynonymous_mutation,1.0908,1.2483,1.19511,1.26577
54-C-T,Synonymous_mutation,1.18659,1.09215,1.17063,1.21821
56-G-A,Nonsynonymous_mutation,1.46119,1.25817,1.46572,1.24334
56-G-C,Nonsynonymous_mutation,1.18616,1.24963,1.12465,1.28106
56-G-T,Nonsynonymous_mutation,1.39898,1.37706,1.32841,1.4409
57-G-A,Synonymous_mutation,1.04904,1.23123,1.18758,1.16304
57-G-T,Synonymous_mutation,1.11617,1.16104,0.986668,1.08513
58-C-A,Nonsynonymous_mutation,1.24175,1.28376,1.17342,1.33573
58-C-G,Nonsynonymous_mutation,1.24691,1.43222,1.18005,1.23949
58-C-T,Nonsynonymous_mutation,1.26636,1.21066,1.23345,1.27552
59-C-A,Nonsynonymous_mutation,1.29451,1.24917,1.2308,1.34079
59-C-T,Nonsynonymous_mutation,1.42861,1.22315,1.2903,1.07798
6-T-A,Synonymous_mutation,1.21347,1.20851,1.06184,1.21666
6-T-C,Synonymous_mutation,1.06877,1.09363,1.07467,1.28348
6-T-G,Synonymous_mutation,1.17746,1.16169,1.07494,1.18589
60-A-C,Synonymous_mutation,1.18326,1.25407,1.12022,1.20324
60-A-G,Synonymous_mutation,1.15887,1.16823,1.27893,1.26268
60-A-T,Synonymous_mutation,1.25527,1.28599,1.19514,1.23611
61-G-A,Nonsynonymous_mutation,1.2924,1.24998,1.13699,1.1773
61-G-C,Nonsynonymous_mutation,1.22285,1.25604,1.06245,1.28589
61-G-T,Nonsynonymous_mutation,1.17763,1.22199,1.12009,1.18834
62-C-A,Nonsynonymous_mutation,1.20418,1.23456,1.17888,1.2691
62-C-G,Nonsynonymous_mutation,1.25324,1.27148,1.09693,1.15687
62-C-T,Nonsynonymous_mutation,1.25378,1.17009,1.11169,1.28202
63-C-A,Synonymous_mutation,1.24797,1.19976,1.13881,1.20775
63-C-G,Synonymous_mutation,1.09782,1.20633,1.08894,1.36447
63-C-T,Synonymous_mutation,1.24629,1.28427,1.15629,1.18803
64-G-A,Nonsynonymous_mutation,1.26668,1.18801,1.1604,1.18358
64-G-C,Nonsynonymous_mutation,1.2223,1.2361,1.14356,1.22281
64-G-T,Nonsynonymous_mutation,1.25675,1.1708,1.09649,1.13679
65-A-C,Nonsynonymous_mutation,1.12408,1.20546,1.37815,1.16902
65-A-G,Nonsynonymous_mutation,1.24119,1.14725,1.12306,1.18276
65-A-T,Nonsynonymous_mutation,1.40732,1.18459,1.25547,1.26069
66-T-A,Nonsynonymous_mutation,1.19673,1.28056,1.08206,1.20035
66-T-C,Synonymous_mutation,1.28921,1.1966,1.19054,1.15929
66-T-G,Nonsynonymous_mutation,1.23452,1.28112,1.1698,1.24026
67-A-C,Nonsynonymous_mutation,1.22658,1.4881,1.45233,1.44285
67-A-G,Nonsynonymous_mutation,1.26724,1.1479,1.12063,1.22014
67-A-T,Nonsynonymous_mutation,1.28348,1.287,1.18006,1.41532
68-C-A,Nonsynonymous_mutation,1.19986,1.25502,1.19178,1.21409
68-C-G,Nonsynonymous_mutation,1.09486,1.07256,1.12254,1.0909
68-C-T,Nonsynonymous_mutation,1.03888,1.17855,1.00697,1.40483
69-T-A,Synonymous_mutation,1.28417,1.09547,1.15512,1.11642
69-T-C,Synonymous_mutation,1.2588,1.32239,1.07818,1.16941
69-T-G,Synonymous_mutation,1.2939,1.2089,1.1257,1.28833
7-G-A,Nonsynonymous_mutation,1.22992,1.50246,1.19666,1.11495
7-G-C,Nonsynonymous_mutation,1.47454,1.35103,1.50755,1.47529
7-G-T,Nonsynonymous_mutation,1.26206,1.41747,1.32534,1.51179
70-C-A,Nonsynonymous_mutation,1.16896,1.17184,1.11205,1.21545
70-C-G,Nonsynonymous_mutation,1.1868,1.18851,1.11555,1.19568
70-C-T,Nonsynonymous_mutation,1.31628,1.22297,1.16549,1.23556
71-C-A,Nonsynonymous_mutation,1.14137,1.15703,1.26621,1.20408
71-C-G,Nonsynonymous_mutation,1.15822,1.16888,1.13546,1.23705
71-C-T,Nonsynonymous_mutation,1.26198,1.28171,1.18802,1.30504
72-A-C,Synonymous_mutation,1.19672,1.34551,1.17254,1.32433
72-A-G,Synonymous_mutation,1.18662,1.23848,1.19704,1.23202
72-A-T,Synonymous_mutation,1.22213,1.165,1.01858,1.22512
73-T-A,Nonsynonymous_mutation,1.33186,1.39775,1.1147,1.32422
73-T-C,Nonsynonymous_mutation,1.38691,1.36021,1.27084,1.27427
73-T-G,Nonsynonymous_mutation,1.37246,1.23006,1.49098,1.18931
74-A-C,Nonsynonymous_mutation,1.25243,1.17753,1.11152,1.21568
74-A-G,Nonsynonymous_mutation,1.26579,1.28405,1.19755,1.20977
74-A-T,Nonsynonymous_mutation,1.24758,1.22909,1.10843,1.26271
75-T-C,Synonymous_mutation,1.19004,1.23396,1.09556,1.21809
76-G-A,Nonsynonymous_mutation,1.64586,1.52608,1.398,1.0726
76-G-C,Nonsynonymous_mutation,1.25971,1.27352,1.18412,1.31684
77-A-C,Nonsynonymous_mutation,1.21318,1.30602,1.13568,1.26843
77-A-G,Nonsynonymous_mutation,1.19516,1.1639,1.30361,1.3559
77-A-T,Nonsynonymous_mutation,1.18599,1.3344,1.27344,1.46221
78-A-C,Nonsynonymous_mutation,1.32669,1.46311,1.21059,1.60755
78-A-G,Synonymous_mutation,1.31098,1.20303,1.10846,1.22815
79-G-A,Nonsynonymous_mutation,1.61075,2.63724,1.58324,1.60804
79-G-C,Nonsynonymous_mutation,1.51393,1.69362,1.58979,1.70397
79-G-T,Nonsynonymous_mutation,1.20291,1.25366,1.24227,1.37401
8-C-G,Nonsynonymous_mutation,1.19258,1.33035,1.09735,1.23512
8-C-T,Nonsynonymous_mutation,1.60167,1.28717,1.16494,1.37316
80-A-C,Nonsynonymous_mutation,1.36091,1.58586,1.53293,1.35047
80-A-G,Nonsynonymous_mutation,1.9934,1.88186,1.53332,1.76368
81-C-A,Nonsynonymous_mutation,1.45875,1.41274,1.37464,1.65586
81-C-G,Nonsynonymous_mutation,1.56838,1.53811,1.2683,1.45517
81-C-T,Synonymous_mutation,1.14666,1.21251,1.19985,1.21671
83-G-C,Nonsynonymous_mutation,1.18163,1.29602,1.12458,1.22563
84-A-C,Synonymous_mutation,1.23618,1.13197,1.09026,1.24306
84-A-G,Synonymous_mutation,1.18112,1.22049,1.04088,1.16688
84-A-T,Synonymous_mutation,1.23203,1.27225,1.24204,1.20812
85-A-G,Nonsynonymous_mutation,1.38666,1.48761,1.42447,1.53463
85-A-T,Nonsynonymous_mutation,1.26824,1.21068,1.10797,1.23251
86-C-A,Nonsynonymous_mutation,1.27175,1.42017,1.51795,1.78284
86-C-G,Nonsynonymous_mutation,1.19014,1.28014,1.25552,1.19207
86-C-T,Nonsynonymous_mutation,1.36576,1.12362,1.25097,1.34361
87-T-A,Synonymous_mutation,1.34775,1.17137,1.19131,1.32017
87-T-C,Synonymous_mutation,1.25337,1.34293,1.17574,1.26898
87-T-G,Synonymous_mutation,1.16969,1.36359,1.19658,1.31119
88-T-A,Nonsynonymous_mutation,1.24761,1.09807,1.10619,1.19245
88-T-C,Nonsynonymous_mutation,1.46816,1.618,1.24092,1.61136
88-T-G,Nonsynonymous_mutation,1.25192,1.28853,1.35465,1.16137
89-T-A,Nonsynonymous_mutation,1.18385,1.20112,1.13885,1.13274
89-T-C,Nonsynonymous_mutation,1.23708,1.25481,1.0666,1.2277
89-T-G,Nonsynonymous_mutation,1.14688,1.34946,1.12607,1.19139
9-T-A,Synonymous_mutation,1.17822,1.17656,1.15867,1.27904
9-T-C,Synonymous_mutation,1.18616,1.14901,1.25352,1.37539
9-T-G,Synonymous_mutation,1.29673,1.32651,1.21984,1.20993
90-T-A,Nonsynonymous_mutation,1.26126,1.3532,1.10282,1.27599
90-T-C,Synonymous_mutation,1.15676,1.21673,0.883261,1.08051
90-T-G,Nonsynonymous_mutation,0.995224,1.05471,0.942473,1.17973
91-A-C,Synonymous_mutation,1.26415,1.24996,1.19673,1.23777
91-A-G,Nonsynonymous_mutation,1.35598,1.68713,1.39897,1.35538
91-A-T,Nonsynonymous_mutation,1.25553,1.19056,1.15959,1.17089
92-G-A,Nonsynonymous_mutation,1.31539,1.37973,1.15367,1.32436
92-G-C,Nonsynonymous_mutation,1.26602,1.37497,1.10093,1.33056
92-G-T,Nonsynonymous_mutation,1.28423,1.32916,1.258,1.24114
93-G-A,Synonymous_mutation,1.25861,1.23855,1.18973,1.29475
93-G-C,Nonsynonymous_mutation,1.3543,1.91188,1.40471,1.50783
93-G-T,Nonsynonymous_mutation,1.25257,1.40462,1.20474,1.36243
94-T-A,Nonsynonymous_mutation,1.14536,1.18022,1.06196,1.21272
94-T-C,Synonymous_mutation,1.42681,1.8732,1.11573,1.21747
94-T-G,Nonsynonymous_mutation,1.26934,1.26875,1.16095,1.13059
95-T-C,Nonsynonymous_mutation,1.11183,1.13769,0.973208,1.08683
96-A-C,Nonsynonymous_mutation,1.45211,1.97154,1.64657,1.70156
96-A-G,Synonymous_mutation,1.29881,1.3268,1.32624,1.3745
96-A-T,Nonsynonymous_mutation,1.3957,1.39962,1.35229,1.44445
97-T-A,Nonsynonymous_mutation,1.07635,1.07866,0.941447,1.01884
97-T-C,Synonymous_mutation,1.27213,1.39052,1.24899,1.29526
97-T-G,Nonsynonymous_mutation,1.16761,1.1302,1.02008,1.13521
98-T-C,Nonsynonymous_mutation,1.44782,1.8115,1.54432,1.57171
98-T-G,Nonsynonymous_mutation,1.68957,1.6455,1.59071,1.67531
99-G-A,Synonymous_mutation,1.67582,2.03725,1.68103,1.91493
99-G-C,Nonsynonymous_mutation,1.72864,1.83049,1.5861,1.73378
99-G-T,Nonsynonymous_mutation,1.69983,1.93839,1.75003,1.89719
