MT484339
MT484340
MT484341
MT484342
MT484343
MT484344
MT484345
MT484346
MT484347
MT484348
MT484349
MT484350
MT484351
MT484352
MT484353
MT484354
MT484355
MT484356
MT484357
MT484358
MT484359
MT484360
MT484361
MT484362
MT484363
MT484364
MT484365
MT484366
MT484367
MT484368
MT484369
MT484370
MT484371
MT484372
MT484373
MT484374
MT484375
MT484376
MT484377
MT484378
MT484379
MT484380
MT484381
MT484382
MT484383
MT484384
MT484385
MT484386
MT484387
MT484388
MT484389
MT484390
MT484391
MT484392
MT484393
MT484394
MT484395
MT484396
MT484397
MT484398
MT484399
MT484400
MT484401
MT484402
MT484403
MT484404
MT484405
MT484406
MT484407
MT484408
MT484409
MT484410
MT484411
MT484412
MT484413
MT484414
MT484415
MT484416
MT484417
MT484418
MT484419
MT484420
MT484421
MT484422
MT484423
MT484424
MT484425
MT484426
MT484427
MT484428
MT484429
MT484430
MT484431
MT484432
MT484433
MT484434
MT484435
MT484436
MT484437
MT484438
MT484439
MT484440
MT484441
MT484442
MT484443
MT484444
MT484445
MT484446
MT484447
MT484448
MT484449
MT484450
MT484451
MT484452
MT484453
MT484454
MT484455
MT484456
MT484457
MT484458
MT484459
MT484460
MT484461
MT484462
MT484463
MT484464
MT484465
MT484466
MT484467
MT484468
MT484469
MT484470
MT484471
MT484472
MT484473
MT484474
MT484475
MT484476
MT484477
MT484478
MT484479
MT484480
MT484481
MT484482
MT484483
MT484484
MT484485
MT484486
MT484487
MT484488
MT484489
MT484490
MT484491
MT484492
MT484493
MT484494
MT484495
MT484496
MT484497
MT484498
MT484499
MT484500
MT484501
MT484502
MT484503
MT484504
MT484505
MT484506
MT484507
MT484508
MT484509
MT484510
MT484511
MT484512
MT484513
MT484514
MT484515
MT484516
MT484517
MT484518
MT484519
MT484520
MT484521
MT484522
MT484523
MT484524
MT484525
MT484526
MT484527
MT484528
MT484529
MT484530
MT484531
MT484532
MT484533
MT484534
MT484535
MT484536
MT484537
MT484538
MT484539
MT484540
MT484541
MT484542
MT484543
MT484544
MT484545
MT484546
MT484547
MT484548
MT484549
MT484550
MT484551
MT484552
MT484553
MT484554
MT484555
MT484556
MT484557
MT484558
MT484559
MT484560
MT484561
MT484562
MT484563
MT484564
MT484565
MT484566
MT484567
MT484568
MT484569
MT484570
MT484571
MT484572
MT484573
MT484574
MT484575
MT484576
MT484577
MT484578
MT484579
MT484580
MT484581
MT484582
MT484583
MT484584
MT484585
MT484586
MT484587
MT484588
MT484589
MT484590
MT484591
MT484592
MT484593
MT484594
MT484595
MT484596
MT484597
MT484598
MT484599
MT484600
MT484601
MT484602
MT484603
MT484604
MT484605
MT484606
MT484607
MT484608
MT484609
MT484610
MT484611
MT484612
MT484613
MT484614
MT484615
MT484616
MT484617
MT484618
MT484619
MT484620
MT484621
MT484622
MT484623
MT484624
MT484625
MT484626
MT484627
MT484628
MT484629
MT484630
MT484631
MT484632
MT484633
MT484634
MT484635
MT484636
MT484637
MT484638
MT484639
MT484640
MT484641
MT484642
MT484643
MT484644
MT484645
MT484646
MT484647
MT484648
MT484649
MT484650
MT484651
MT484652
MT484653
MT484654
MT484655
MT484656
MT484657
MT484658
MT484659
MT484660
MT484661
MT484662
MT484663
MT484664
MT484665
MT484666
MT484667
MT484668
MT484669
MT484670
MT484671
MT484672
MT484673
MT484674
MT484675
MT484676
MT484677
MT484678
MT484679
MT484680
MT484681
MT484682
MT484683
MT484684
MT484685
MT484686
MT484687
MT484688
MT484689
MT484690
MT484691
MT484692
MT484693
MT484694
MT484695
MT484696
MT484697
MT484698
MT484699
MT484700
MT484701
MT484702
MT484703
MT484704
MT484705
MT484706
MT484707
MT484708
MT484709
MT484710
MT484711
MT484712
MT484713
MT484714
MT484715
MT484716
MT484717
MT484718
MT484719
MT484720
MT484721
MT484722
MT484723
MT484724
MT484725
MT484726
MT484727
MT484728
MT484729
MT484730
MT484731
MT484732
MT484733
MT484734
MT484735
MT484736
MT484737
MT484738
MT484739
MT484740
MT484741
MT484742
MT484743
MT484744
MT484745
MT484746
MT484747
MT484748
MT484749
MT484750
MT484751
MT484752
MT484753
MT484754
MT484755
MT484756
MT484757
MT484758
MT484759
MT484760
MT484761
MT484762
MT484763
MT484764
MT484765
MT484766
MT484767
MT484768
MT484769
MT484770
MT484771
MT484772
MT484773
MT484774
MT484775
MT484776
MT484777
MT484778
MT484779
MT484780
MT484781
MT484782
MT484783
MT484784
MT484785
MT484786
MT484787
MT484788
MT484789
MT484790
MT484791
MT484792
MT484793
MT484794
MT484795
MT484796
MT484797
MT484798
MT484799
MT484800
MT484801
MT484802
MT484803
MT484804
MT484805
MT484806
MT484807
MT484808
MT484809
MT484810
MT484811
MT484812
MT484813
MT484814
MT484815
MT484816
MT484817
MT484818
MT484819
MT484820
MT484821
MT484822
MT484823
MT484824
MT484825
MT484826
MT484827
MT484828
MT484829
MT484830
MT484831
MT484832
MT484833
MT484834
MT484835
MT484836
MT484837
MT484838
MT484839
MT484840
MT484841
MT484842
MT484843
MT484844
MT484845
MT484846
MT484847
MT484848
MT484849
MT484850
MT484851
MT484852
MT484853
MT484854
MT484855
MT484856
MT484857
MT484858
MT484859
MT484860
MT484861
MT484862
MT484863
MT484864
MT484865
MT484866
MT484867
MT484868
MT484869
MT484870
MT484871
MT484872
MT484873
MT484874
MT484875
MT484876
MT484877
MT484878
MT484879
MT484880
MT484881
MT484882
MT484883
MT484884
MT484885
MT484886
MT484887
MT484888
MT484889
MT484890
MT484891
MT484892
MT484893
MT484894
MT484895
MT484896
MT484897
MT484898
MT484899
MT484900
MT484901
MT484902
MT484903
MT484904
MT484905
MT484906
MT484907
MT484908
MT484909
MT484910
MT484911
MT484912
MT484913
MT484914
MT484915
MT484916
MT484917
MT484918
MT484919
MT484920
MT484921
MT484922
MT484923
MT484924
MT484925
MT484926
MT484927
MT484928
MT484929
MT484930
MT484931
MT484932
MT484933
MT484934
MT484935
MT484936
MT484937
MT484938
MT484939
MT484940
MT484941
MT484942
MT484943
MT484944
MT484945
MT484946
MT484947
MT484948
MT484949
MT484950
MT484951
MT484952
MT484953
MT484954
MT484955
MT484956
MT484957
MT484958
MT484959
MT484960
MT484961
MT484962
MT484963
MT484964
MT484965
MT484966
MT484967
MT484968
MT484969
MT484970
MT484971
MT484972
MT484973
MT484974
MT484975
MT484976
MT484977
MT484978
MT484979
MT484980
MT484981
MT484982
MT484983
MT484984
MT484985
MT484986
MT484987
MT484988
MT484989
MT484990
MT484991
MT484992
MT484993
MT484994
MT484995
MT484996
MT484997
MT484998
MT484999
MT485000
MT485001
MT485002
MT485003
MT485004
MT485005
MT485006
MT485007
MT485008
MT485009
MT485010
MT485011
MT485012
MT485013
MT485014
MT485015
MT485016
MT485017
MT485018
MT485019
MT485020
MT485021
MT485022
MT485023
MT485024
MT485025
MT485026
MT485027
MT485028
MT485029
MT485030
MT485031
MT485032
MT485033
MT485034
MT485035
MT485036
MT485037
MT485038
MT485039
MT485040
MT485041
MT485042
MT485043
MT485044
MT485045
MT485046
MT485047
MT485048
MT485049
MT485050
MT485051
MT485052
MT485053
MT485054
MT485055
MT485056
MT485057
MT485058
MT485059
MT485060
MT485061
MT485062
MT485063
MT485064
MT485065
MT485066
MT485067
MT485068
MT485069
MT485070
MT485071
MT485072
MT485073
MT485074
MT485075
MT485076
MT485077
MT485078
MT485079
MT485080
MT485081
MT485082
MT485083
MT485084
MT485085
MT485086
MT485087
MT485088
MT485089
MT485090
MT485091
MT485092
MT485093
MT485094
MT485095
MT485096
MT485097
MT485098
MT485099
MT485100
MT485101
MT485102
MT485103
MT485104
MT485105
MT485106
MT485107
MT485108
MT485109
MT485110
MT485111
MT485112
MT485113
MT485114
MT485115
MT485116
MT485117
MT485118
MT485119
MT485120
MT485121
MT485122
MT485123
MT485124
MT485125
MT485126
MT485127
MT485128
MT485129
MT485130
MT485131
MT485132
MT485133
MT485134
MT485135
MT485136
MT485137
MT485138
MT485139
MT485140
MT485141
MT485142
MT485143
MT485144
MT485145
MT485146
MT485147
MT485148
MT485149
MT485150
MT485151
MT485152
MT485153
MT485154
MT485155
MT485156
MT485157
MT485158
MT485159
MT485160
MT485161
MT485162
MT485163
MT485164
MT485165
MT485166
MT485167
MT485168
MT485169
MT485170
MT485171
MT485172
MT485173
MT485174
MT485175
MT485176
MT485177
MT485178
MT485179
MT485180
MT485181
MT485182
MT485183
MT485184
MT485185
MT485186
MT485187
MT485188
MT485189
MT485190
MT485191
MT485192
MT485193
MT485194
MT485195
MT485196
MT485197
MT485198
MT485199
MT485200
MT485201
MT485202
MT485203
MT485204
MT485205
MT485206
MT485207
MT485208
MT485209
MT485210
MT485211
MT485212
MT485213
MT485214
MT485215
MT485216
MT485217
MT485218
MT485219
MT485220
MT485221
MT485222
MT485223
MT485224
MT485225
MT485226
MT485227
MT485228
MT485229
MT485230
MT485231
MT485232
MT485233
MT485234
MT485235
MT485236
MT485237
MT485238
MT485239
MT485240
MT485241
MT485242
MT485243
MT485244
MT485245
MT485246
MT485247
MT485248
MT485249
MT485250
MT485251
MT485252
MT485253
MT485254
MT485255
MT485256
MT485257
MT485258
MT485259
MT485260
MT485261
MT485262
MT485263
MT485264
MT485265
MT485266
MT485267
MT485268
MT485269
MT485270
MT485271
MT485272
MT485273
MT485274
MT485275
MT485276
MT485277
MT485278
MT485279
MT485280
MT485281
MT485282
MT485283
MT485284
MT485285
MT485286
MT485287
MT485288
MT485289
MT485290
MT485291
MT485292
MT485293
MT485294
MT485295
MT485296
MT485297
MT485298
MT485299
MT485300
MT485301
MT485302
MT485303
MT485304
MT485305
MT485306
MT485307
MT485308
MT485309
MT485310
MT485311
MT485312
MT485313
MT485314
MT485315
MT485316
MT485317
MT485318
MT485319
MT485320
MT485321
MT485322
MT485323
MT485324
MT485325
MT485326
MT485327
MT485328
MT485329
MT485330
MT485331
MT485332
MT485333
MT485334
MT485335
MT485336
MT485337
MT485338
MT485339
MT485340
MT485341
MT485342
MT485343
MT485344
MT485345
MT485346
MT485347
MT485348
MT485349
MT485350
MT485351
MT485352
MT485353
MT485354
MT485355
MT485356
MT485357
MT485358
MT485359
MT485360
MT485361
MT485362
MT485363
MT485364
MT485365
MT485366
MT485367
MT485368
MT485369
MT485370
MT485371
MT485372
MT485373
MT485374
MT485375
MT485376
MT485377
MT485378
MT485379
MT485380
MT485381
MT485382
MT485383
MT485384
MT485385
MT485386
MT485387
MT485388
MT485389
MT485390
MT485391
MT485392
MT485393
MT485394
MT485395
MT485396
MT485397
MT485398
MT485399
MT485400
MT485401
MT485402
MT485403
MT485404
MT485405
MT485406
MT485407
MT485408
MT485409
MT485410
MT485411
MT485412
MT485413
MT485414
MT485415
MT485416
MT485417
MT485418
MT485419
MT485420
MT485421
MT485422
MT485423
MT485424
MT485425
MT485426
MT485427
MT485428
MT485429
MT485430
MT485431
MT485432
MT485433
MT485434
MT485435
MT485436
MT485437
MT485438
MT485439
MT485440
MT485441
MT485442
MT485443
MT485444
MT485445
MT485446
MT485447
MT485448
MT485449
MT485450
MT485451
MT485452
MT485453
MT485454
MT485455
MT485456
MT485457
MT485458
MT485459
MT485460
MT485461
MT485462
MT485463
MT485464
MT485465
MT485466
MT485467
MT485468
MT485469
MT485470
MT485471
MT485472
MT485473
MT485474
MT485475
MT485476
MT485477
MT485478
MT485479
MT485480
MT485481
MT485482
MT485483
MT485484
MT485485
MT485486
MT485487
MT485488
MT485489
MT485490
MT485491
MT485492
MT485493
MT485494
MT485495
MT485496
MT485497
MT485498
MT485499
MT485500
MT485501
MT485502
MT485503
MT485504
MT485505
MT485506
MT485507
MT485508
MT485509
MT485510
MT485511
MT485512
MT485513
MT485514
MT485515
MT485516
MT485517
MT485518
MT485519
MT485520
MT485521
MT485522
MT485523
MT485524
MT485525
MT485526
MT485527
MT485528
MT485529
MT485530
MT485531
MT485532
MT485533
MT485534
MT485535
MT485536
MT485537
MT485538
MT485539
MT485540
MT485541
MT485542
MT485543
MT485544
MT485545
MT485546
MT485547
MT485548
MT485549
MT485550
MT485551
MT485552
MT485553
MT485554
MT485555
MT485556
MT485557
MT485558
MT485559
MT485560
MT485561
MT485562
MT485563
MT485564
MT485565
MT485566
MT485567
MT485568
MT485569
MT485570
MT485571
MT485572
MT485573
MT485574
MT485575
MT485576
MT485577
MT485578
MT485579
MT485580
MT485581
MT485582
MT485583
MT485584
MT485585
MT485586
MT485587
MT485588
MT485589
MT485590
MT485591
MT485592
MT485593
MT485594
MT485595
MT485596
MT485597
MT485598
MT485599
MT485600
MT485601
MT485602
MT485603
MT485604
MT485605
MT485606
MT485607
MT485608
MT485609
MT485610
MT485611
MT485612
MT485613
MT485614
MT485615
MT485616
MT485617
MT485618
MT485619
MT485620
MT485621
MT485622
MT485623
MT485624
MT485625
MT485626
MT485627
MT485628
MT485629
MT485630
MT485631
MT485632
MT485633
MT485634
MT485635
MT485636
MT485637
MT485638
MT485639
MT485640
MT485641
MT485642
MT485643
MT485644
MT485645
MT485646
MT485647
MT485648
MT485649
MT485650
MT485651
MT485652
MT485653
MT485654
MT485655
MT485656
MT485657
MT485658
MT485659
MT485660
MT485661
MT485662
MT485663
MT485664
MT485665
MT485666
MT485667
MT485668
MT485669
MT485670
MT485671
MT485672
MT485673
MT485674
MT485675
MT485676
MT485677
MT485678
MT485679
MT485680
MT485681
MT485682
MT485683
MT485684
MT485685
MT485686
MT485687
MT485688
MT485689
MT485690
MT485691
MT485692
MT485693
MT485694
MT485695
MT485696
MT485697
MT485698
MT485699
MT485700
MT485701
MT485702
MT485703
MT485704
MT485705
MT485706
MT485707
MT485708
MT485709
MT485710
MT485711
MT485712
MT485713
MT485714
MT485715
MT485716
MT485717
MT485718
MT485719
MT485720
MT485721
MT485722
MT485723
MT485724
MT485725
MT485726
MT485727
MT485728
MT485729
MT485730
MT485731
MT485732
MT485733
MT485734
MT485735
MT485736
MT485737
MT485738
MT485739
MT485740
MT485741
MT485742
MT485743
MT485744
MT485745
MT485746
MT485747
MT485748
MT485749
MT485750
MT485751
MT485752
MT485753
MT485754
MT485755
MT485756
MT485757
MT485758
MT485759
MT485760
MT485761
MT485762
MT485763
MT485764
MT485765
MT485766
MT485767
MT485768
MT485769
MT485770
MT485771
MT485772
MT485773
MT485774
MT485775
MT485776
MT485777
MT485778
MT485779
MT485780
MT485781
MT485782
MT485783
MT485784
MT485785
MT485786
MT485787
MT485788
MT485789
MT485790
MT485791
MT485792
MT485793
MT485794
MT485795
MT485796
MT485797
MT485798
MT485799
MT485800
MT485801
MT485802
MT485803
MT485804
MT485805
MT485806
MT485807
MT485808
MT485809
MT485810
MT485811
MT485812
MT485813
MT485814
MT485815
MT485816
MT485817
MT485818
MT485819
MT485820
MT485821
MT485822
MT485823
MT485824
MT485825
MT485826
MT485827
MT485828
MT485829
MT485830
MT485831
MT485832
MT485833
MT485834
MT485835
MT485836
MT485837
MT485838
MT485839
MT485840
MT485841
MT485842
MT485843
MT485844
MT485845
MT485846
MT485847
MT485848
MT485849
MT485850
MT485851
MT485852
MT485853
MT485854
MT485855
MT485856
MT485857
MT485858
MT485859
MT485860
MT485861
MT485862
MT485863
MT485864
MT485865
MT485866
MT485867
MT485868
MT485869
MT485870
MT485871
MT485872
MT485873
MT485874
MT485875
MT485876
MT485877
MT485878
MT485879
MT485880
MT485881
MT485882
MT485883
MT485884
MT485885
MT485886
MT485887
MT485888
MT485889
MT485890
MT485891
MT485892
MT485893
MT485894
MT485895
MT485896
MT485897
MT485898
MT485899
MT485900
MT485901
MT485902
MT485903
MT485904
MT485905
MT485906
MT485907
MT485908
MT485909
MT485910
MT485911
MT485912
MT485913
MT485914
MT485915
MT485916
MT485917
MT485918
MT485919
MT485920
MT485921
MT485922
MT485923
MT485924
MT485925
MT485926
MT485927
MT485928
MT485929
MT485930
MT485931
MT485932
MT485933
MT485934
MT485935
MT485936
MT485937
MT485938
MT485939
MT485940
MT485941
MT485942
MT485943
MT485944
MT485945
MT485946
MT485947
MT485948
MT485949
MT485950
MT485951
MT485952
MT485953
MT485954
MT485955
MT485956
MT485957
MT485958
MT485959
MT485960
MT485961
MT485962
MT485963
MT485964
MT485965
MT485966
MT485967
MT485968
MT485969
MT485970
MT485971
MT485972
MT485973
MT485974
MT485975
MT485976
MT485977
MT485978
MT485979
MT485980
MT485981
MT485982
MT485983
MT485984
MT485985
MT485986
MT485987
MT485988
MT485989
MT485990
MT485991
MT485992
MT485993
MT485994
MT485995
MT485996
MT485997
MT485998
MT485999
MT486000
MT486001
MT486002
MT486003
MT486004
MT486005
MT486006
MT486007
MT486008
MT486009
MT486010
MT486011
MT486012
MT486013
MT486014
MT486015
MT486016
MT486017
MT486018
MT486019
MT486020
MT486021
MT486022
MT486023
MT486024
MT486025
MT486026
MT486027
MT486028
MT486029
MT486030
MT486031
MT486032
MT486033
MT486034
MT486035
MT486036
MT486037
MT486038
MT486039
MT486040
MT486041
MT486042
MT486043
MT486044
MT486045
MT486046
MT486047
MT486048
MT486049
MT486050
MT486051
MT486052
MT486053
MT486054
MT486055
MT486056
MT486057
MT486058
MT486059
MT486060
MT486061
MT486062
MT486063
MT486064
MT486065
MT486066
MT486067
MT486068
MT486069
MT486070
MT486071
MT486072
MT486073
MT486074
MT486075
MT486076
MT486077
MT486078
MT486079
MT486080
MT486081
MT486082
MT486083
MT486084
MT486085
MT486086
MT486087
MT486088
MT486089
MT486090
MT486091
MT486092
MT486093
MT486094
MT486095
MT486096
MT486097
MT486098
MT486099
MT486100
MT486101
MT486102
MT486103
MT486104
MT486105
MT486106
MT486107
MT486108
MT486109
MT486110
MT486111
MT486112
MT486113
MT486114
MT486115
MT486116
MT486117
MT486118
MT486119
MT486120
MT486121
MT486122
MT486123
MT486124
MT486125
MT486126
MT486127
MT486128
MT486129
MT486130
MT486131
MT486132
MT486133
MT486134
MT486135
MT486136
MT486137
MT486138
MT486139
MT486140
MT486141
MT486142
MT486143
MT486144
MT486145
MT486146
MT486147
MT486148
MT486149
MT486150
MT486151
MT486152
MT486153
MT486154
MT486155
MT486156
MT486157
MT486158
MT486159
MT486160
MT486161
MT486162
MT486163
MT486164
MT486165
MT486166
MT486167
MT486168
MT486169
MT486170
MT486171
MT486172
MT486173
MT486174
MT486175
MT486176
MT486177
MT486178
MT486179
MT486180
MT486181
MT486182
MT486183
MT486184
MT486185
MT486186
MT486187
MT486188
MT486189
MT486190
MT486191
MT486192
MT486193
MT486194
MT486195
MT486196
MT486197
MT486198
MT486199
MT486200
MT486201
MT486202
MT486203
MT486204
MT486205
MT486206
MT486207
MT486208
MT486209
MT486210
MT486211
MT486212
MT486213
MT486214
MT486215
MT486216
MT486217
MT486218
MT486219
MT486220
MT486221
MT486222
MT486223
MT486224
MT486225
MT486226
MT486227
MT486228
MT486229
MT486230
MT486231
MT486232
MT486233
MT486234
MT486235
MT486236
MT486237
MT486238
MT486239
MT486240
MT486241
MT486242
MT486243
MT486244
MT486245
MT486246
MT486247
MT486248
MT486249
MT486250
MT486251
MT486252
MT486253
MT486254
MT486255
MT486256
MT486257
MT486258
MT486259
MT486260
MT486261
MT486262
MT486263
MT486264
MT486265
MT486266
MT486267
MT486268
MT486269
MT486270
MT486271
MT486272
MT486273
MT486274
MT486275
MT486276
MT486277
MT486278
MT486279
MT486280
MT486281
MT486282
MT486283
MT486284
MT486285
MT486286
MT486287
MT486288
MT486289
MT486290
MT486291
MT486292
MT486293
MT486294
MT486295
MT486296
MT486297
MT486298
MT486299
MT486300
MT486301
MT486302
MT486303
MT486304
MT486305
MT486306
MT486307
MT486308
MT486309
MT486310
MT486311
MT486312
MT486313
MT486314
MT486315
MT486316
MT486317
MT486318
MT486319
MT486320
MT486321
MT486322
MT486323
MT486324
MT486325
MT486326
MT486327
MT486328
MT486329
MT486330
MT486331
MT486332
MT486333
MT486334
MT486335
MT486336
MT486337
MT486338
MT486339
MT486340
MT486341
MT486342
MT486343
MT486344
MT486345
MT486346
MT486347
MT486348
MT486349
MT486350
MT486351
MT486352
MT486353
MT486354
MT486355
MT486356
MT486357
MT486358
MT486359
MT486360
MT486361
MT486362
MT486363
MT486364
MT486365
MT486366
MT486367
MT486368
MT486369
MT486370
MT486371
MT486372
MT486373
MT486374
MT486375
MT486376
MT486377
MT486378
MT486379
MT486380
MT486381
MT486382
MT486383
MT486384
MT486385
MT486386
MT486387
MT486388
MT486389
MT486390
MT486391
MT486392
MT486393
MT486394
MT486395
MT486396
MT486397
MT486398
MT486399
MT486400
MT486401
MT486402
MT486403
MT486404
MT486405
MT486406
MT486407
MT486408
MT486409
MT486410
MT486411
MT486412
MT486413
MT486414
MT486415
MT486416
MT486417
MT486418
MT486419
MT486420
MT486421
MT486422
MT486423
MT486424
MT486425
MT486426
MT486427
MT486428
MT486429
MT486430
MT486431
MT486432
MT486433
MT486434
MT486435
MT486436
MT486437
MT486438
MT486439
MT486440
MT486441
MT486442
MT486443
MT486444
MT486445
MT486446
MT486447
MT486448
MT486449
MT486450
MT486451
MT486452
MT486453
MT486454
MT486455
MT486456
MT486457
MT486458
MT486459
MT486460
MT486461
MT486462
MT486463
MT486464
MT486465
MT486466
MT486467
MT486468
MT486469
MT486470
MT486471
MT486472
MT486473
MT486474
MT486475
MT486476
MT486477
MT486478
MT486479
MT486480
MT486481
MT486482
MT486483
MT486484
MT486485
MT486486
MT486487
MT486488
MT486489
MT486490
MT486491
MT486492
MT486493
MT486494
MT486495
MT486496
MT486497
MT486498
MT486499
MT486500
MT486501
MT486502
MT486503
MT486504
MT486505
MT486506
MT486507
MT486508
MT486509
MT486510
MT486511
MT486512
MT486513
MT486514
MT486515
MT486516
MT486517
MT486518
MT486519
MT486520
MT486521
MT486522
MT486523
MT486524
MT486525
MT486526
MT486527
MT486528
MT486529
MT486530
MT486531
MT486532
MT486533
MT486534
MT486535
MT486536
MT486537
MT486538
MT486539
MT486540
MT486541
MT486542
MT486543
MT486544
MT486545
MT486546
MT486547
MT486548
MT486549
MT486550
MT486551
MT486552
MT486553
MT486554
MT486555
MT486556
MT486557
MT486558
MT486559
MT486560
MT486561
MT486562
MT486563
MT486564
MT486565
MT486566
MT486567
MT486568
MT486569
MT486570
MT486571
MT486572
MT486573
MT486574
MT486575
MT486576
MT486577
MT486578
MT486579
MT486580
MT486581
MT486582
MT486583
MT486584
MT486585
MT486586
MT486587
MT486588
MT486589
MT486590
MT486591
MT486592
MT486593
MT486594
MT486595
MT486596
MT486597
MT486598
MT486599
MT486600
MT486601
MT486602
MT486603
MT486604
MT486605
MT486606
MT486607
MT486608
MT486609
MT486610
MT486611
MT486612
MT486613
MT486614
MT486615
MT486616
MT486617
MT486618
MT486619
MT486620
MT486621
MT486622
MT486623
MT486624
MT486625
MT486626
MT486627
MT486628
MT486629
MT486630
MT486631
MT486632
MT486633
MT486634
MT486635
MT486636
MT486637
MT486638
MT486639
MT486640
MT486641
MT486642
MT486643
MT486644
MT486645
MT486646
MT486647
MT486648
MT486649
MT486650
MT486651
MT486652
MT486653
MT486654
MT486655
MT486656
MT486657
MT486658
MT486659
MT486660
MT486661
MT486662
MT486663
MT486664
MT486665
MT486666
MT486667
MT486668
MT486669
MT486670
MT486671
MT486672
MT486673
MT486674
MT486675
MT486676
MT486677
MT486678
MT486679
MT486680
MT486681
MT486682
MT486683
MT486684
MT486685
MT486686
MT486687
MT486688
MT486689
MT486690
MT486691
MT486692
MT486693
MT486694
MT486695
MT486696
MT486697
MT486698
MT486699
MT486700
MT486701
MT486702
MT486703
MT486704
MT486705
MT486706
MT486707
MT486708
MT486709
MT486710
MT486711
MT486712
MT486713
MT486714
MT486715
MT486716
MT486717
MT486718
MT486719
MT486720
MT486721
MT486722
MT486723
MT486724
MT486725
MT486726
MT486727
MT486728
MT486729
MT486730
MT486731
MT486732
MT486733
MT486734
MT486735
MT486736
MT486737
MT486738
MT486739
MT486740
MT486741
MT486742
MT486743
MT486744
MT486745
MT486746
MT486747
MT486748
MT486749
MT486750
MT486751
MT486752
MT486753
MT486754
MT486755
MT486756
MT486757
MT486758
MT486759
MT486760
MT486761
MT486762
MT486763
MT486764
MT486765
MT486766
MT486767
MT486768
MT486769
MT486770
MT486771
MT486772
MT486773
MT486774
MT486775
MT486776
MT486777
MT486778
MT486779
MT486780
MT486781
MT486782
MT486783
MT486784
MT486785
MT486786
MT486787
MT486788
MT486789
MT486790
MT486791
MT486792
MT486793
MT486794
MT486795
MT486796
MT486797
MT486798
MT486799
MT486800
MT486801
MT486802
MT486803
MT486804
MT486805
MT486806
MT486807
MT486808
MT486809
MT486810
MT486811
MT486812
MT486813
MT486814
MT486815
MT486816
MT486817
MT486818
MT486819
MT486820
MT486821
MT486822
MT486823
MT486824
MT486825
MT486826
MT486827
MT486828
MT486829
MT486830
MT486831
MT486832
MT486833
MT486834
MT486835
MT486836
MT486837
MT486838
MT486839
MT486840
MT486841
MT486842
MT486843
MT486844
MT486845
MT486846
MT486847
MT486848
MT486849
MT486850
MT486851
MT486852
MT486853
MT486854
MT486855
MT486856
MT486857
MT486858
MT486859
MT486860
MT486861
MT486862
MT486863
MT486864
MT486865
MT486866
MT486867
MT486868
MT486869
MT486870
MT486871
MT486872
MT486873
MT486874
MT486875
MT486876
MT486877
MT486878
MT486879
MT486880
MT486881
MT486882
MT486883
MT486884
MT486885
MT486886
MT486887
MT486888
MT486889
MT486890
MT486891
MT486892
MT486893
MT486894
MT486895
MT486896
MT486897
MT486898
MT486899
MT486900
MT486901
MT486902
MT486903
MT486904
MT486905
MT486906
MT486907
MT486908
MT486909
MT486910
MT486911
MT486912
MT486913
MT486914
MT486915
MT486916
MT486917
MT486918
MT486919
MT486920
MT486921
MT486922
MT486923
MT486924
MT486925
MT486926
MT486927
MT486928
MT486929
MT486930
MT486931
MT486932
MT486933
MT486934
MT486935
MT486936
MT486937
MT486938
MT486939
MT486940
MT486941
MT486942
MT486943
MT486944
MT486945
MT486946
MT486947
MT486948
MT486949
MT486950
MT486951
MT486952
MT486953
MT486954
MT486955
MT486956
MT486957
MT486958
MT486959
MT486960
MT486961
MT486962
MT486963
MT486964
MT486965
MT486966
MT486967
MT486968
MT486969
MT486970
MT486971
MT486972
MT486973
MT486974
MT486975
MT486976
MT486977
MT486978
MT486979
MT486980
MT486981
MT486982
MT486983
MT486984
MT486985
MT486986
MT486987
MT486988
MT486989
MT486990
MT486991
MT486992
MT486993
MT486994
MT486995
MT486996
MT486997
MT486998
MT486999
MT487000
MT487001
MT487002
MT487003
MT487004
MT487005
MT487006
MT487007
MT487008
MT487009
MT487010
MT487011
MT487012
MT487013
MT487014
MT487015
MT487016
MT487017
MT487018
MT487019
MT487020
MT487021
MT487022
MT487023
MT487024
MT487025
MT487026
MT487027
MT487028
MT487029
MT487030
MT487031
MT487032
MT487033
MT487034
MT487035
MT487036
MT487037
MT487038
MT487039
MT487040
MT487041
MT487042
MT487043
MT487044
MT487045
MT487046
MT487047
MT487048
MT487049
MT487050
MT487051
MT487052
MT487053
MT487054
MT487055
MT487056
MT487057
MT487058
MT487059
MT487060
MT487061
MT487062
MT487063
MT487064
MT487065
MT487066
MT487067
MT487068
MT487069
MT487070
MT487071
MT487072
MT487073
MT487074
MT487075
MT487076
MT487077
MT487078
MT487079
MT487080
MT487081
MT487082
MT487083
MT487084
MT487085
MT487086
MT487087
MT487088
MT487089
MT487090
MT487091
MT487092
MT487093
MT487094
MT487095
MT487096
MT487097
MT487098
MT487099
MT487100
MT487101
MT487102
MT487103
MT487104
MT487105
MT487106
MT487107
MT487108
MT487109
MT487110
MT487111
MT487112
MT487113
MT487114
MT487115
MT487116
MT487117
MT487118
MT487119
MT487120
MT487121
MT487122
MT487123
MT487124
MT487125
MT487126
MT487127
MT487128
MT487129
MT487130
MT487131
MT487132
MT487133
MT487134
MT487135
MT487136
MT487137
MT487138
MT487139
MT487140
MT487141
MT487142
MT487143
MT487144
MT487145
MT487146
MT487147
MT487148
MT487149
MT487150
MT487151
MT487152
MT487153
MT487154
MT487155
MT487156
MT487157
MT487158
MT487159
MT487160
MT487161
MT487162
MT487163
MT487164
MT487165
MT487166
MT487167
MT487168
MT487169
MT487170
MT487171
MT487172
MT487173
MT487174
MT487175
MT487176
MT487177
MT487178
MT487179
MT487180
MT487181
MT487182
MT487183
MT487184
MT487185
MT487186
MT487187
MT487188
MT487189
MT487190
MT487191
MT487192
MT487193
MT487194
MT487195
MT487196
MT487197
MT487198
MT487199
MT487200
MT487201
MT487202
MT487203
MT487204
MT487205
MT487206
MT487207
MT487208
MT487209
MT487210
MT487211
MT487212
MT487213
MT487214
MT487215
MT487216
MT487217
MT487218
MT487219
MT487220
MT487221
MT487222
MT487223
MT487224
MT487225
MT487226
MT487227
MT487228
MT487229
MT487230
MT487231
MT487232
MT487233
MT487234
MT487235
MT487236
MT487237
MT487238
MT487239
MT487240
MT487241
MT487242
MT487243
MT487244
MT487245
MT487246
MT487247
MT487248
MT487249
MT487250
MT487251
MT487252
MT487253
MT487254
MT487255
MT487256
MT487257
MT487258
MT487259
MT487260
MT487261
MT487262
MT487263
MT487264
MT487265
MT487266
MT487267
MT487268
MT487269
MT487270
MT487271
MT487272
MT487273
MT487274
MT487275
MT487276
MT487277
MT487278
MT487279
MT487280
MT487281
MT487282
MT487283
MT487284
MT487285
MT487286
MT487287
MT487288
MT487289
MT487290
MT487291
MT487292
MT487293
MT487294
MT487295
MT487296
MT487297
MT487298
MT487299
MT487300
MT487301
MT487302
MT487303
MT487304
MT487305
MT487306
MT487307
MT487308
MT487309
MT487310
MT487311
MT487312
MT487313
MT487314
MT487315
MT487316
MT487317
MT487318
MT487319
MT487320
MT487321
MT487322
MT487323
MT487324
MT487325
MT487326
MT487327
MT487328
MT487329
MT487330
MT487331
MT487332
MT487333
MT487334
MT487335
MT487336
MT487337
MT487338
MT487339
MT487340
MT487341
MT487342
MT487343
MT487344
MT487345
MT487346
MT487347
MT487348
MT487349
MT487350
MT487351
MT487352
MT487353
MT487354
MT487355
MT487356
MT487357
MT487358
MT487359
MT487360
MT487361
MT487362
MT487363
MT487364
MT487365
MT487366
MT487367
MT487368
MT487369
MT487370
MT487371
MT487372
MT487373
MT487374
MT487375
MT487376
MT487377
MT487378
MT487379
MT487380
MT487381
MT487382
MT487383
MT487384
MT487385
MT487386
MT487387
MT487388
MT487389
MT487390
MT487391
MT487392
MT487393
MT487394
MT487395
MT487396
MT487397
MT487398
MT487399
MT487400
MT487401
MT487402
MT487403
MT487404
MT487405
MT487406
MT487407
MT487408
MT487409
MT487410
MT487411
MT487412
MT487413
MT487414
MT487415
MT487416
MT487417
MT487418
MT487419
MT487420
MT487421
MT487422
MT487423
MT487424
MT487425
MT487426
MT487427
MT487428
MT487429
MT487430
MT487431
MT487432
MT487433
MT487434
MT487435
MT487436
MT487437
MT487438
MT487439
MT487440
MT487441
MT487442
MT487443
MT487444
MT487445
MT487446
MT487447
MT487448
MT487449
MT487450
MT487451
MT487452
MT487453
MT487454
MT487455
MT487456
MT487457
MT487458
MT487459
MT487460
MT487461
MT487462
MT487463
MT487464
MT487465
MT487466
MT487467
MT487468
MT487469
MT487470
MT487471
MT487472
MT487473
MT487474
MT487475
MT487476
MT487477
MT487478
MT487479
MT487480
MT487481
MT487482
MT487483
MT487484
MT487485
MT487486
MT487487
MT487488
MT487489
MT487490
MT487491
MT580365
MT580366
MT580367
MT580368
MT580369
MT580370
MT580371
MT580372
MT580373
MT580374
MT580375
MT580376
MT580377
MT580378
MT580379
MT580380
MT580381
MT580382
MT580383
MT580384
MT580385
MT580386
MT580387
MT580388
MT580389
MT580390
MT580391
MT580392
MT580393
MT580394
MT580395
MT580396
MT580397
MT580398
MT580399
MT580400
MT580401
MT580402
MT580403
MT580404
MT580405
MT580406
MT580407
MT580408
MT580409
MT580410
MT580411
MT580412
MT580413
MT580414
MT580415
MT580416
MT580417
MT580418
MT580419
MT580420
MT580421
MT580422
MT580423
MT580424
MT580425
MT580426
MT580427
MT580428
MT580429
MT580430
MT580431
MT580432
MT580433
MT580434
MT580435
MT580436
MT580437
MT580438
MT580439
MT580440
MT580441
MT580442
MT580443
MT580444
MT580445
MT509359
