OP287075
OP287076
OP287077
OP287078
OP287079
OP287080
OP287081
OP287082
OP287083
OP287084
OP287085
OP287086
OP287087
OP287088
OP287089
OP287090
OP287091
OP287092
OP287093
OP287094
OP287095
OP287096
OP287097
OP287098
OP287099
OP287100
OP287101
OP287102
OP287103
OP287104
OP287105
OP287106
OP287107
OP287108
OP287109
OP287110
OP287111
OP287112
OP287113
OP287114
OP287115
OP287116
OP287117
OP287118
OP287119
OP287120
OP287121
OP287122
OP287123
OP287124
OP287125
OP287126
OP287127
OP287128
OP287129
OP287130
OP287131
OP287132
OP287133
OP287134
OP287135
OP287136
OP287137
OP287138
OP287139
OP287140
OP287141
OP287142
OP287143
OP287144
OP287145
OP287146
OP287147
OP287148
OP287149
OP287150
OP287151
OP287152
OP287153
OP287154
OP287155
OP287156
OP287157
OP287158
OP287159
OP287160
OP287161
OP287162
OP287163
OP287164
OP287165
OP287166
OP287167
OP287168
OP287169
OP287170
OP287171
OP287172
OP287173
OP287174
OP287175
OP287176
OP287177
OP287178
OP287179
OP287180
OP287181
OP287182
OP287183
OP287184
OP287185
OP287186
OP287187
OP287188
OP287189
OP287190
OP287191
OP287192
OP287193
OP287194
OP287195
OP287196
OP287197
OP287198
OP287199
OP287200
OP287201
OP287202
OP287203
OP287204
OP287205
OP287206
OP287207
OP287208
OP287209
OP287210
OP287211
OP287212
OP287213
OP287214
OP287215
OP287216
OP287217
OP287218
OP287219
OP287220
OP287221
OP287222
OP287223
OP287224
OP287225
OP287226
OP287227
OP287228
OP287229
OP287230
OP287231
OP287232
OP287233
OP287234
OP287235
OP287236
OP287237
OP287238
OP287239
OP287240
OP287241
OP287242
OP287243
OP287244
OP287245
OP287246
OP287247
OP287248
OP287249
OP287250
OP287251
OP287252
OP287253
OP287254
OP287255
OP287256
OP287257
OP287258
OP287259
OP287260
OP287261
OP287262
OP287263
OP287264
OP287265
OP287266
OP287267
OP287268
OP287269
OP287270
OP287271
OP287272
OP287273
OP287274
OP287275
OP287276
OP287277
OP287278
OP287279
OP287280
OP287281
OP287282
OP287283
OP287284
OP287285
OP287286
OP287287
OP287288
OP287289
OP287290
OP287291
OP287292
OP287293
OP287294
OP287295
OP287296
OP287297
OP287298
OP287299
OP287300
OP287301
OP287302
OP287303
OP287304
OP287305
OP287306
OP287307
OP287308
OP287309
OP287310
OP287311
OP287312
OP287313
OP287314
OP287315
OP287316
OP287317
OP287318
OP287319
OP287320
OP287321
OP287322
OP287323
OP287324
OP287325
OP287326
OP287327
OP287328
OP287329
OP287330
OP287331
OP287332
OP287333
OP287334
OP287335
OP287336
OP287337
OP287338
OP287339
OP287340
OP287341
OP287342
OP287343
OP287344
OP287345
OP287346
OP287347
OP287348
OP287349
OP287350
OP287351
OP287352
OP287353
OP287354
OP287355
OP287356
OP287357
OP287358
OP287359
OP287360
OP287361
OP287362
OP287363
OP287364
OP287365
OP287366
OP287367
OP287368
OP287369
OP287370
OP287371
OP287372
OP287373
OP287374
OP287375
OP287376
OP287377
OP287378
OP287379
OP287380
OP287381
OP287382
OP287383
OP287384
OP287385
OP287386
OP287387
OP287388
OP287389
OP287390
OP287391
OP287392
OP287393
OP287394
OP287395
OP287396
OP287397
OP287398
OP287399
OP287400
OP287401
OP287402
OP287403
OP287404
OP287405
OP287406
OP287407
OP287408
OP287409
OP287410
OP287411
OP287412
OP287413
OP287414
OP287415
OP287416
OP287417
OP287418
OP287419
OP287420
OP287421
OP287422
OP287423
OP287424
OP287425
OP287426
OP287427
OP287428
OP287429
OP287430
OP287431
OP287432
OP287433
OP287434
OP287435
OP287436
OP287437
OP287438
OP287439
OP287440
OP287441
OP287442
OP287443
OP287444
OP287445
OP287446
OP287447
OP287448
OP287449
OP287450
OP287451
OP287452
OP287453
OP287454
OP287455
OP287456
OP287457
OP287458
OP287459
OP287460
OP287461
OP287462
OP287463
OP287464
OP287465
OP287466
OP287467
OP287468
OP287469
OP287470
OP287471
OP287472
OP287473
OP287474
OP287475
OP287476
OP287477
OP287478
OP287479
OP287480
OP287481
OP287482
OP287483
OP287484
OP287485
OP287486
OP287487
OP287488
OP287489
OP287490
OP287491
OP287492
OP287493
OP287494
OP287495
OP287496
OP287497
OP287498
OP287499
OP287500
OP287501
OP287502
OP287503
OP287504
OP287505
OP287506
OP287507
OP287508
OP287509
OP287510
OP287511
OP287512
OP287513
OP287514
OP287515
OP287516
OP287517
OP287518
OP287519
OP287520
OP287521
OP287522
OP287523
OP287524
OP287525
OP287526
OP287527
OP287528
OP287529
OP287530
OP287531
OP287532
OP287533
OP287534
OP287535
OP287536
OP287537
OP287538
OP287539
OP287540
OP287541
OP287542
OP287543
OP287544
OP287545
OP287546
OP287547
OP287548
OP287549
OP287550
OP287551
OP287552
OP287553
OP287554
OP287555
OP287556
OP287557
OP287558
OP287559
OP287560
OP287561
OP287562
OP287563
OP287564
OP287565
OP287566
OP287567
OP287568
OP287569
OP287570
OP287571
OP287572
OP287573
OP287574
OP287575
OP287576
OP287577
OP287578
OP287579
OP287580
OP287581
OP287582
OP287583
OP287584
OP287585
OP287586
OP287587
OP287588
OP287589
OP287590
OP287591
OP287592
OP287593
OP287594
OP287595
OP287596
OP287597
OP287598
OP287599
OP287600
OP287601
OP287602
OP287603
OP287604
OP287605
OP287606
OP287607
OP287608
OP287609
OP287610
OP287611
OP287612
OP287613
OP287614
OP287615
OP287616
OP287617
OP287618
OP287619
OP287620
OP287621
OP287622
OP287623
OP287624
OP287625
OP287626
OP287627
OP287628
OP287629
OP287630
OP287631
OP287632
OP287633
OP287634
OP287635
OP287636
OP287637
OP287638
OP287639
OP287640
OP287641
OP287642
OP287643
OP287644
OP287645
OP287646
OP287647
OP287648
OP287649
OP287650
OP287651
OP287652
OP287653
OP287654
OP287655
OP287656
OP287657
OP287658
OP287659
OP287660
OP287661
OP287662
OP287663
OP287664
OP287665
OP287666
OP287667
OP287668
OP287669
OP287670
OP287671
OP287672
OP287673
OP287674
OP287675
OP287676
OP287677
OP287678
OP287679
OP287680
OP287681
OP287682
OP287683
OP287684
OP287685
OP287686
OP287687
OP287688
OP287689
OP287690
OP287691
OP287692
OP287693
OP287694
OP287695
OP287696
OP287697
OP287698
OP287699
OP287700
OP287701
OP287702
OP287703
OP287704
OP287705
OP287706
OP287707
OP287708
OP287709
OP287710
OP287711
OP287712
OP287713
OP287714
OP287715
OP287716
OP287717
OP287718
OP287719
OP287720
OP287721
OP287722
OP287723
OP287724
OP287725
OP287726
OP287727
OP287728
OP287729
OP287730
OP287731
OP287732
OP287733
OP287734
OP287735
OP287736
OP287737
OP287738
OP287739
OP287740
OP287741
OP287742
OP287743
OP287744
OP287745
OP287746
OP287747
OP287748
OP287749
OP287750
OP287751
OP287752
OP287753
OP287754
OP287755
OP287756
OP287757
OP287758
OP287759
OP287760
OP287761
OP287762
OP287763
OP287764
OP287765
OP287766
OP287767
OP287768
OP287769
OP287770
OP287771
OP287772
OP287773
OP287774
OP287775
OP287776
OP287777
OP287778
OP287779
OP287780
OP287781
OP287782
OP287783
OP287784
OP287785
OP287786
OP287787
OP287788
OP287789
OP287790
OP287791
OP287792
OP287793
OP287794
OP287795
OP287796
OP287797
OP287798
OP287799
OP287800
OP287801
OP287802
OP287803
OP287804
OP287805
OP287806
OP287807
OP287808
OP287809
OP287810
OP287811
