Samples,Category,Direction,SeqID,Seq
For all timepoints except week 176,Heavy Chain: VH3 only,5' pool,XLR-A_VH3 LEADER-A,CCATCTCATCCCTGCGTGTCTCCGACTCAG TAAAAGGTGTCCAGTGT
For all timepoints except week 176,Heavy Chain: VH3 only,5' pool,XLR-A_VH3 LEADER-B,CCATCTCATCCCTGCGTGTCTCCGACTCAG TAAGAGGTGTCCAGTGT
For all timepoints except week 176,Heavy Chain: VH3 only,5' pool,XLR-A_VH3 LEADER-C,CCATCTCATCCCTGCGTGTCTCCGACTCAG TAGAAGGTGTCCAGTGT
For all timepoints except week 176,Heavy Chain: VH3 only,5' pool,XLR-A_VH3 LEADER-D,CCATCTCATCCCTGCGTGTCTCCGACTCAG GCTATTTTTAAAGGTGTCCAGTGT
For all timepoints except week 176,Heavy Chain: VH3 only,5' pool,XLR-A_VH3 LEADER-E,CCATCTCATCCCTGCGTGTCTCCGACTCAG TACAAGGTGTCCAGTGT
For all timepoints except week 176,Heavy Chain: VH3 only,5' pool,XLR-A_VH3 LEADER-F,CCATCTCATCCCTGCGTGTCTCCGACTCAG TTAAAGCTGTCCAGTGT
For all timepoints except week 176,Heavy Chain: VH3 only,3' pool,XLR-B_3xwCgammaCH1-2,CCTATCCCCTGTGTGCCTTGGCAGTCTCAG GG GGA AGA CCG ATG GGC CCT TGG T
For all timepoints except week 176,Heavy Chain: VH3 only,3' pool,XLR-B_3CmuCH1,CCTATCCCCTGTGTGCCTTGGCAGTCTCAG GGGAATTCTCACAGGAGACGA
For all timepoints except week 176,Lambda Chain,5' pool,XLR-A_5L-VL1/2,CCATCTCATCCCTGCGTGTCTCCGACTCAG GCACAGGGTCCTGGGCCCAGTCTG
For all timepoints except week 176,Lambda Chain,5' pool,XLR-A_5L-VL3,CCATCTCATCCCTGCGTGTCTCCGACTCAG GCTCTGTGACCTCCTATGAGCTG
For all timepoints except week 176,Lambda Chain,5' pool,XLR-A_5L-VL4/5,CCATCTCATCCCTGCGTGTCTCCGACTCAG GGTCTCTCTCSCAGCYTGTGCTG
For all timepoints except week 176,Lambda Chain,5' pool,XLR-A_5L-VL6,CCATCTCATCCCTGCGTGTCTCCGACTCAG GTTCTTGGGCCAATTTTATGCTG
For all timepoints except week 176,Lambda Chain,5' pool,XLR-A_5L-VL7/8,CCATCTCATCCCTGCGTGTCTCCGACTCAG GAGTGGATTCTCAGACTGTGGTG
For all timepoints except week 176,Lambda Chain,5' pool,XLR-A_5MP-VL1,CCATCTCATCCCTGCGTGTCTCCGACTCAG GCTCACTGCACAGGGTCCTGGGCC
For all timepoints except week 176,Lambda Chain,5' pool,XLR-A_5MP-VL3-1,CCATCTCATCCCTGCGTGTCTCCGACTCAG GCTTACTGCACAGGATCCGTGGCC
For all timepoints except week 176,Lambda Chain,5' pool,XLR-A_5MP-VL3-19,CCATCTCATCCCTGCGTGTCTCCGACTCAG ACTCTTTGCATAGGTTCTGTGGTT
For all timepoints except week 176,Lambda Chain,5' pool,XLR-A_5MP-VL3-21,CCATCTCATCCCTGCGTGTCTCCGACTCAG TCTCACTGCACAGGCTCTGTGACC
For all timepoints except week 176,Lambda Chain,5' pool,XLR-A_5MP-VL7-43,CCATCTCATCCCTGCGTGTCTCCGACTCAG ACTTGCTGCCCAGGGTCCAATTC
For all timepoints except week 176,Lambda Chain,3' primer,XLR-B_3CL,CCTATCCCCTGTGTGCCTTGGCAGTCTCAG CACCAGTGTGGCCTTGTTGGCTTG
Used for week 176 sample only,Heavy Chain: Vh_all,5' pool,XLR-A_5L-VH1,CCATCTCATCCCTGCGTGTCTCCGACTCAG ACAGGTGCCCACTCCCAGGTGCAG
Used for week 176 sample only,Heavy Chain: Vh_all,5' pool,XLR-A_5L-VH3,CCATCTCATCCCTGCGTGTCTCCGACTCAG AAGGTGTCCAGTGTGARGTGCAG
Used for week 176 sample only,Heavy Chain: Vh_all,5' pool,XLR-A_5L-VH4/6,CCATCTCATCCCTGCGTGTCTCCGACTCAG CCCAGATGGGTCCTGTCCCAGGTGCAG
Used for week 176 sample only,Heavy Chain: Vh_all,5' pool,XLR-A_5L-VH5,CCATCTCATCCCTGCGTGTCTCCGACTCAG CAAGGAGTCTGTTCCGAGGTGCAG
Used for week 176 sample only,Heavy Chain: Vh_all,5' pool,XLR-A_5xwL-VH1,CCATCTCATCCCTGCGTGTCTCCGACTCAG GCAGCCACAGGTGCCCACTCC
Used for week 176 sample only,Heavy Chain: Vh_all,5' pool,XLR-A_5xwL-VH1-24,CCATCTCATCCCTGCGTGTCTCCGACTCAG CAGCAGCTACAGGCACCCACGC
Used for week 176 sample only,Heavy Chain: Vh_all,5' pool,XLR-A_5xwL-VH1-69,CCATCTCATCCCTGCGTGTCTCCGACTCAG GGCAGCAGCTACAGGTGTCCAGTCC
Used for week 176 sample only,Heavy Chain: Vh_all,5' pool,XLR-A_VH3-L1-MP,CCATCTCATCCCTGCGTGTCTCCGACTCAG GCTATTTTAAAAGGTGTCCAATGT
Used for week 176 sample only,Heavy Chain: Vh_all,5' pool,XLR-A_VH3/4-L1-MP,CCATCTCATCCCTGCGTGTCTCCGACTCAG GTGGCAGCTCCCAGATGGGTCCTGTC
Used for week 176 sample only,Heavy Chain: Vh_all,5' pool,XLR-A_VH3/4-L3-MP,CCATCTCATCCCTGCGTGTCTCCGACTCAG GTTGCAGTTTTAAAAGGTGTCCAGTG
Used for week 176 sample only,Heavy Chain: Vh_all,5' pool,XLR-A_VH5-L1-MP,CCATCTCATCCCTGCGTGTCTCCGACTCAG GCTGTTCTCCAAGGAGTCTGTTCC
Used for week 176 sample only,Heavy Chain: Vh_all,3' pool,XLR-B_3xwCgammaCH1,CCTATCCCCTGTGTGCCTTGGCAGTCTCAG GGGGAAGACCGATGGGCCCTTGGTGG
Used for week 176 sample only,Heavy Chain: Vh_all,3' pool,XLR-B_3CmuCH1,CCTATCCCCTGTGTGCCTTGGCAGTCTCAG GGGAATTCTCACAGGAGACGA
Used for week 176 sample only,Light Chains (kappa+lambda),5' pool,XLR-A_5xwL-VK1/2,CCATCTCATCCCTGCGTGTCTCCGACTCAG ATGAGGSTCCCYGCTCAGCTCCTGGG
Used for week 176 sample only,Light Chains (kappa+lambda),5' pool,XLR-A_5L-VK3,CCATCTCATCCCTGCGTGTCTCCGACTCAG CTCTTCCTCCTGCTACTCTGGCTCCCAG
Used for week 176 sample only,Light Chains (kappa+lambda),5' pool,XLR-A_5L-VK4,CCATCTCATCCCTGCGTGTCTCCGACTCAG ATTTCTCTGTTGCTCTGGATCTCTG
Used for week 176 sample only,Light Chains (kappa+lambda),5' pool,XLR-A_5L-VL1/2,CCATCTCATCCCTGCGTGTCTCCGACTCAG GCACAGGGTCCTGGGCCCAGTCTG
Used for week 176 sample only,Light Chains (kappa+lambda),5' pool,XLR-A_5L-VL3,CCATCTCATCCCTGCGTGTCTCCGACTCAG GCTCTGTGACCTCCTATGAGCTG
Used for week 176 sample only,Light Chains (kappa+lambda),5' pool,XLR-A_5L-VL4/5,CCATCTCATCCCTGCGTGTCTCCGACTCAG GGTCTCTCTCSCAGCYTGTGCTG
Used for week 176 sample only,Light Chains (kappa+lambda),5' pool,XLR-A_5L-VL6,CCATCTCATCCCTGCGTGTCTCCGACTCAG GTTCTTGGGCCAATTTTATGCTG
Used for week 176 sample only,Light Chains (kappa+lambda),5' pool,XLR-A_5L-VL7/8,CCATCTCATCCCTGCGTGTCTCCGACTCAG GAGTGGATTCTCAGACTGTGGTG
Used for week 176 sample only,Light Chains (kappa+lambda),5' pool,XLR-A_5MP-VL1,CCATCTCATCCCTGCGTGTCTCCGACTCAG GCTCACTGCACAGGGTCCTGGGCC
Used for week 176 sample only,Light Chains (kappa+lambda),5' pool,XLR-A_5MP-VL3-1,CCATCTCATCCCTGCGTGTCTCCGACTCAG GCTTACTGCACAGGATCCGTGGCC
Used for week 176 sample only,Light Chains (kappa+lambda),5' pool,XLR-A_5MP-VL3-19,CCATCTCATCCCTGCGTGTCTCCGACTCAG ACTCTTTGCATAGGTTCTGTGGTT
Used for week 176 sample only,Light Chains (kappa+lambda),5' pool,XLR-A_5MP-VL3-21,CCATCTCATCCCTGCGTGTCTCCGACTCAG TCTCACTGCACAGGCTCTGTGACC
Used for week 176 sample only,Light Chains (kappa+lambda),5' pool,XLR-A_5MP-VL7-43,CCATCTCATCCCTGCGTGTCTCCGACTCAG ACTTGCTGCCCAGGGTCCAATTC
Used for week 176 sample only,Light Chains (kappa+lambda),3' pool,XLR-B_3xwCK1,CCTATCCCCTGTGTGCCTTGGCAGTCTCAG CAGCAGGCACACAACAGAGGCAGTTCC
Used for week 176 sample only,Light Chains (kappa+lambda),3' pool,XLR-B_3CL,CCTATCCCCTGTGTGCCTTGGCAGTCTCAG CACCAGTGTGGCCTTGTTGGCTTG
