KY354938
KY354939
KY354940
KY354941
KY354942
KY354943
KY354944
KY354945
KY354946
KY354947
KY354948
KY354949
KY354950
KY354951
KY354952
KY354953
KY354954
KY354955
KY354956
KY354957
KY354958
KY354959
KY354960
KY354961
KY354962
KY354963
KY347498
KY347499
KY347500
KY347501
KY347502
KY347503
KY347504
KY347505
KY347506
KY347507
KY347508
KY347509
KY347510
KY347511
KY347512
KY347513
KY347514
KY347515
KY347516
KY347517
KY347518
KY347519
KY347520
KY347521
KY347522
KY347523
KY347524
KY347525
KY347526
KY347527
KY347528
KY347529
KY347530
KY347531
KY347532
KY347533
KY347534
KY347535
KY347536
KY347537
KY347538
KY347539
KY347540
KY347541
KY347542
KY347543
KY347544
KY347545
KY347546
KY347547
KY347548
KY347549
KY347550
KY347551
KY347552
KY347553
KY347554
KY347555
KY347556
KY347557
KY347558
KY347559
KY347560
KY347561
KY347562
KY347563
KY347564
KY347565
KY347566
KY347567
KY347568
KY347569
KY347570
KY347571
KY347572
KY347573
KY347574
KY347575
KY347576
KY347577
KY347578
KY347579
KY347580
KY347581
KY347582
KY347583
KY347584
KY347585
KY347586
KY347587
KY347588
KY347589
KY347590
KY347591
KY347592
KY347593
KY347594
KY347595
KY347596
KY347597
KY347598
KY347599
KY347600
KY347601
KY347602
KY347603
KY347604
KY347605
KY347606
KY347607
KY347608
KY347609
KY347610
KY347611
KY347612
KY347613
KY347614
KY347615
KY347616
KY347617
KY347618
KY347619
KY347620
KY347621
KY347622
KY347623
KY347624
KY347625
KY347626
KY347627
KY347628
KY347629
KY347630
KY347631
KY347632
KY347633
KY347634
KY347635
KY347636
KY347637
KY347638
KY347639
KY347640
KY347641
KY347642
KY347643
KY347644
KY347645
KY347646
KY347647
KY347648
KY347649
KY347650
KY347651
KY347652
KY347653
KY347654
KY347655
KY347656
KY347657
KY347658
KY347659
KY347660
KY347661
KY347662
KY347663
KY347664
KY347665
KY347666
KY347667
KY347668
KY347669
KY347670
KY347671
KY347672
KY347673
KY347674
KY347675
KY347676
KY347677
KY347678
KY347679
KY347680
KY347681
KY347682
KY347683
KY347684
KY347685
KY347686
KY347687
KY347688
KY347689
KY347690
KY347691
KY347692
KY347693
KY347694
KY347695
KY347696
KY347697
KY347698
KY347699
KY347700
KY347701
