                   10        20        30        40        50        60        70        80
          ....|....|....|....|....|....|....|....|....|....|....|....|....|....|....|....|
0219RUA-1 -ETDTLLLWVLLLWVPGSTGDEIVLTQSPGTLSLSPGERATLSCRASQSVSSSYLAWYQQKPGQAPRLLIYGASSRATGI
0219RUA-2 -...............................................................................
CH01      M........................A.....................HN.HPK.F.........S.......G.T..A..
CH02      M............................A...V..............N.HPR.F......R..S.....HSG.T..A..
CH03      M............................A....................HPK.F.........S......SG.T..A..
CH04      M............................D....................H.R.F....H....P.......G.T.....

                   90       100       110       120       130       140       150       160
          ....|....|....|....|....|....|....|....|....|....|....|....|....|....|....|....|
0219RUA-1 PDRFSGSGSGTDFTLTISRLEPEDFAVYYCQQYGSSPYTFGQGTKVEIKRTVAAPSVFIFPPSDEQLKSGTASVVCLLNN
0219RUA-2 ................................................................................
CH01      .GK................VD.............G.............................................
CH02      A.....G...MH.....T.V........F.....G.........R..LR...............................
CH03      A.....G...IH.....T.V........F.....G............LR...............................
CH04      .N...AG....Q....VN...A............R.............R...............................

                  170       180       190       200       210       220       230     
          ....|....|....|....|....|....|....|....|....|....|....|....|....|....|....|.
0219RUA-1 FYPREAKVQWKVDNALQSGNSQESVTEQDSKDSTYSLSSTLTLSKADYEKHKVYACEVTHQGLSSPVTKSFNRGEC
0219RUA-2 ............................................................................
CH01      ............................................................................
CH02      ............................................................................
CH03      ............................................................................
CH04      ............................................................................
