1.217551577743991386e-06
2.643304475282205052e-03
5.261974411830557669e-02
2.923080476267318484e-01
5.881891679922662819e-01
2.520320884430454211e-01
-3.542019174040634821e-01
-3.377228097049578964e-02
1.751770095792040960e-01
-2.132549940704786262e-01
4.010224927670328482e-02
2.620500969428313232e-02
-1.341037952696542135e-01
8.529489347942044442e-02
-9.082968884941919341e-02
-5.322170867661222583e-03
4.790577261413172215e-03
-7.090799229653840796e-02
3.511706374716819234e-02
-6.436332318023037236e-02
8.377907705647925918e-03
-2.620266281950284215e-02
-2.525890741756756791e-02
5.502450847650852380e-04
-3.805666263393482629e-02
4.348335471674826848e-03
-3.140358437207413367e-02
-5.194333833889783376e-03
-1.845220590881066491e-02
-1.515881711938836876e-02
-9.383293568605425780e-03
-1.920184123963344924e-02
-6.727078341085789871e-03
-1.780454493404270283e-02
-8.081989735231016186e-03
-1.419600438841014597e-02
-1.022942721432902081e-02
-1.102434722919552919e-02
-1.133755207925973146e-02
-9.266438026600402542e-03
-1.114700231639695512e-02
-8.657832812587125046e-03
-1.021368727219354629e-02
-8.535842379145529291e-03
-9.153746863904762762e-03
-8.407858298082090953e-03
-8.292537929805526842e-03
-8.099729520537663277e-03
-7.674474633970933615e-03
-7.648623720037673809e-03
-7.212457924404688456e-03
-7.151380361200372279e-03
-6.814024463898406790e-03
-6.676770521547411436e-03
-6.430542772042488996e-03
-6.248068846456248694e-03
-6.052107743247945974e-03
-5.861299177151254106e-03
-5.685624718347004510e-03
-5.504733021622662363e-03
-5.337840227096535967e-03
-5.171041542837289361e-03
-5.011848144520183318e-03
-4.856625023087023443e-03
-4.706413273365158204e-03
-4.560854099962112843e-03
-4.419800455585887362e-03
-4.283105292944484367e-03
-4.150639210420946530e-03
-4.022266924506633611e-03
-3.897870797367949773e-03
-3.777321427387934655e-03
-3.660495294841310809e-03
-3.547286525677839121e-03
-3.437577482063921587e-03
-3.331262289949319527e-03
-3.228235075283794261e-03
-3.128389964017107110e-03
-3.031638727774059461e-03
-2.937875492504411767e-03
-2.847017911724646164e-03
-2.758965993276204284e-03
-2.673637390675566092e-03
-2.590949757439213724e-03
-2.510814865191947267e-03
-2.433162131233608180e-03
-2.357909209080677731e-03
-2.284985516032996510e-03
-2.214314587498725662e-03
-2.145831722669386092e-03
-2.079466338844818390e-03
-2.015153735216544326e-03
-1.952829210976083718e-03
-1.892433947206637783e-03
-1.833903243099727206e-03
-1.777190043521913176e-03
-1.722223765773035634e-03
-1.668957354719656202e-03
-1.617343755228334550e-03
-1.567324148382272546e-03
-1.518851479048029642e-03
-1.471872810200487366e-03
-1.426352850489566015e-03
-1.382238662890146030e-03
-1.339489074160467828e-03
-1.298062911058772695e-03
-1.257919000343300396e-03
-1.219010286880611903e-03
-1.181313243103987920e-03
-1.144774931988308238e-03
-1.109371825966853778e-03
-1.075062751797864740e-03
-1.041812418131261853e-03
-1.009591415508645723e-03
-9.783644525799362144e-04
-9.481080017784140283e-04
-9.187867717539995689e-04
-8.903713530482931186e-04
-8.628323362028951764e-04
-8.361461936510861202e-04
-8.102893978261461105e-04
-7.852266573779956597e-04
-7.609403266315950239e-04
-7.374068780202243639e-04
-7.146027839771641656e-04
-6.924986350440148200e-04
-6.710826674374164615e-04
-6.503313535906492509e-04
-6.302152840453137958e-04
-6.107226950180500141e-04
-5.918359408338183785e-04
-5.735314939258990500e-04
-5.557917086192522846e-04
-5.386048211305182170e-04
-5.219473038929773332e-04
-5.058073931232695509e-04
-4.901615612546752479e-04
-4.750039263955144913e-04
-4.603109609790677131e-04
-4.460767831136548179e-04
-4.322778652325562376e-04
-4.189083254440920394e-04
-4.059563999649023580e-04
-3.933985612282675168e-04
-3.812289273425074746e-04
-3.694416164159425157e-04
-3.580131008818526923e-04
-3.469433807402383298e-04
-3.362148103160593048e-04
-3.258156258259560772e-04
-3.157399453782486058e-04
-3.059701232978970383e-04
-2.965120414765813617e-04
-2.873421723475819535e-04
-2.784546340192188270e-04
-2.698435445998119951e-04
-2.614971403060017551e-04
-2.534095392461081201e-04
-2.455689776367711704e-04
-2.379754554779910146e-04
-2.306172089864077872e-04
-2.234824743786615958e-04
-2.165712516547524673e-04
-2.098717770313205365e-04
-2.033840505083658575e-04
-1.970904264108486051e-04
-1.909967866304487392e-04
-1.850913673838063672e-04
-1.793682867792416107e-04
-1.738157810333946314e-04
-1.684397320379453077e-04
-1.632342579012137612e-04
-1.581817129481601937e-04
-1.532938609621444436e-04
-1.485530562681267670e-04
-1.439592988661071910e-04
-1.395067068644057287e-04
-1.351893983713425016e-04
-1.310073733869174825e-04
-1.269547500194507660e-04
-1.230315282689423519e-04
-1.192259443520323750e-04
-1.155379982687208622e-04
-1.119676900190078137e-04
-1.085032558195333640e-04
-1.051446956702975266e-04
-1.018920095713002881e-04
-9.874519752254167545e-05
-9.568661384898189065e-05
-9.272802233398078553e-05
-8.986354108585845447e-05
-8.708140632125503211e-05
-8.438749993185045112e-05
-8.178182191764471151e-05
-7.925260849527796143e-05
-7.679985966475021445e-05
-7.442357542606145701e-05
-7.212375577921168910e-05
-6.989451883252100514e-05
-6.772998269430945887e-05
-6.563602925625699656e-05
-6.360677662668368548e-05
-6.163634291390959296e-05
-5.973061000961464492e-05
-5.788369602211892897e-05
-5.609560095142243836e-05
-5.436044290584525392e-05
-5.267822188538737567e-05
-5.104893789004879683e-05
-4.947259091982952417e-05
-4.793741719136970585e-05
-4.645518048802920049e-05
-4.501999891812806184e-05
-4.362599058998639786e-05
-4.227903739528410059e-05
-4.097325744234127121e-05
-3.970276883947797703e-05
-3.847345347837413719e-05
-3.728531135902976525e-05
-3.613246058976492172e-05
-3.501490117057961339e-05
-3.393263310147384026e-05
-3.288565638244760910e-05
-3.186808912182098721e-05
-3.087993131959398138e-05
-2.992706486744651075e-05
-2.899772598201873024e-05
-2.810367844667048493e-05
-2.723315847804192976e-05
-2.639204796781299063e-05
-2.557446502430373825e-05
-2.478629153919410192e-05
-2.401576372912423319e-05
-2.327464537745398051e-05
-2.255705459250341118e-05
-2.185710948259261962e-05
-2.118069193940151141e-05
-2.052780196293009672e-05
-1.989255766149844624e-05
-1.927495903510656675e-05
-1.868088797543437739e-05
-1.810446259080195902e-05
-1.754568288120930485e-05
-1.699866695497649575e-05
-1.647517859546338017e-05
-1.596345401931010966e-05
-1.546937511819660335e-05
-1.499294189212286973e-05
-1.452827244940897778e-05
-1.408124868173485682e-05
-1.364598869742057924e-05
-1.322249249646614841e-05
-1.281076007887156095e-05
-1.241667333631674109e-05
-1.203435037712176969e-05
-1.166379120128664165e-05
-1.129911391713143615e-05
-1.095208230801599994e-05
-1.061093259058048457e-05
-1.028154665650481427e-05
-9.963924505788992415e-06
-9.658066138433012241e-06
-9.358089662756956294e-06
-9.069876970440747107e-06
-8.787546169804458758e-06
-8.516979152528017169e-06
-8.252294026931496419e-06
-7.999372684694822428e-06
-7.752333234138069276e-06
-7.511175675261241197e-06
-7.281781899744257338e-06
-7.052388124227273478e-06
-6.834758132070134684e-06
-6.623010031592919269e-06
-6.417143822795625541e-06
-6.223041397358177724e-06
-6.028938971920729908e-06
-5.840718438163204625e-06
-5.664261687765524407e-06
-5.487804937367845036e-06
-5.317230078650087351e-06
-5.152537111612253893e-06
-4.993726036254341273e-06
-4.840796852576352033e-06
-4.687867668898362793e-06
-4.546702268580218619e-06
-4.405536868262075292e-06
-4.264371467943931117e-06
-4.134969850985632008e-06
-4.005568234027333747e-06
-3.882048508748958018e-06
-3.764410675150504398e-06
-3.646772841552051202e-06
-3.535016899633520538e-06
-3.423260957714990298e-06
-3.317386907476382167e-06
-3.217394748917696993e-06
-3.117402590359011395e-06
-3.017410431800326220e-06
-2.929182056601486112e-06
-2.835071789722723470e-06
-2.746843414523883784e-06
-2.664496931004966208e-06
-2.582150447486049479e-06
-2.499803963967131903e-06
-2.423339372128137283e-06
-2.346874780289142663e-06
-2.276292080130070999e-06
-2.205709379970998912e-06
-2.135126679811926825e-06
-2.070425871332777694e-06
-2.005725062853628140e-06
-1.946906146054401542e-06
-1.888087229255174943e-06
-1.829268312455948134e-06
-1.770449395656721535e-06
-1.717512370537417682e-06
-1.664575345418113616e-06
-1.611638320298809763e-06
-1.558701295179505697e-06
-1.511646161740124377e-06
-1.464591028300743056e-06
-1.423417786541284479e-06
-1.376362653101903159e-06
-1.335189411342444370e-06
-1.294016169582986006e-06
-1.252842927823527218e-06
-1.211669686064068641e-06
-1.176378335984532598e-06
-1.141086985904996766e-06
-1.105795635825460722e-06
-1.070504285745924679e-06
-1.035212935666388847e-06
-1.005803477266775336e-06
-9.763940188671620372e-07
-9.469845604675488440e-07
-9.175751020679355449e-07
-8.881656436683221400e-07
-8.587561852687088409e-07
-8.352286185490181805e-07
-8.058191601494048814e-07
-7.822915934297142210e-07
-7.587640267100235606e-07
-7.352364599903330060e-07
-7.117088932706422397e-07
-6.881813265509515793e-07
-6.705356515111836634e-07
-6.470080847914930029e-07
-6.293624097517248753e-07
-6.058348430320343207e-07
-5.881891679922662989e-07
-5.705434929524983830e-07
-5.528978179127303612e-07
-5.352521428729623394e-07
-5.176064678331944235e-07
-5.058426844733490404e-07
-4.881970094335810186e-07
-4.705513343938130497e-07
-4.587875510339677725e-07
-4.470237676741224422e-07
-4.293780926343544205e-07
-4.176143092745090902e-07
-4.058505259146637600e-07
-3.940867425548184828e-07
-3.823229591949730996e-07
-3.705591758351277694e-07
-3.587953924752824392e-07
-3.470316091154371090e-07
-3.352678257555918317e-07
-3.235040423957465015e-07
-3.117402590359011713e-07
-3.058583673559784797e-07
-2.940945839961331495e-07
-2.882126923162104579e-07
-2.764489089563651806e-07
-2.705670172764424890e-07
-2.588032339165972118e-07
-2.529213422366745202e-07
-2.470394505567518816e-07
-2.352756671969065249e-07
-2.293937755169838862e-07
-2.235118838370612211e-07
-2.176299921571385295e-07
-2.117481004772158644e-07
-1.999843171173705342e-07
-1.941024254374478956e-07
-1.882205337575252305e-07
-1.823386420776025654e-07
-1.764567503976799003e-07
-1.705748587177572087e-07
-1.705748587177572087e-07
-1.646929670378345701e-07
-1.588110753579119049e-07
-1.529291836779892398e-07
-1.470472919980665747e-07
-1.411654003181439096e-07
-1.411654003181439096e-07
-1.352835086382212445e-07
-1.294016169582986059e-07
-1.294016169582986059e-07
-1.235197252783759408e-07
-1.176378335984532624e-07
-1.176378335984532624e-07
-1.117559419185306106e-07
-1.058740502386079322e-07
-1.058740502386079322e-07
-9.999215855868526711e-08
-9.999215855868526711e-08
-9.411026687876261524e-08
-9.411026687876261524e-08
-8.822837519883995013e-08
-8.822837519883995013e-08
-8.234648351891728503e-08
-8.234648351891728503e-08
-7.646459183899461992e-08
-7.646459183899461992e-08
-7.646459183899461992e-08
