1.237588008432245075e-06
2.677418523909126137e-03
5.338101096647360211e-02
2.978079731995705859e-01
6.066607884471789669e-01
2.845954775549400795e-01
-3.215594043275370462e-01
-8.094347303424948362e-03
2.024909407041130538e-01
-1.854614203110832582e-01
6.448183567206931810e-02
5.166167969254333719e-02
-1.098930649948098165e-01
1.081333301123689888e-01
-6.759003795524690106e-02
1.617456547708695860e-02
2.625097064209499023e-02
-5.027350027659484993e-02
5.489723827503963094e-02
-4.476565124471444668e-02
2.689716144751739049e-02
-7.866800974894179455e-03
-7.731715817130646248e-03
1.761892168204565873e-02
-2.146850591496088714e-02
2.029104405727163996e-02
-1.578560491257404927e-02
9.777800658326446862e-03
-3.813724513710114918e-03
-1.055911302115968399e-03
4.319200349252189271e-03
-5.919880906177955350e-03
6.114194356717585904e-03
-5.316823682814152477e-03
3.973336967150567153e-03
-2.472688707631856986e-03
1.100324938438186498e-03
-2.529775487824736271e-05
-6.878926680202562512e-04
1.054758646617918755e-03
-1.140334217436277976e-03
1.031735869696348345e-03
-8.154006325360843620e-04
5.641217339612627536e-04
-3.291498773799014137e-04
1.396047806374648131e-04
-6.976599067142558550e-06
-7.145250766330873613e-05
1.055529105819246767e-04
-1.086772136424276453e-04
9.350462732336368391e-05
-7.056678291217586001e-05
4.711327683080791871e-05
-2.732400191166094180e-05
1.291580818604044065e-05
-3.700630809527791776e-06
-9.403242220931273629e-07
2.736040155896777300e-06
-2.936238216084346350e-06
2.177912230525372650e-06
-1.219388184778829688e-06
5.156616701801021500e-07
-2.305310996099280203e-07
-6.066607884471789747e-09
-0.000000000000000000e+00
-0.000000000000000000e+00
