-1.702057860504813851e-06
1.320165032117902619e-03
3.488459234374027829e-02
2.333637624551732348e-01
5.692501205701718803e-01
3.957342703036014764e-01
-2.642105270736803679e-01
-1.253558157085215841e-01
2.291670968687973542e-01
-1.479767737722595677e-01
-1.622496617403323613e-02
9.862089840842537536e-02
-1.326393880787205548e-01
8.115008849801588764e-02
-3.643869640540770005e-02
-3.046100658180152590e-02
4.728387323497323935e-02
-6.914492792775968344e-02
4.425789329155475210e-02
-3.751141979511615765e-02
1.171738755680435838e-03
3.310878243761439157e-03
-2.823197111468008294e-02
1.858837313211527190e-02
-3.002328739409030126e-02
1.083129281912483151e-02
-1.668638893676500923e-02
-3.574589054616776791e-03
-3.869671239616737351e-03
-1.262171537584575245e-02
1.276458007860525011e-03
-1.384979850846022528e-02
-8.106121716919246177e-05
-1.062433624529033997e-02
-3.741897357553556312e-03
-6.937394294376627614e-03
-6.556713968746530515e-03
-4.837271209559504057e-03
-7.552958604756388437e-03
-4.422082941620442999e-03
-7.225930102990029899e-03
-4.887200137634713920e-03
-6.451305923920551237e-03
-5.454469267785300862e-03
-5.816603424487221466e-03
-5.754902403918620880e-03
-5.490343410383633285e-03
-5.774006437964955898e-03
-5.388419176295544330e-03
-5.643528617829066639e-03
-5.371438445198935957e-03
-5.484115814064595591e-03
-5.350080180675143363e-03
-5.351565923489830581e-03
-5.297589627057367953e-03
-5.250962349681463984e-03
-5.222027366052882195e-03
-5.168495084714463256e-03
-5.138381753336301351e-03
-5.091105530822949247e-03
-5.055294005737879896e-03
-5.013937984478456650e-03
-4.975365596308622095e-03
-4.936326423039919496e-03
-4.897662954850793594e-03
-4.859346729235214379e-03
-4.821332206183539214e-03
-4.783613693194559841e-03
-4.746191190268276260e-03
-4.709059004903483683e-03
-4.672217137100182112e-03
-4.635665586858371545e-03
-4.599398661676846328e-03
-4.563416361555605594e-03
-4.527718686494650209e-03
-4.492294251491567997e-03
-4.457154441548771134e-03
-4.422282179162642657e-03
-4.387688849335593007e-03
-4.353363067065212609e-03
-4.319304832351498862e-03
-4.285514145194452632e-03
-4.251985313092869999e-03
-4.218724028547954884e-03
-4.185718906557295976e-03
-4.152969947120894144e-03
-4.120482842739954174e-03
-4.088246208412065624e-03
-4.056265736638433282e-03
-4.024530042416646705e-03
-3.993044818247910681e-03
-3.961810064132225209e-03
-3.930814395067178980e-03
-3.900063503553978517e-03
-3.869551697091417296e-03
-3.839278975679495318e-03
-3.809245339318213450e-03
-3.779445095506364736e-03
-3.749872551742744389e-03
-3.720539093029763284e-03
-3.691433334365010546e-03
-3.662555275748485308e-03
-3.633899224678983214e-03
-3.605470873657709054e-03
-3.577264530183457171e-03
-3.549280194256227133e-03
-3.521512173374814151e-03
-3.493966160040423881e-03
-3.466630769250644145e-03
-3.439511693506681032e-03
-3.412603240307328888e-03
-3.385905409652587711e-03
-3.359412509041251847e-03
-3.333135923475733040e-03
-3.307058575452413458e-03
-3.281186157472498754e-03
-3.255518669535990232e-03
-3.230050419141680500e-03
-3.204775713788364771e-03
-3.179705938478454789e-03
-3.154829708209537942e-03
-3.130152715482821188e-03
-3.105663575295892348e-03
-3.081367980149957511e-03
-3.057260237543810589e-03
-3.033340347477452015e-03
-3.009614002452087444e-03
-2.986064124964099478e-03
-2.962707792517105081e-03
-2.939527927607487722e-03
-2.916530222736452623e-03
-2.893714677904000217e-03
-2.871075600608923983e-03
-2.848612990851225220e-03
-2.826332541132108717e-03
-2.804217173947957508e-03
-2.782283966802388993e-03
-2.760515842191785772e-03
-2.738918492617353501e-03
-2.717491918079092180e-03
-2.696230426075795720e-03
-2.675139709108671510e-03
-2.654208382175306073e-03
-2.633447830278111586e-03
-2.612846668414677172e-03
-2.592404896585002831e-03
-2.572122514789087263e-03
-2.551999523026931768e-03
-2.532035921298535480e-03
-2.512226017102693609e-03
-2.492575502940611379e-03
-2.473072993809877045e-03
-2.453724182211697562e-03
-2.434529068146071198e-03
-2.415481959111793163e-03
-2.396588547610069113e-03
-2.377837448638487738e-03
-2.359234354698254259e-03
-2.340779265789369543e-03
-2.322466489410627069e-03
-2.304296025562026836e-03
-2.286267874243569712e-03
-2.268382035455254828e-03
-2.250638509197082620e-03
-2.233031602967847432e-03
-2.215561316767548829e-03
-2.198227650596187247e-03
-2.181030604453762251e-03
-2.163970178340274275e-03
-2.147040679754517230e-03
-2.130242108696491117e-03
-2.113574465166196802e-03
-2.097043441664839074e-03
-2.080637653190006622e-03
-2.064357099741699446e-03
-2.048207473821124069e-03
-2.032183082927073534e-03
-2.016289619560754365e-03
-2.000515698719754817e-03
-1.984861320404075324e-03
-1.969337869616126762e-03
-1.953928268852292167e-03
-1.938643903114982848e-03
-1.923479079902993367e-03
-1.908428106715118070e-03
-1.893496676052562611e-03
-1.878684787915326773e-03
-1.863986749802204902e-03
-1.849408254214402868e-03
-1.834937916149508930e-03
-1.820581428108729175e-03
-1.806338790092063820e-03
-1.792210002099511998e-03
-1.778189371629868487e-03
-1.764276898683133721e-03
-1.750472583259307050e-03
-1.736776425358388474e-03
-1.723194117481584298e-03
-1.709708582125276906e-03
-1.696336896793083481e-03
-1.683061983981387275e-03
-1.669895228692599163e-03
-1.656836630926719362e-03
-1.643874805681336563e-03
-1.631009752956450766e-03
-1.618252857754473063e-03
-1.605592735072992362e-03
-1.593029384912008880e-03
-1.580568499772727620e-03
-1.568204387153943578e-03
-1.555937047055656539e-03
-1.543760786976660412e-03
-1.531686991919366941e-03
-1.519704276881364818e-03
-1.507812641862654041e-03
-1.496017779364440048e-03
-1.484313996885517403e-03
-1.472701294425885670e-03
-1.461179671985545500e-03
-1.449749129564496461e-03
-1.438409667162738768e-03
-1.427155592279066550e-03
-1.415992597414685245e-03
-1.404914990068389848e-03
-1.393922770240179710e-03
-1.383015937930055263e-03
-1.372194493138016507e-03
-1.361464128365268665e-03
-1.350813458609400643e-03
-1.340242483870412657e-03
-1.329756896649510146e-03
-1.319356696946693110e-03
-1.309036192260755677e-03
-1.298795382591698281e-03
-1.288634267939520921e-03
-1.278552848304223164e-03
-1.268545431184599356e-03
-1.258623401583061456e-03
-1.248775374497197504e-03
-1.239007042428213372e-03
-1.229312712874903405e-03
-1.219698078338473041e-03
-1.210157446317717059e-03
-1.200690816812635025e-03
-1.191298189823227155e-03
-1.181973872848287796e-03
-1.172729250890228040e-03
-1.163552938946637010e-03
-1.154450629518719929e-03
-1.145422322606476796e-03
-1.136456633207496734e-03
-1.127570638825396493e-03
-1.118747261956558889e-03
-1.109992195102189362e-03
-1.101311130763494434e-03
-1.092692683938061926e-03
-1.084148239628303801e-03
-1.075666412831808097e-03
-1.067252896049780903e-03
-1.058901996781016564e-03
-1.050619407526720518e-03
-1.042399435785687327e-03
-1.034242081557916774e-03
-1.026153037344614731e-03
-1.018126610644575110e-03
-1.010157108956592689e-03
-1.002255917283078777e-03
-9.944173431228275038e-04
-9.866356939746332138e-04
-9.789166623397017788e-04
-9.712602482180329819e-04
-9.636607591084211683e-04
-9.561238875120719929e-04
-9.486439409277799091e-04
-9.412209193555449169e-04
-9.338548227953669080e-04
-9.265513437484515372e-04
-9.193047897135933665e-04
-9.121094681895864156e-04
-9.049767641788419945e-04
-8.978952926789492269e-04
-8.908707461911132258e-04
-8.839031247153344246e-04
-8.769867357504067349e-04
-8.701272717975362453e-04
-8.633190403555168670e-04
-8.565620414243489255e-04
-8.498619675052380756e-04
-8.432131260969784456e-04
-8.366155171995701438e-04
-8.300748333142189336e-04
-8.235796894385131800e-04
-8.171357780736588630e-04
-8.107430992196558743e-04
-8.044016528765042138e-04
-7.981057465429981183e-04
-7.918610727203432426e-04
-7.856676314085398035e-04
-7.795197301063818210e-04
-7.734230613150753835e-04
-7.673719325334145110e-04
-7.613720362626048583e-04
-7.554119875002352240e-04
-7.495031712487167010e-04
-7.436398950068439598e-04
-7.378221587746167836e-04
-7.320499625520353890e-04
-7.263233063390993425e-04
-7.206421901358090777e-04
-7.150009214409586145e-04
-7.094108852569594795e-04
-7.038606965814003628e-04
-6.983560479154868111e-04
-6.928912467580132777e-04
-6.874719856101852008e-04
-6.820925719707970339e-04
-6.767530058398487768e-04
-6.714589797185461931e-04
-6.662104936068892827e-04
-6.609961625024664104e-04
-6.558273714076892115e-04
-6.506927353201462675e-04
-6.456036392422488885e-04
-6.405543906727916362e-04
-6.355392971105683136e-04
-6.305697435579907728e-04
-6.256343450126473785e-04
-6.207444864769495491e-04
-6.158887829484860832e-04
-6.110672344272566553e-04
-6.062855334144672459e-04
-6.015436799101177463e-04
-5.968359814130023934e-04
-5.921681304243270588e-04
-5.875344344428857623e-04
-5.829405859698844842e-04
-5.783808925041173526e-04
-5.738553540455844761e-04
-5.693639705942858545e-04
-5.649124346514271429e-04
-5.604893612145968144e-04
-5.561061352862066128e-04
-5.517570643650504493e-04
-5.474421484511285407e-04
-5.431556950432351238e-04
-5.389090891437817252e-04
-5.346909457503567099e-04
-5.305069573641659495e-04
-5.263571239852093357e-04
-5.222414456134869768e-04
-5.181542297477932180e-04
-5.141011688893336058e-04
-5.100822630381081401e-04
-5.060918196929112744e-04
-5.021298388537429004e-04
-4.982020130218086729e-04
-4.943026496959030455e-04
-4.904374413772315646e-04
-4.866006955645885753e-04
-4.827924122579741318e-04
-4.790182839585938892e-04
-4.752669256640364289e-04
-4.715497223767132779e-04
-4.678609815954185643e-04
-4.642007033201522880e-04
-4.605688875509146118e-04
-4.569655342877054272e-04
-4.533906435305247343e-04
-4.498442152793725871e-04
-4.463262495342489857e-04
-4.428367462951538218e-04
-4.393700130608814403e-04
-4.359317423326376046e-04
-4.325219341104222606e-04
-4.291405883942354623e-04
-4.257820126828714465e-04
-4.224518994775359223e-04
-4.191445562770232348e-04
-4.158656755825390389e-04
-4.126152573940833888e-04
-4.093819167092448120e-04
-4.061827310316404359e-04
-4.030063153588588423e-04
-3.998526696909001396e-04
-3.967217940277641651e-04
-3.936193808706567364e-04
-3.905397377183720902e-04
-3.874828645709102264e-04
-3.844544539294769627e-04
-3.814431207916607180e-04
-3.784602501598730191e-04
-3.755001495329081569e-04
-3.725628189107660772e-04
-3.696482582934467799e-04
-3.667564676809503192e-04
-3.638874470732766410e-04
-3.610411964704257994e-04
-3.582177158723977403e-04
-3.554113127779867545e-04
-3.526333721896043687e-04
-3.498725091048390020e-04
-3.471401085261021811e-04
-3.444190929497767785e-04
-3.417265398794798134e-04
-3.390567568140057933e-04
-3.364040512521487380e-04
-3.337684231939088645e-04
-3.311612576416974826e-04
-3.285654770918974648e-04
-3.259981590481259928e-04
-3.234479185079716483e-04
-3.209147554714343771e-04
-3.184043624397198883e-04
-3.159167394128282905e-04
-3.134461938895537116e-04
-3.109927258698962603e-04
-3.085563353538559907e-04
-3.061427148426383951e-04
-3.037518643362436903e-04
-3.013723988322603497e-04
-2.990157033330999000e-04
-2.966760853375564693e-04
-2.943535448456301661e-04
-2.920537743585266996e-04
-2.897653888738345972e-04
-2.874997733939653314e-04
-2.852512354177130847e-04
-2.830197749450780197e-04
-2.808053919760600281e-04
-2.786080865106592181e-04
-2.764278585488754271e-04
-2.742647080907088179e-04
-2.721186351361592278e-04
-2.699896396852268193e-04
-2.678777217379114842e-04
-2.657828812942132223e-04
-2.637051183541320879e-04
-2.616444329176680810e-04
-2.595951324836154924e-04
-2.575629095531799771e-04
-2.555477641263615351e-04
-2.535496962031602206e-04
-2.515687057835760336e-04
-2.495991003664032649e-04
-2.476465724528475695e-04
-2.457111220429090016e-04
-2.437870566353817978e-04
-2.418800687314717215e-04
-2.399844658299730635e-04
-2.381116329332971608e-04
-2.362444925378270216e-04
-2.344001221471796648e-04
-2.325671367589436992e-04
-2.307455363731191790e-04
-2.289410134909117050e-04
-2.271478756111156494e-04
-2.253718152349367483e-04
-2.236071398611692114e-04
-2.218595419910187748e-04
-2.201233291232797566e-04
-2.184041937591578387e-04
-2.166907508962416301e-04
-2.150000780381482310e-04
-2.133150976812604868e-04
-2.116471948279898701e-04
-2.099906769771306718e-04
-2.083512366298886009e-04
-2.067174887838522121e-04
-2.051008184414328966e-04
-2.034955331014250536e-04
-2.019073252650342568e-04
-2.003248099298491692e-04
-1.987593720982812090e-04
-1.972053192691246401e-04
-1.956626514423794624e-04
-1.941313686180457031e-04
-1.926114707961233620e-04
-1.911029579766124122e-04
-1.896115226607185628e-04
-1.881257798460303954e-04
-1.866514220337536464e-04
-1.851941417250939977e-04
-1.837425539176400582e-04
-1.823080436138032462e-04
-1.808792258111721163e-04
-1.794674855121580596e-04
-1.780614377143497663e-04
-1.766667749189528101e-04
-1.752891896271730084e-04
-1.739172968365988888e-04
-1.725567890484361875e-04
-1.712076662626849045e-04
-1.698642359781392765e-04
-1.685378831972107760e-04
-1.672172229174879847e-04
-1.659079476401765845e-04
-1.646100573652766028e-04
-1.633235520927879851e-04
-1.620484318227108128e-04
-1.607790040538393497e-04
-1.595209612873792779e-04
-1.582743035233305973e-04
-1.570333382604875987e-04
-1.558037580000560184e-04
-1.545855627420358836e-04
-1.533787524864271129e-04
-1.521776347320240243e-04
-1.509879019800323540e-04
-1.498038617292464470e-04
-1.486368989820775592e-04
-1.474699362349086984e-04
-1.463200509913569652e-04
-1.451758582490109411e-04
-1.440373580078705990e-04
-1.429102427691416482e-04
-1.417945125328240886e-04
-1.406844747977122924e-04
-1.395858220650118332e-04
-1.384928618335171102e-04
-1.374055941032280694e-04
-1.363354038765561560e-04
-1.352652136498842426e-04
-1.342064084256237204e-04
-1.331589882037746166e-04
-1.321172604831311948e-04
-1.310812252636934822e-04
-1.300565750466671608e-04
-1.290376173308465486e-04
-1.280300446174373547e-04
-1.270281644052338428e-04
-1.260319766942360402e-04
-1.250471739856496558e-04
-1.240680637782689535e-04
-1.231003385732996696e-04
-1.221383058695360677e-04
-1.211819656669781885e-04
-1.202313179656260049e-04
-1.192920552666852126e-04
-1.183584850689501294e-04
-1.174362998736264510e-04
-1.165141146783027726e-04
-1.156033144853904854e-04
-1.146982067936839209e-04
-1.137987916031830521e-04
-1.129107614150935880e-04
-1.120284237282098331e-04
-1.111517785425317466e-04
-1.102808258580593965e-04
-1.094212581759984376e-04
-1.085616904939374651e-04
-1.077135078142879245e-04
-1.068710176358440524e-04
-1.060342199586059031e-04
-1.052031147825734493e-04
-1.043833946089524139e-04
-1.035636744353313514e-04
-1.027553392641217207e-04
-1.019526965941177721e-04
-1.011557464253195462e-04
-1.003644887577270024e-04
-9.957892359134016777e-05
-9.879905092615902872e-05
-9.802487076218359885e-05
-9.725638309941386458e-05
-9.649928043905552154e-05
-9.574217777869720560e-05
-9.499646012075028088e-05
-9.425074246280335617e-05
-9.351071730606212707e-05
-9.278207715173231629e-05
-9.205343699740249196e-05
-9.133618184548407241e-05
-9.061892669356565286e-05
-8.991305654405863808e-05
-8.920718639455163686e-05
-8.851270124745601331e-05
-8.781821610036040331e-05
-8.712942345447050247e-05
-8.645201581099199286e-05
-8.577460816751348324e-05
-8.510289302524069635e-05
-8.443687038417359151e-05
-8.377654024431218228e-05
-8.312190260565648222e-05
-8.247295746820650488e-05
-8.182401233075650043e-05
-8.118645219571791430e-05
-8.054889206067931463e-05
-7.992271692805211973e-05
-7.929654179542493838e-05
-7.867605916400345265e-05
-7.806126903378767608e-05
-7.744647890357188595e-05
-7.684307377576750061e-05
-7.623966864796310171e-05
-7.564764852257014824e-05
-7.505562839717716767e-05
-7.446360827178418709e-05
-7.388297314880259775e-05
-7.330803052702673111e-05
-7.273308790525086448e-05
-7.216383778468069346e-05
-7.160028016531621805e-05
-7.103672254595174264e-05
-7.048454992899867201e-05
-6.993237731204561493e-05
-6.938589719629823991e-05
-6.883941708055087844e-05
-6.830432196721492174e-05
-6.776922685387895150e-05
-6.723982424174870397e-05
-6.671042162961842933e-05
-6.619240401989958658e-05
-6.567438641018073027e-05
-6.515636880046187396e-05
-6.464973619315442243e-05
-6.414310358584695735e-05
-6.364216347974521498e-05
-6.314122337364345906e-05
-6.265166826995310792e-05
-6.215642066505706117e-05
-6.167255806257241919e-05
-6.118869546008777721e-05
-6.071052535880883084e-05
-6.023804775873558686e-05
-5.976557015866234288e-05
-5.929878505979480129e-05
-5.883199996092726647e-05
-5.837659986447112288e-05
-5.791550726680928367e-05
-5.746579967155884924e-05
-5.701609207630841482e-05
-5.656638448105798039e-05
-5.612806188821894396e-05
-5.568404679417420514e-05
-5.525141670254087788e-05
-5.481878661090754383e-05
-5.439184902047992573e-05
-5.396491143005229408e-05
-5.354366634083036481e-05
-5.312242125160843555e-05
-5.270686866359221545e-05
-5.229700857678168418e-05
-5.188714848997116647e-05
-5.148298090436633759e-05
-5.107881331876151548e-05
-5.068033823436240255e-05
-5.028186314996328283e-05
-4.988908056676985873e-05
-4.949629798357644140e-05
-4.910920790158872646e-05
-4.872781032080670714e-05
-4.834641274002469459e-05
-4.796501515924267526e-05
-4.758931007966636509e-05
-4.721929750129575054e-05
-4.684928492292514277e-05
-4.648496484576023060e-05
-4.612064476859531844e-05
-4.576201719263610866e-05
-4.540338961667690566e-05
-4.504476204071769589e-05
-4.469182696596419528e-05
-4.434458439241638350e-05
-4.399734181886858528e-05
-4.365009924532078028e-05
-4.331424167418437328e-05
-4.297269160184227066e-05
-4.263683403070587721e-05
-4.230097645956947021e-05
-4.197081138963877238e-05
-4.164633882091377015e-05
-4.131617375098307231e-05
-4.099170118225807009e-05
-4.067292111473877703e-05
-4.035414104721947719e-05
-4.004105348090588652e-05
-3.972796591459228907e-05
-3.941487834827869840e-05
-3.910748328317081011e-05
-3.880008821806291505e-05
-3.849838565416072237e-05
-3.819668309025853648e-05
-3.790067302756204619e-05
-3.759897046365985352e-05
-3.730865290216906562e-05
-3.701833534067827772e-05
-3.672801777918748982e-05
-3.643770021769670192e-05
-3.615307515741160964e-05
-3.586845009712652413e-05
-3.558951753804714778e-05
-3.531058497896775788e-05
-3.503734492109407715e-05
-3.476410486322038964e-05
-3.449086480534671568e-05
-3.421762474747302817e-05
-3.395007719080504982e-05
-3.368822213534276708e-05
-3.342067457867478874e-05
-3.315881952321251278e-05
-3.290265696895593243e-05
-3.264649441469935208e-05
-3.239033186044277851e-05
-3.213416930618620494e-05
-3.188369925313532698e-05
-3.163322920008444902e-05
-3.138845164823927345e-05
-3.114367409639410465e-05
-3.089889654454892908e-05
-3.065411899270375351e-05
-3.041503394206428372e-05
-3.017594889142481053e-05
-2.994255634199103635e-05
-2.970916379255726894e-05
-2.947577124312349814e-05
-2.924807119489542973e-05
-2.901467864546165894e-05
-2.878697859723359053e-05
-2.856497105021122112e-05
-2.834296350318885849e-05
-2.812095595616648908e-05
-2.789894840914412306e-05
-2.768263336332745604e-05
-2.746631831751079241e-05
-2.725000327169412539e-05
-2.703368822587746175e-05
-2.682306568126650051e-05
-2.661244313665553249e-05
-2.640751309325027363e-05
-2.620258304984500800e-05
-2.599765300643974914e-05
-2.579272296303448690e-05
-2.558779291962922465e-05
-2.538855537742966479e-05
-2.518931783523010155e-05
-2.499577279423624408e-05
-2.479653525203668761e-05
-2.460299021104283014e-05
-2.440944517004896928e-05
-2.422159263026081081e-05
-2.403374009047265573e-05
-2.384588755068449726e-05
-2.365803501089634218e-05
-2.347018247110818710e-05
-2.328802243252573102e-05
-2.310586239394327832e-05
-2.292370235536081885e-05
-2.274723481798406516e-05
-2.257076728060731485e-05
-2.239429974323056116e-05
-2.221783220585380408e-05
-2.204136466847705377e-05
-2.187058963230600246e-05
-2.169981459613495116e-05
-2.152903955996389985e-05
-2.135826452379284855e-05
-2.119318198882749963e-05
-2.102809945386215071e-05
-2.086301691889679840e-05
-2.069793438393144610e-05
-2.053854435017179957e-05
-2.037915431641215303e-05
-2.021976428265250312e-05
-2.006037424889285659e-05
-1.990098421513320667e-05
-1.974728668257926252e-05
-1.959358915002531499e-05
-1.943989161747137085e-05
-1.928619408491742332e-05
-1.913818905356917818e-05
-1.898449152101523065e-05
-1.883648648966698889e-05
-1.868848145831874375e-05
-1.854616892817620099e-05
-1.839816389682795585e-05
-1.825585136668541309e-05
-1.811353883654286695e-05
-1.797122630640032420e-05
-1.782891377625778144e-05
-1.769229374732094107e-05
-1.754998121717839832e-05
-1.741336118824155456e-05
-1.727674115930471420e-05
-1.714581363157357622e-05
-1.700919360263673246e-05
-1.687826607490559448e-05
-1.674733854717445650e-05
-1.661641101944331513e-05
-1.648548349171217715e-05
-1.635455596398103918e-05
-1.622932093745560020e-05
-1.609839340972445883e-05
-1.597315838319901985e-05
-1.584792335667358426e-05
-1.572268833014814528e-05
-1.560314580482841207e-05
-1.547791077830297309e-05
-1.535836825298323650e-05
-1.523882572766349991e-05
-1.511928320234376332e-05
-1.499974067702402842e-05
-1.488589065290999252e-05
-1.476634812759025762e-05
-1.465249810347622342e-05
-1.453864807936218921e-05
-1.442479805524815501e-05
-1.431094803113412081e-05
-1.419709800702008491e-05
-1.408894048411175309e-05
-1.397509045999771889e-05
-1.386693293708938707e-05
-1.375877541418105356e-05
-1.365061789127272174e-05
-1.354246036836438823e-05
-1.343999534666175711e-05
-1.333183782375342360e-05
-1.322937280205079417e-05
-1.312690778034816305e-05
-1.302444275864553193e-05
-1.292197773694290081e-05
-1.281951271524027138e-05
-1.272274019474334095e-05
-1.262027517304070983e-05
-1.252350265254378109e-05
-1.242673013204685066e-05
-1.232426511034422123e-05
-1.223318509105299319e-05
-1.213641257055606276e-05
-1.203964005005913403e-05
-1.194286752956220529e-05
-1.185178751027097895e-05
-1.176070749097974921e-05
-1.166962747168852287e-05
-1.157854745239729482e-05
-1.148746743310606848e-05
-1.139638741381484044e-05
-1.130530739452361240e-05
-1.121991987643808674e-05
-1.112883985714686040e-05
-1.104345233906133474e-05
-1.095806482097580909e-05
-1.087267730289028174e-05
-1.078728978480475609e-05
-1.070190226671923044e-05
-1.061651474863370478e-05
-1.053681973175388152e-05
-1.045143221366835586e-05
-1.037173719678853091e-05
-1.029204217990870764e-05
-1.020665466182318029e-05
-1.012695964494335703e-05
-1.004726462806353207e-05
-9.973262112389411191e-06
-9.893567095509586231e-06
-9.813872078629762966e-06
-9.739869562955640395e-06
-9.660174546075815435e-06
-9.586172030401694558e-06
-9.512169514727571986e-06
-9.438166999053449415e-06
-9.364164483379326843e-06
-9.290161967705204272e-06
-9.216159452031081700e-06
-9.147849437562661517e-06
-9.073846921888538945e-06
-9.005536907420118761e-06
-8.931534391745996190e-06
-8.863224377277574312e-06
-8.794914362809154129e-06
-8.726604348340733945e-06
-8.658294333872313761e-06
-8.589984319403893578e-06
-8.521674304935473394e-06
-8.453364290467051516e-06
-8.390746777204332026e-06
-8.322436762735913537e-06
-8.259819249473194047e-06
-8.191509235004772169e-06
-8.128891721742054373e-06
-8.066274208479334883e-06
-8.003656695216615393e-06
-7.941039181953897597e-06
-7.878421668691178108e-06
-7.815804155428460312e-06
-7.753186642165740822e-06
-7.696261630108723720e-06
-7.633644116846004230e-06
-7.576719104788987128e-06
-7.514101591526268485e-06
-7.457176579469251383e-06
-7.400251567412233434e-06
-7.343326555355217179e-06
-7.280709042092497689e-06
-7.223784030035480587e-06
-7.166859017978463485e-06
-7.115626507127148770e-06
-7.058701495070130821e-06
-7.001776483013114566e-06
-6.950543972161798158e-06
-6.893618960104781056e-06
-6.842386449253465495e-06
-6.785461437196448393e-06
-6.734228926345132831e-06
-6.682996415493817270e-06
-6.626071403436800168e-06
-6.574838892585484607e-06
-6.523606381734169892e-06
-6.472373870882853484e-06
-6.421141360031538770e-06
-6.375601350385924749e-06
-6.324368839534609188e-06
-6.273136328683293627e-06
-6.221903817831978913e-06
-6.176363808186364045e-06
-6.125131297335049331e-06
-6.079591287689435310e-06
-6.034051278043821290e-06
-5.982818767192505729e-06
-5.937278757546892555e-06
-5.891738747901278535e-06
-5.846198738255664514e-06
-5.800658728610051341e-06
-5.755118718964437320e-06
-5.709578709318824147e-06
-5.664038699673209279e-06
-5.618498690027596106e-06
-5.578651181587683626e-06
-5.533111171942070453e-06
-5.487571162296456432e-06
-5.447723653856544800e-06
-5.402183644210930779e-06
-5.362336135771018300e-06
-5.316796126125405126e-06
-5.276948617685492647e-06
-5.237101109245581014e-06
-5.197253600805669381e-06
-5.157406092365756902e-06
-5.117558583925845269e-06
-5.072018574280230401e-06
-5.037863567046021157e-06
-4.998016058606109524e-06
-4.958168550166196197e-06
-4.918321041726284565e-06
-4.878473533286372085e-06
-4.838626024846460452e-06
-4.804471017612250361e-06
-4.764623509172337881e-06
-4.730468501938127789e-06
-4.690620993498216156e-06
-4.656465986264005218e-06
-4.616618477824093585e-06
-4.582463470589882646e-06
-4.548308463355672554e-06
-4.508460954915760922e-06
-4.474305947681549983e-06
-4.440150940447340738e-06
-4.405995933213130646e-06
-4.371840925978919707e-06
-4.337685918744709615e-06
-4.303530911510498676e-06
-4.269375904276288585e-06
-4.235220897042078493e-06
-4.201065889807868401e-06
-4.172603383779359850e-06
-4.138448376545148911e-06
-4.104293369310938819e-06
-4.070138362076728727e-06
-4.041675856048220176e-06
-4.007520848814010084e-06
-3.979058342785501533e-06
-3.944903335551290595e-06
-3.916440829522782044e-06
-3.887978323494273493e-06
-3.853823316260063401e-06
-3.825360810231554850e-06
-3.796898304203045875e-06
-3.762743296968836207e-06
-3.734280790940327232e-06
-3.705818284911819105e-06
-3.677355778883310130e-06
-3.648893272854801156e-06
-3.620430766826293028e-06
-3.591968260797784054e-06
-3.563505754769275926e-06
-3.535043248740766951e-06
-3.506580742712258824e-06
-3.478118236683749849e-06
-3.455348231860943263e-06
-3.426885725832434288e-06
-3.398423219803925737e-06
-3.375653214981119150e-06
-3.347190708952610176e-06
-3.318728202924102048e-06
-3.295958198101294615e-06
-3.267495692072786487e-06
-3.244725687249979477e-06
-3.216263181221470926e-06
-3.193493176398663916e-06
-3.165030670370155364e-06
-3.142260665547348354e-06
-3.119490660724541768e-06
-3.096720655901734757e-06
-3.068258149873226206e-06
-3.045488145050419196e-06
-3.022718140227612609e-06
-2.999948135404806023e-06
-2.977178130581998589e-06
-2.954408125759192002e-06
-2.925945619730683451e-06
-2.903175614907876441e-06
-2.880405610085069431e-06
-2.857635605262262844e-06
-2.840558101645157374e-06
-2.817788096822350788e-06
-2.795018091999543354e-06
-2.772248087176736767e-06
-2.749478082353930181e-06
-2.726708077531123170e-06
-2.709630573914018124e-06
-2.686860569091211114e-06
-2.664090564268404104e-06
-2.647013060651299482e-06
-2.624243055828492048e-06
-2.601473051005685461e-06
-2.584395547388579992e-06
-2.561625542565773405e-06
-2.544548038948668359e-06
-2.521778034125861349e-06
-2.504700530508756303e-06
-2.481930525685949293e-06
-2.464853022068844247e-06
-2.442083017246036813e-06
-2.425005513628932191e-06
-2.407928010011827145e-06
-2.385158005189019711e-06
-2.368080501571914665e-06
-2.351002997954810043e-06
-2.333925494337704573e-06
-2.311155489514897563e-06
-2.294077985897792940e-06
-2.277000482280687471e-06
-2.259922978663582425e-06
-2.242845475046477379e-06
-2.225767971429371910e-06
-2.208690467812266864e-06
-2.191612964195161818e-06
-2.174535460578056348e-06
-2.157457956960951303e-06
-2.140380453343846257e-06
-2.123302949726740787e-06
-2.106225446109635741e-06
-2.089147942492530695e-06
-2.072070438875425649e-06
-2.054992935258320604e-06
-2.037915431641215134e-06
-2.026530429229811629e-06
-2.009452925612706583e-06
-1.992375421995601537e-06
-1.975297918378496068e-06
-1.963912915967092986e-06
-1.946835412349987517e-06
-1.929757908732882471e-06
-1.918372906321478966e-06
-1.901295402704374131e-06
-1.884217899087268874e-06
-1.872832896675865369e-06
-1.855755393058760323e-06
-1.844370390647356818e-06
-1.827292887030251772e-06
-1.815907884618848267e-06
-1.798830381001743009e-06
-1.787445378590339504e-06
-1.770367874973234458e-06
-1.758982872561830953e-06
-1.741905368944725907e-06
-1.730520366533322402e-06
-1.719135364121918897e-06
-1.702057860504813851e-06
-1.690672858093410346e-06
-1.679287855682007052e-06
-1.662210352064901795e-06
-1.650825349653498501e-06
-1.639440347242094996e-06
-1.622362843624989738e-06
-1.610977841213586233e-06
-1.599592838802182940e-06
-1.588207836390779435e-06
-1.576822833979376141e-06
-1.559745330362270884e-06
-1.548360327950867379e-06
-1.536975325539463874e-06
-1.525590323128060580e-06
-1.514205320716657075e-06
-1.502820318305253782e-06
-1.491435315893850277e-06
-1.480050313482446771e-06
-1.468665311071043266e-06
-1.457280308659639973e-06
-1.445895306248236468e-06
-1.434510303836832963e-06
-1.423125301425429669e-06
-1.411740299014026164e-06
-1.400355296602622871e-06
-1.388970294191219366e-06
-1.377585291779815861e-06
-1.366200289368412356e-06
-1.354815286957009062e-06
-1.343430284545605557e-06
-1.337737783339903805e-06
-1.326352780928500511e-06
-1.314967778517097006e-06
-1.303582776105693501e-06
-1.292197773694289996e-06
-1.286505272488588455e-06
-1.275120270077184950e-06
-1.263735267665781445e-06
-1.252350265254378151e-06
-1.246657764048676399e-06
-1.235272761637272894e-06
-1.223887759225869600e-06
-1.212502756814466095e-06
-1.206810255608764343e-06
-1.195425253197360838e-06
-1.184040250785957332e-06
-1.178347749580255792e-06
-1.166962747168852287e-06
-1.161270245963150534e-06
-1.149885243551747241e-06
-1.138500241140343736e-06
-1.132807739934641983e-06
-1.121422737523238690e-06
-1.115730236317536725e-06
-1.104345233906133432e-06
-1.098652732700431679e-06
-1.087267730289028174e-06
-1.081575229083326422e-06
-1.070190226671923128e-06
-1.064497725466221376e-06
-1.053112723054817871e-06
-1.047420221849116118e-06
-1.036035219437712825e-06
-1.030342718232011072e-06
-1.024650217026309320e-06
-1.013265214614905814e-06
-1.007572713409204062e-06
-9.961877109978007686e-07
-9.904952097920990160e-07
-9.848027085863972634e-07
-9.734177061749937583e-07
-9.677252049692922175e-07
-9.620327037635904650e-07
-9.506477013521870657e-07
-9.449552001464852073e-07
-9.392626989407835606e-07
-9.278776965293801614e-07
-9.221851953236784088e-07
-9.164926941179766563e-07
-9.108001929122749037e-07
-8.994151905008715045e-07
-8.937226892951697519e-07
-8.880301880894681052e-07
-8.823376868837663527e-07
-8.709526844723629534e-07
-8.652601832666612009e-07
-8.595676820609594483e-07
-8.538751808552578016e-07
-8.481826796495560491e-07
-8.424901784438542965e-07
-8.311051760324508973e-07
-8.254126748267492506e-07
-8.197201736210474980e-07
-8.140276724153457455e-07
-8.083351712096439929e-07
-8.026426700039423462e-07
-7.969501687982405937e-07
-7.912576675925388411e-07
-7.855651663868370886e-07
-7.741801639754336893e-07
-7.684876627697319368e-07
-7.627951615640302901e-07
-7.571026603583285375e-07
-7.514101591526268908e-07
-7.457176579469251383e-07
-7.400251567412233857e-07
-7.343326555355216332e-07
-7.286401543298199865e-07
-7.229476531241182339e-07
-7.172551519184164814e-07
-7.115626507127148347e-07
-7.058701495070130821e-07
-7.001776483013114355e-07
-6.944851470956096829e-07
-6.887926458899079303e-07
-6.831001446842061778e-07
-6.774076434785045311e-07
-6.717151422728027785e-07
-6.717151422728027785e-07
-6.660226410671010260e-07
-6.603301398613992734e-07
-6.546376386556976267e-07
-6.489451374499959801e-07
-6.432526362442942275e-07
-6.375601350385924749e-07
-6.318676338328907224e-07
-6.261751326271890757e-07
-6.204826314214873231e-07
-6.204826314214873231e-07
-6.147901302157855706e-07
-6.090976290100838180e-07
-6.034051278043821713e-07
-5.977126265986804188e-07
-5.920201253929786662e-07
-5.920201253929786662e-07
-5.863276241872770195e-07
-5.806351229815752670e-07
-5.749426217758736203e-07
-5.692501205701718678e-07
-5.692501205701718678e-07
-5.635576193644701152e-07
-5.578651181587683626e-07
-5.521726169530667160e-07
-5.521726169530667160e-07
-5.464801157473649634e-07
-5.407876145416632108e-07
-5.350951133359615642e-07
-5.350951133359615642e-07
-5.294026121302598116e-07
-5.237101109245580590e-07
-5.180176097188564124e-07
-5.180176097188564124e-07
-5.123251085131546598e-07
-5.066326073074529072e-07
-5.066326073074529072e-07
-5.009401061017512606e-07
-4.952476048960495080e-07
-4.952476048960495080e-07
-4.895551036903477554e-07
-4.838626024846461088e-07
-4.781701012789443562e-07
-4.781701012789443562e-07
-4.724776000732426036e-07
-4.724776000732426036e-07
-4.667850988675409040e-07
-4.610925976618392044e-07
-4.610925976618392044e-07
-4.554000964561374518e-07
-4.497075952504357522e-07
-4.497075952504357522e-07
-4.440150940447340526e-07
-4.440150940447340526e-07
-4.383225928390323530e-07
-4.326300916333306004e-07
-4.326300916333306004e-07
-4.269375904276289008e-07
-4.269375904276289008e-07
-4.212450892219271483e-07
-4.155525880162254486e-07
-4.155525880162254486e-07
-4.098600868105237490e-07
-4.098600868105237490e-07
-4.041675856048219965e-07
-4.041675856048219965e-07
-3.984750843991202968e-07
-3.927825831934185443e-07
-3.927825831934185443e-07
-3.870900819877168447e-07
-3.870900819877168447e-07
-3.813975807820151450e-07
-3.813975807820151450e-07
-3.757050795763134454e-07
-3.757050795763134454e-07
-3.700125783706116929e-07
-3.700125783706116929e-07
-3.643200771649099932e-07
-3.643200771649099932e-07
-3.586275759592082407e-07
-3.586275759592082407e-07
-3.529350747535065411e-07
-3.529350747535065411e-07
-3.472425735478048414e-07
-3.472425735478048414e-07
-3.415500723421030889e-07
-3.415500723421030889e-07
-3.358575711364013893e-07
-3.358575711364013893e-07
-3.301650699306996367e-07
-3.301650699306996367e-07
-3.301650699306996367e-07
-3.244725687249979900e-07
-3.244725687249979900e-07
-3.187800675192962375e-07
-3.187800675192962375e-07
-3.130875663135945379e-07
-3.130875663135945379e-07
-3.073950651078927853e-07
-3.073950651078927853e-07
-3.073950651078927853e-07
-3.017025639021910857e-07
-3.017025639021910857e-07
-2.960100626964893331e-07
-2.960100626964893331e-07
-2.960100626964893331e-07
-2.903175614907876335e-07
-2.903175614907876335e-07
-2.846250602850859339e-07
-2.846250602850859339e-07
-2.846250602850859339e-07
-2.789325590793841813e-07
-2.789325590793841813e-07
-2.732400578736824817e-07
-2.732400578736824817e-07
-2.732400578736824817e-07
-2.675475566679807821e-07
-2.675475566679807821e-07
-2.675475566679807821e-07
-2.618550554622790295e-07
-2.618550554622790295e-07
-2.561625542565773299e-07
-2.561625542565773299e-07
-2.561625542565773299e-07
-2.504700530508756303e-07
-2.504700530508756303e-07
-2.504700530508756303e-07
-2.447775518451738777e-07
-2.447775518451738777e-07
-2.447775518451738777e-07
-2.390850506394721781e-07
-2.390850506394721781e-07
-2.390850506394721781e-07
-2.333925494337704520e-07
-2.333925494337704520e-07
-2.333925494337704520e-07
-2.277000482280687259e-07
-2.277000482280687259e-07
-2.277000482280687259e-07
-2.220075470223670263e-07
-2.220075470223670263e-07
-2.220075470223670263e-07
-2.220075470223670263e-07
-2.163150458166653002e-07
-2.163150458166653002e-07
-2.163150458166653002e-07
-2.106225446109635741e-07
-2.106225446109635741e-07
-2.106225446109635741e-07
-2.049300434052618745e-07
-2.049300434052618745e-07
-2.049300434052618745e-07
-2.049300434052618745e-07
-1.992375421995601484e-07
-1.992375421995601484e-07
-1.992375421995601484e-07
-1.992375421995601484e-07
-1.935450409938584223e-07
-1.935450409938584223e-07
-1.935450409938584223e-07
-1.878525397881567227e-07
-1.878525397881567227e-07
-1.878525397881567227e-07
-1.878525397881567227e-07
-1.821600385824549966e-07
-1.821600385824549966e-07
-1.821600385824549966e-07
-1.821600385824549966e-07
-1.764675373767532705e-07
-1.764675373767532705e-07
-1.764675373767532705e-07
-1.764675373767532705e-07
-1.707750361710515444e-07
-1.707750361710515444e-07
-1.707750361710515444e-07
-1.707750361710515444e-07
-1.650825349653498184e-07
-1.650825349653498184e-07
-1.650825349653498184e-07
-1.650825349653498184e-07
-1.650825349653498184e-07
-1.593900337596481187e-07
-1.593900337596481187e-07
-1.593900337596481187e-07
-1.593900337596481187e-07
-1.536975325539463926e-07
-1.536975325539463926e-07
-1.536975325539463926e-07
-1.536975325539463926e-07
-1.536975325539463926e-07
-1.480050313482446666e-07
-1.480050313482446666e-07
-1.480050313482446666e-07
-1.480050313482446666e-07
-1.480050313482446666e-07
-1.423125301425429669e-07
-1.423125301425429669e-07
-1.423125301425429669e-07
-1.423125301425429669e-07
-1.423125301425429669e-07
-1.366200289368412408e-07
-1.366200289368412408e-07
-1.366200289368412408e-07
-1.366200289368412408e-07
-1.366200289368412408e-07
-1.309275277311395148e-07
-1.309275277311395148e-07
-1.309275277311395148e-07
-1.309275277311395148e-07
-1.309275277311395148e-07
-1.309275277311395148e-07
-1.252350265254378151e-07
-1.252350265254378151e-07
-1.252350265254378151e-07
-1.252350265254378151e-07
-1.252350265254378151e-07
-1.252350265254378151e-07
-1.195425253197360891e-07
-1.195425253197360891e-07
-1.195425253197360891e-07
-1.195425253197360891e-07
-1.195425253197360891e-07
-1.195425253197360891e-07
-1.138500241140343630e-07
-1.138500241140343630e-07
-1.138500241140343630e-07
-1.138500241140343630e-07
-1.138500241140343630e-07
-1.138500241140343630e-07
-1.081575229083326501e-07
-1.081575229083326501e-07
-1.081575229083326501e-07
-1.081575229083326501e-07
-1.081575229083326501e-07
-1.081575229083326501e-07
-1.081575229083326501e-07
-1.024650217026309373e-07
-1.024650217026309373e-07
-1.024650217026309373e-07
-1.024650217026309373e-07
-1.024650217026309373e-07
-1.024650217026309373e-07
-1.024650217026309373e-07
-9.677252049692921117e-08
-9.677252049692921117e-08
-9.677252049692921117e-08
-9.677252049692921117e-08
-9.677252049692921117e-08
-9.677252049692921117e-08
-9.677252049692921117e-08
-9.108001929122749831e-08
-9.108001929122749831e-08
-9.108001929122749831e-08
-9.108001929122749831e-08
-9.108001929122749831e-08
-9.108001929122749831e-08
-9.108001929122749831e-08
-9.108001929122749831e-08
-8.538751808552577222e-08
-8.538751808552577222e-08
-8.538751808552577222e-08
-8.538751808552577222e-08
-8.538751808552577222e-08
-8.538751808552577222e-08
-8.538751808552577222e-08
-8.538751808552577222e-08
-8.538751808552577222e-08
-7.969501687982405937e-08
-7.969501687982405937e-08
-7.969501687982405937e-08
-7.969501687982405937e-08
-7.969501687982405937e-08
-7.969501687982405937e-08
-7.969501687982405937e-08
-7.969501687982405937e-08
-7.969501687982405937e-08
-7.400251567412233328e-08
-7.400251567412233328e-08
-7.400251567412233328e-08
-7.400251567412233328e-08
-7.400251567412233328e-08
-7.400251567412233328e-08
-7.400251567412233328e-08
-7.400251567412233328e-08
-7.400251567412233328e-08
-7.400251567412233328e-08
-6.831001446842062042e-08
-6.831001446842062042e-08
-6.831001446842062042e-08
-6.831001446842062042e-08
-6.831001446842062042e-08
-6.831001446842062042e-08
-6.831001446842062042e-08
