-7.898280297857075198e-07
2.124326255748182780e-03
4.655384627462171715e-02
2.761247827284810108e-01
5.983545680194753968e-01
3.261248401705195699e-01
-3.049251797104092776e-01
-4.467844748626099982e-02
2.182532692238697281e-01
-1.746359676627171897e-01
4.136594463061382676e-02
7.143493108283723025e-02
-1.181297915785041036e-01
1.045009977801763523e-01
-5.647708408511598749e-02
3.201322593363477211e-03
3.667716044951937343e-02
-5.586363303134537356e-02
5.539072349851118654e-02
-4.132486758951928879e-02
2.132730145656016457e-02
-1.943413752107494511e-03
-1.267764937700399490e-02
2.085448766045685381e-02
-2.282322976142861504e-02
2.001512185598481458e-02
-1.436937126361977762e-02
7.781583206456235691e-03
-1.738243954279296635e-03
-2.845481131762295484e-03
5.617909154315092746e-03
-6.668835183401778700e-03
6.363847876536572225e-03
-5.182779728905649586e-03
3.595638253688311636e-03
-1.984502760293392013e-03
6.085445463128469909e-04
3.979596396440728727e-04
-1.005217723635677945e-03
1.257489993058369133e-03
-1.240071891583322070e-03
1.051494465926304306e-03
-7.818818811224087636e-04
5.021690712103447050e-04
-2.585789265696162567e-04
7.396260815288733701e-05
4.628870938198661843e-05
-1.096963429550104071e-04
1.295377804305362121e-04
-1.210710632930606323e-04
9.762753131805760362e-05
-6.962453753474614853e-05
4.367389991974150937e-05
-2.321017369347544838e-05
9.172775527738558023e-06
-8.077786668262916806e-07
-2.902019654894455626e-06
3.907255329167174557e-06
-3.530291951314904852e-06
2.435303091839264482e-06
-1.304412958282456214e-06
5.325355655373330668e-07
-2.154076444870111201e-07
-1.795063704058426001e-08
-0.000000000000000000e+00
-0.000000000000000000e+00
