{
    "title": "Resident's dashboard",
    "alternative-login": "Alternative log in",
    "normal-login": "UMA's log in",
    "login": "Log in",
    "keep-session": "Remember me",
    "login-as-anonymous": "Login as guest",
    "placeholder": {
        "username": "Username",
        "password": "Password"
    },
    "welcome": {
        "title": "Welcome <1>{{name}}</1>",
        "subtitle": "You can find a list of useful links below",
        "escritorio": "Desktop",
        "cv": "Campus Virtual",
        "correo": "Your email"
    }
}
