{
    "alt-speed-down": 2048,
    "alt-speed-enabled": true,
    "alt-speed-time-begin": 540,
    "alt-speed-time-day": 127,
    "alt-speed-time-enabled": true,
    "alt-speed-time-end": 30,
    "alt-speed-up": 2048,
    "bind-address-ipv4": "0.0.0.0",
    "bind-address-ipv6": "::",
    "blocklist-enabled": false,
    "blocklist-url": "http://www.example.com/blocklist",
    "cache-size-mb": 4,
    "dht-enabled": true,
    "download-dir": "/downloads",
    "download-limit": 100,
    "download-limit-enabled": 0,
    "download-queue-enabled": true,
    "download-queue-size": 5,
    "encryption": 1,
    "idle-seeding-limit": 30,
    "idle-seeding-limit-enabled": false,
    "incomplete-dir-enabled": false,
    "lpd-enabled": true,
    "max-peers-global": 200,
    "message-level": 1,
    "peer-congestion-algorithm": "",
    "peer-id-ttl-hours": 6,
    "peer-limit-global": 200,
    "peer-limit-per-torrent": 100,
    "peer-port": 9091,
    "peer-port-random-high": 65535,
    "peer-port-random-low": 49152,
    "peer-port-random-on-start": false,
    "peer-socket-tos": "default",
    "pex-enabled": true,
    "port-forwarding-enabled": false,
    "preallocation": 1,
    "prefetch-enabled": true,
    "queue-stalled-enabled": true,
    "queue-stalled-minutes": 30,
    "ratio-limit": 8,
    "ratio-limit-enabled": true,
    "rename-partial-files": true,
    "rpc-authentication-required": true,
    "rpc-bind-address": "0.0.0.0",
    "rpc-enabled": true,
    "rpc-host-whitelist": "",
    "rpc-host-whitelist-enabled": true,
    "rpc-password": "{1b78e782ebd635a2f0ddb3976969ed31d9d17ed76F13kGAH",
    "rpc-port": 9091,
    "rpc-url": "/transmission/",
    "rpc-username": "admin",
    "rpc-whitelist": "*.*.*.*,*:*:*:*:*:*:*:*",
    "rpc-whitelist-enabled": true,
    "scrape-paused-torrents-enabled": true,
    "script-torrent-done-enabled": false,
    "script-torrent-done-filename": "/usr/local/bin/autoremove.sh",
    "seed-queue-enabled": false,
    "seed-queue-size": 10,
    "speed-limit-down": 92160,
    "speed-limit-down-enabled": true,
    "speed-limit-up": 92160,
    "speed-limit-up-enabled": true,
    "start-added-torrents": true,
    "trash-original-torrent-files": false,
    "umask": 18,
    "upload-limit": 100,
    "upload-limit-enabled": 0,
    "upload-slots-per-torrent": 14,
    "utp-enabled": true
}