timeStamp,elapsed,label,responseCode,responseMessage,threadName,dataType,success,failureMessage,bytes,sentBytes,grpThreads,allThreads,URL,Latency,IdleTime,Connect
1674312115581,15173,https://opensource-demo.orangehrmlive.com/web/index.php/auth/validate,200,OK,Thread Group 1-1,text,true,,4313117,4600,1,1,https://opensource-demo.orangehrmlive.com/web/index.php/auth/login,1225,0,859
1674312115581,1225,https://opensource-demo.orangehrmlive.com/web/index.php/auth/validate-0,302,Found,Thread Group 1-1,text,true,,1761,772,1,1,https://opensource-demo.orangehrmlive.com/web/index.php/auth/validate,1225,0,859
1674312116806,439,https://opensource-demo.orangehrmlive.com/web/index.php/auth/validate-1,200,OK,Thread Group 1-1,text,true,,4467,627,1,1,https://opensource-demo.orangehrmlive.com/web/index.php/auth/login,439,0,0
1674312117247,252,https://opensource-demo.orangehrmlive.com/web/index.php/auth/validate-2,200,OK,Thread Group 1-1,bin,true,,1674,637,1,1,https://opensource-demo.orangehrmlive.com/web/dist/favicon.ico?1672659722816,252,0,0
1674312117247,3549,https://opensource-demo.orangehrmlive.com/web/index.php/auth/validate-3,200,OK,Thread Group 1-1,text,true,,562823,647,1,1,https://opensource-demo.orangehrmlive.com/web/dist/css/chunk-vendors.css?1672659722816,1142,0,694
1674312117248,5119,https://opensource-demo.orangehrmlive.com/web/index.php/auth/validate-4,200,OK,Thread Group 1-1,text,true,,666549,637,1,1,https://opensource-demo.orangehrmlive.com/web/dist/css/app.css?1672659722816,1083,0,641
1674312117248,7590,https://opensource-demo.orangehrmlive.com/web/index.php/auth/validate-5,200,OK,Thread Group 1-1,text,true,,1569995,645,1,1,https://opensource-demo.orangehrmlive.com/web/dist/js/chunk-vendors.js?1672659722816,1154,0,701
1674312117248,13506,https://opensource-demo.orangehrmlive.com/web/index.php/auth/validate-6,200,OK,Thread Group 1-1,text,true,,1505848,635,1,1,https://opensource-demo.orangehrmlive.com/web/dist/js/app.js?1672659722816,4649,0,2436
1674312130756,335,https://opensource-demo.orangehrmlive.com/web/index.php/core/i18n/messages,304,Not Modified,Thread Group 1-1,,true,,1052,531,1,1,https://opensource-demo.orangehrmlive.com/web/index.php/core/i18n/messages,0,0,0
1674312131092,383,https://opensource-demo.orangehrmlive.com/web/index.php/api/v2/dashboard/employees/time-at-work?timezoneOffset=5.5&currentDate=2023-01-20&currentTime=16:42,401,Unauthorized,Thread Group 1-1,text,false,,328,599,1,1,https://opensource-demo.orangehrmlive.com/web/index.php/api/v2/dashboard/employees/time-at-work?currentTime=16%3A42&timezoneOffset=5.5&currentDate=2023-01-20,383,0,0
1674312131475,343,https://opensource-demo.orangehrmlive.com/web/index.php/api/v2/dashboard/employees/action-summary,401,Unauthorized,Thread Group 1-1,text,false,,328,539,1,1,https://opensource-demo.orangehrmlive.com/web/index.php/api/v2/dashboard/employees/action-summary,343,0,0
1674312131819,346,https://opensource-demo.orangehrmlive.com/web/index.php/api/v2/dashboard/shortcuts,401,Unauthorized,Thread Group 1-1,text,false,,328,524,1,1,https://opensource-demo.orangehrmlive.com/web/index.php/api/v2/dashboard/shortcuts,346,0,0
1674312132166,340,https://opensource-demo.orangehrmlive.com/web/index.php/api/v2/buzz/feed?limit=5&offset=0&sortOrder=DESC&sortField=share.createdAtUtc,401,Unauthorized,Thread Group 1-1,text,false,,328,513,1,1,https://opensource-demo.orangehrmlive.com/web/index.php/api/v2/buzz/feed?offset=0&sortOrder=DESC&limit=5&sortField=share.createdAtUtc,340,0,0
1674312132507,562,https://opensource-demo.orangehrmlive.com/web/index.php/api/v2/dashboard/employees/leaves?date=2023-01-20,401,Unauthorized,Thread Group 1-1,text,false,,328,547,1,1,https://opensource-demo.orangehrmlive.com/web/index.php/api/v2/dashboard/employees/leaves?date=2023-01-20,562,0,0
1674312133070,330,https://opensource-demo.orangehrmlive.com/web/index.php/api/v2/dashboard/employees/subunit,401,Unauthorized,Thread Group 1-1,text,false,,328,532,1,1,https://opensource-demo.orangehrmlive.com/web/index.php/api/v2/dashboard/employees/subunit,330,0,0
1674312133401,325,https://opensource-demo.orangehrmlive.com/web/index.php/api/v2/dashboard/employees/locations,401,Unauthorized,Thread Group 1-1,text,false,,328,534,1,1,https://opensource-demo.orangehrmlive.com/web/index.php/api/v2/dashboard/employees/locations,325,0,0
1674312133727,1008,https://opensource-demo.orangehrmlive.com/web/index.php/events/push,200,OK,Thread Group 1-1,text,true,,10945,3594,1,1,https://opensource-demo.orangehrmlive.com/web/index.php/auth/login,383,0,0
1674312133727,383,https://opensource-demo.orangehrmlive.com/web/index.php/events/push-0,302,Found,Thread Group 1-1,text,true,,1659,514,1,1,https://opensource-demo.orangehrmlive.com/web/index.php/events/push,383,0,0
1674312134110,377,https://opensource-demo.orangehrmlive.com/web/index.php/events/push-1,200,OK,Thread Group 1-1,text,true,,4321,429,1,1,https://opensource-demo.orangehrmlive.com/web/index.php/auth/login,377,0,0
1674312134488,224,https://opensource-demo.orangehrmlive.com/web/index.php/events/push-2,304,Not Modified,Thread Group 1-1,,true,,991,525,1,1,https://opensource-demo.orangehrmlive.com/web/dist/favicon.ico?1672659722816,0,0,0
1674312134488,224,https://opensource-demo.orangehrmlive.com/web/index.php/events/push-3,304,Not Modified,Thread Group 1-1,,true,,993,537,1,1,https://opensource-demo.orangehrmlive.com/web/dist/css/chunk-vendors.css?1672659722816,0,0,0
1674312134488,247,https://opensource-demo.orangehrmlive.com/web/index.php/events/push-4,304,Not Modified,Thread Group 1-1,,true,,993,527,1,1,https://opensource-demo.orangehrmlive.com/web/dist/css/app.css?1672659722816,0,0,0
1674312134488,226,https://opensource-demo.orangehrmlive.com/web/index.php/events/push-5,304,Not Modified,Thread Group 1-1,,true,,994,536,1,1,https://opensource-demo.orangehrmlive.com/web/dist/js/chunk-vendors.js?1672659722816,0,0,0
1674312134488,228,https://opensource-demo.orangehrmlive.com/web/index.php/events/push-6,304,Not Modified,Thread Group 1-1,,true,,994,526,1,1,https://opensource-demo.orangehrmlive.com/web/dist/js/app.js?1672659722816,0,0,0
1674312209338,2226,https://opensource-demo.orangehrmlive.com/web/index.php/auth/logout,200,OK,Thread Group 1-1,text,true,,10940,4553,1,1,https://opensource-demo.orangehrmlive.com/web/index.php/auth/login,931,0,564
1674312209338,931,https://opensource-demo.orangehrmlive.com/web/index.php/auth/logout-0,302,Found,Thread Group 1-1,text,true,,1659,579,1,1,https://opensource-demo.orangehrmlive.com/web/index.php/auth/logout,931,0,564
1674312210269,399,https://opensource-demo.orangehrmlive.com/web/index.php/auth/logout-1,200,OK,Thread Group 1-1,text,true,,4316,578,1,1,https://opensource-demo.orangehrmlive.com/web/index.php/auth/login,399,0,0
1674312210670,224,https://opensource-demo.orangehrmlive.com/web/index.php/auth/logout-2,304,Not Modified,Thread Group 1-1,,true,,991,674,1,1,https://opensource-demo.orangehrmlive.com/web/dist/favicon.ico?1672659722816,0,0,0
1674312210670,894,https://opensource-demo.orangehrmlive.com/web/index.php/auth/logout-3,304,Not Modified,Thread Group 1-1,,true,,993,686,1,1,https://opensource-demo.orangehrmlive.com/web/dist/css/chunk-vendors.css?1672659722816,0,0,657
1674312210671,848,https://opensource-demo.orangehrmlive.com/web/index.php/auth/logout-4,304,Not Modified,Thread Group 1-1,,true,,993,676,1,1,https://opensource-demo.orangehrmlive.com/web/dist/css/app.css?1672659722816,0,0,627
1674312210671,891,https://opensource-demo.orangehrmlive.com/web/index.php/auth/logout-5,304,Not Modified,Thread Group 1-1,,true,,994,685,1,1,https://opensource-demo.orangehrmlive.com/web/dist/js/chunk-vendors.js?1672659722816,0,0,651
1674312210672,847,https://opensource-demo.orangehrmlive.com/web/index.php/auth/logout-6,304,Not Modified,Thread Group 1-1,,true,,994,675,1,1,https://opensource-demo.orangehrmlive.com/web/dist/js/app.js?1672659722816,0,0,646
1674312115581,21371,Test,,"Number of samples in transaction : 11, number of failing samples : 7",Thread Group 1-1,,false,,4338350,17066,1,1,null,5168,74616,1423
