cue,test,cond,corr
88,94,main_6up,right
66,72,main_6up,right
43,49,main_6up,right
117,123,main_6up,right
149,143,main_6down,left
30,24,main_6down,left
24,18,main_6down,left
142,136,main_6down,left
94,91,main_3down,left
13,10,main_3down,left
111,108,main_3down,left
15,12,main_3down,left
165,168,main_3up,right
9,12,main_3up,right
131,134,main_3up,right
52,55,main_3up,right
140,130,main_10down,left
85,75,main_10down,left
107,97,main_10down,left
8,178,main_10down,left
161,171,main_10up,right
57,67,main_10up,right
99,109,main_10up,right
120,130,main_10up,right