{
    "kind": "supp",
    "identity": {
        "name": "Organic Lion's Mane Mushroom 1 g Unflavored",
        "FDC ID": "",
        "UPC": "8 10014 67049 2",
        "DSLD ID": "270619"
    },
    "brand": {
        "name": "Nutricost"
    },
    "measures": {
        "form": {
            "unit": "gram",
            "amount per package": "113",
            "serving size amount": "1",
            "amount is an estimate": "?"
        }
    },
    "statements": [
        {
            "type": "Suggested/Recommended/Usage/Directions",
            "notes": "Recommended Use: As a dietary supplement, mix 1 scoop daily with 6-10 oz of water or as directed by your healthcare professional."
        },
        {
            "type": "Precautions re: All Other",
            "notes": "Warning: For healthy individuals 18 years and older."
        },
        {
            "type": "Precautions re: Pregnant or Nursing or Prescription Medications",
            "notes": "Consult a healthcare professional prior to use if you are pregnant or nursing, taking medication, or have a medical condition."
        },
        {
            "type": "Precautions re: Children",
            "notes": "Keep out of reach of children."
        },
        {
            "type": "Precautions re: All Other",
            "notes": "Do not use if safety seal is broken or missing."
        },
        {
            "type": "Storage",
            "notes": "Notice: Store in a cool, dry place."
        },
        {
            "type": "General Statements: All Other Content",
            "notes": "Contents are sold by weight, not volume. Some settling may occur."
        },
        {
            "type": "FDA Disclaimer Statement",
            "notes": "These statements have not been evaluated by the Food and Drug Administration. This product is not intended to diagnose, treat, cure, or prevent any disease."
        },
        {
            "type": "Seals/Symbols",
            "notes": "CCOF Certified Organic\nUSDA Organic"
        },
        {
            "type": "Formulation re: Organic",
            "notes": "CCOF Certified Organic\nUSDA Organic"
        },
        {
            "type": "FDA Statement of Identity",
            "notes": "Dietary Supplement"
        },
        {
            "type": "Seals/Symbols",
            "notes": "Quality Guaranteed Nutricost"
        },
        {
            "type": "Formulation re: Vegetarian/Vegan",
            "notes": "Vegetarian"
        },
        {
            "type": "Formulation re: Does NOT Contain",
            "notes": "Gluten-Free Product\nNon-GMO"
        },
        {
            "type": "Formula re: Contains",
            "notes": "Organic lion's mane mushroom 1 g per serving"
        }
    ],
    "measured ingredients": [
        {
            "name": "Total Carbohydrates",
            "alternate names": [],
            "measures": {
                "mass + mass equivalents": {
                    "is equivalent": "no",
                    "listed operator": "<",
                    "per form": {
                        "listed": [
                            "1.000",
                            "Gram(s)"
                        ],
                        "grams": {
                            "decimal string": "0.000",
                            "fraction string": "0"
                        }
                    },
                    "per package": {
                        "is equivalent": "no",
                        "listed operator": "<",
                        "listed": [
                            "113.000",
                            "Gram(s)"
                        ],
                        "grams": {
                            "decimal string": "0.000",
                            "fraction string": "0"
                        }
                    }
                }
            },
            "listed measure": {
                "amount": {
                    "fraction string": "1",
                    "decimal string": "1.000"
                },
                "unit kind": "mass",
                "unit": "Gram(s)",
                "operator": "<"
            },
            "unites": []
        },
        {
            "name": "Lions Mane",
            "alternate names": [],
            "measures": {
                "mass + mass equivalents": {
                    "is equivalent": "no",
                    "listed operator": "=",
                    "per form": {
                        "listed": [
                            "1.000",
                            "Gram(s)"
                        ],
                        "grams": {
                            "decimal string": "1.000",
                            "fraction string": "1"
                        }
                    },
                    "per package": {
                        "is equivalent": "no",
                        "listed operator": "=",
                        "listed": [
                            "113.000",
                            "Gram(s)"
                        ],
                        "grams": {
                            "decimal string": "113.000",
                            "fraction string": "113"
                        }
                    }
                }
            },
            "listed measure": {
                "amount": {
                    "fraction string": "1",
                    "decimal string": "1.000"
                },
                "unit kind": "mass",
                "unit": "Gram(s)",
                "operator": "="
            },
            "unites": []
        }
    ],
    "unmeasured ingredients": {
        "list": [
            {
                "order": 1,
                "ingredientId": 5923,
                "name": "None",
                "category": "other",
                "ingredientGroup": "None",
                "uniiCode": null,
                "alternateNames": [],
                "forms": []
            }
        ]
    },
    "essential nutrients": {
        "natures": [
            {
                "amount": "1",
                "identity": {
                    "name": "Organic Lion's Mane Mushroom 1 g Unflavored",
                    "FDC ID": "",
                    "UPC": "8 10014 67049 2",
                    "DSLD ID": "270619"
                }
            }
        ],
        "measures": {
            "mass + mass equivalents": {
                "per recipe": {
                    "grams": {
                        "fraction string": "0",
                        "scinote string": "0.0000e+0"
                    }
                }
            },
            "energy": {
                "per recipe": {
                    "food calories": {
                        "fraction string": "0"
                    }
                }
            }
        },
        "grove": [
            {
                "info": {
                    "includes": [],
                    "names": [
                        "protein"
                    ],
                    "region": 1
                },
                "measures": {},
                "natures": [],
                "unites": []
            },
            {
                "info": {
                    "accepts": [
                        "carbohydrate, by difference",
                        "total carbohydrates"
                    ],
                    "includes": [
                        6,
                        7
                    ],
                    "names": [
                        "carbohydrates"
                    ],
                    "region": 2
                },
                "measures": {
                    "mass + mass equivalents": {
                        "per recipe": {
                            "grams": {
                                "fraction string": "0",
                                "scinote string": "0.0000e+0"
                            }
                        },
                        "portion of grove": {
                            "fraction string": "0",
                            "scinote percentage string": "0.0000e+0"
                        }
                    }
                },
                "natures": [
                    {
                        "amount": "1",
                        "source": {
                            "name": "Organic Lion's Mane Mushroom 1 g Unflavored",
                            "FDC ID": "",
                            "UPC": "8 10014 67049 2",
                            "DSLD ID": "270619"
                        },
                        "ingredient": {
                            "name": "Total Carbohydrates"
                        },
                        "measures": {
                            "mass + mass equivalents": {
                                "is equivalent": "no",
                                "listed operator": "<",
                                "per form": {
                                    "listed": [
                                        "1.000",
                                        "Gram(s)"
                                    ],
                                    "grams": {
                                        "decimal string": "0.000",
                                        "fraction string": "0"
                                    }
                                },
                                "per package": {
                                    "is equivalent": "no",
                                    "listed operator": "<",
                                    "listed": [
                                        "113.000",
                                        "Gram(s)"
                                    ],
                                    "grams": {
                                        "decimal string": "0.000",
                                        "fraction string": "0"
                                    }
                                }
                            }
                        }
                    }
                ],
                "unites": [
                    {
                        "info": {
                            "includes": [],
                            "names": [
                                "dietary fiber",
                                "fiber, total dietary"
                            ],
                            "region": 6
                        },
                        "measures": {},
                        "natures": [],
                        "unites": []
                    },
                    {
                        "info": {
                            "accepts": [
                                "sugars, total including nlea"
                            ],
                            "includes": [
                                8
                            ],
                            "names": [
                                "sugars, total",
                                "total sugar",
                                "sugar",
                                "total sugars"
                            ],
                            "region": 7
                        },
                        "measures": {},
                        "natures": [],
                        "unites": [
                            {
                                "info": {
                                    "includes": [],
                                    "names": [
                                        "added sugars",
                                        "sugars, added"
                                    ],
                                    "region": 8
                                },
                                "measures": {},
                                "natures": [],
                                "unites": []
                            }
                        ]
                    }
                ]
            },
            {
                "info": {
                    "includes": [
                        4,
                        15,
                        51
                    ],
                    "names": [
                        "fats",
                        "total fat",
                        "lipids",
                        "total lipid (fat)"
                    ],
                    "region": 3
                },
                "measures": {},
                "natures": [],
                "unites": [
                    {
                        "info": {
                            "includes": [],
                            "names": [
                                "saturated fat",
                                "fatty acids, total saturated"
                            ],
                            "region": 4
                        },
                        "measures": {},
                        "natures": [],
                        "unites": []
                    },
                    {
                        "info": {
                            "includes": [],
                            "names": [
                                "polyunsaturated fat",
                                "fatty acids, total polyunsaturated"
                            ],
                            "region": 15
                        },
                        "measures": {},
                        "natures": [],
                        "unites": []
                    },
                    {
                        "info": {
                            "includes": [],
                            "names": [
                                "monounsaturated fat",
                                "fatty acids, total monounsaturated"
                            ],
                            "region": 51
                        },
                        "measures": {},
                        "natures": [],
                        "unites": []
                    }
                ]
            },
            {
                "info": {
                    "includes": [],
                    "names": [
                        "calcium",
                        "calcium, ca"
                    ],
                    "region": 9
                },
                "measures": {},
                "natures": [],
                "unites": []
            },
            {
                "info": {
                    "includes": [],
                    "names": [
                        "cholesterol"
                    ],
                    "region": 12
                },
                "measures": {},
                "natures": [],
                "unites": []
            },
            {
                "info": {
                    "includes": [],
                    "names": [
                        "vitamin a",
                        "vitamin a, iu"
                    ],
                    "region": 16
                },
                "measures": {},
                "natures": [],
                "unites": []
            },
            {
                "info": {
                    "includes": [],
                    "names": [
                        "vitamin e"
                    ],
                    "region": 19
                },
                "measures": {},
                "natures": [],
                "unites": []
            },
            {
                "info": {
                    "includes": [],
                    "names": [
                        "iodine"
                    ],
                    "region": 29
                },
                "measures": {},
                "natures": [],
                "unites": []
            },
            {
                "info": {
                    "includes": [],
                    "names": [
                        "magnesium"
                    ],
                    "region": 30
                },
                "measures": {},
                "natures": [],
                "unites": []
            },
            {
                "info": {
                    "accepts": [],
                    "includes": [],
                    "names": [
                        "Zinc, Zn",
                        "Zinc"
                    ],
                    "region": 31
                },
                "measures": {},
                "natures": [],
                "unites": []
            },
            {
                "info": {
                    "includes": [],
                    "names": [
                        "selenium"
                    ],
                    "region": 32
                },
                "measures": {},
                "natures": [],
                "unites": []
            },
            {
                "info": {
                    "includes": [],
                    "names": [
                        "copper"
                    ],
                    "region": 33
                },
                "measures": {},
                "natures": [],
                "unites": []
            },
            {
                "info": {
                    "includes": [],
                    "names": [
                        "manganese"
                    ],
                    "region": 34
                },
                "measures": {},
                "natures": [],
                "unites": []
            },
            {
                "info": {
                    "includes": [],
                    "names": [
                        "chromium"
                    ],
                    "region": 35
                },
                "measures": {},
                "natures": [],
                "unites": []
            },
            {
                "info": {
                    "includes": [],
                    "names": [
                        "molybdenum"
                    ],
                    "region": 36
                },
                "measures": {},
                "natures": [],
                "unites": []
            },
            {
                "info": {
                    "includes": [],
                    "names": [
                        "choline"
                    ],
                    "region": 37
                },
                "measures": {},
                "natures": [],
                "unites": []
            },
            {
                "info": {
                    "includes": [],
                    "names": [
                        "lutein"
                    ],
                    "region": 40
                },
                "measures": {},
                "natures": [],
                "unites": []
            },
            {
                "info": {
                    "includes": [],
                    "names": [
                        "betaine hydrochloride"
                    ],
                    "region": 43
                },
                "measures": {},
                "natures": [],
                "unites": []
            },
            {
                "info": {
                    "includes": [],
                    "names": [
                        "rutin"
                    ],
                    "region": 44
                },
                "measures": {},
                "natures": [],
                "unites": []
            },
            {
                "info": {
                    "includes": [],
                    "names": [
                        "strontium"
                    ],
                    "region": 47
                },
                "measures": {},
                "natures": [],
                "unites": []
            },
            {
                "info": {
                    "includes": [],
                    "names": [
                        "vanadium"
                    ],
                    "region": 49
                },
                "measures": {},
                "natures": [],
                "unites": []
            },
            {
                "info": {
                    "accepts": [],
                    "includes": [],
                    "names": [
                        "Phosphorus, P",
                        "Phosphorus"
                    ],
                    "region": 57
                },
                "measures": {},
                "natures": [],
                "unites": []
            },
            {
                "info": {
                    "includes": [],
                    "names": [
                        "potassium",
                        "potassium K",
                        "potassium, K",
                        "K"
                    ],
                    "region": 58
                },
                "measures": {},
                "natures": [],
                "unites": []
            },
            {
                "info": {
                    "includes": [],
                    "names": [
                        "sodium Na",
                        "sodium, Na",
                        "sodium",
                        "Na"
                    ],
                    "region": 59
                },
                "measures": {},
                "natures": [],
                "unites": []
            },
            {
                "info": {
                    "includes": [],
                    "names": [
                        "vitamin d",
                        "vitamin d (d2 + d3)",
                        "vitamin d2",
                        "vitamin d3",
                        "vitamin d (d2 + d3), international units"
                    ],
                    "region": 63
                },
                "measures": {},
                "natures": [],
                "unites": []
            },
            {
                "info": {
                    "includes": [],
                    "names": [
                        "vitamin c",
                        "vitamin c (form: as calcium ascorbate)",
                        "vitamin c, total ascorbic acid"
                    ],
                    "region": 64
                },
                "measures": {},
                "natures": [],
                "unites": []
            },
            {
                "info": {
                    "includes": [],
                    "names": [
                        "vitamin k",
                        "vitamin k1",
                        "vitamin k2"
                    ],
                    "region": 65
                },
                "measures": {},
                "natures": [],
                "unites": []
            },
            {
                "info": {
                    "includes": [],
                    "names": [
                        "thiamin",
                        "thiamine",
                        "vitamin b1"
                    ],
                    "region": 66
                },
                "measures": {},
                "natures": [],
                "unites": []
            },
            {
                "info": {
                    "includes": [],
                    "names": [
                        "riboflavin",
                        "vitamin b2"
                    ],
                    "region": 67
                },
                "measures": {},
                "natures": [],
                "unites": []
            },
            {
                "info": {
                    "includes": [],
                    "names": [
                        "vitamin b3",
                        "niacin",
                        "nicotinamide",
                        "nicotinamide riboside"
                    ],
                    "region": 68
                },
                "measures": {},
                "natures": [],
                "unites": []
            },
            {
                "info": {
                    "includes": [],
                    "names": [
                        "vitamin b5",
                        "pantothenic acid"
                    ],
                    "region": 69
                },
                "measures": {},
                "natures": [],
                "unites": []
            },
            {
                "info": {
                    "accepts": [
                        "pyridoxine",
                        "pyridoxal",
                        "pyridoxamine"
                    ],
                    "includes": [],
                    "names": [
                        "Vitamin B6",
                        "Vitamin B-6"
                    ],
                    "region": 70
                },
                "measures": {},
                "natures": [],
                "unites": []
            },
            {
                "info": {
                    "includes": [],
                    "names": [
                        "vitamin b7",
                        "biotin",
                        "vitamin h"
                    ],
                    "region": 71
                },
                "measures": {},
                "natures": [],
                "unites": []
            },
            {
                "info": {
                    "includes": [],
                    "names": [
                        "vitamin b9",
                        "folate",
                        "folacin"
                    ],
                    "region": 72
                },
                "measures": {},
                "natures": [],
                "unites": []
            },
            {
                "info": {
                    "accepts": [],
                    "includes": [],
                    "names": [
                        "Vitamin B12",
                        "Vitamin B-12",
                        "cobalamin"
                    ],
                    "region": 73
                },
                "measures": {},
                "natures": [],
                "unites": []
            },
            {
                "info": {
                    "includes": [],
                    "names": [
                        "calories",
                        "energy"
                    ],
                    "region": 74
                },
                "measures": {},
                "natures": [],
                "unites": []
            },
            {
                "info": {
                    "includes": [],
                    "names": [
                        "iron",
                        "iron, fe"
                    ],
                    "region": 75
                },
                "measures": {},
                "natures": [],
                "unites": []
            },
            {
                "info": {
                    "accepts": [],
                    "includes": [],
                    "names": [
                        "Folate, DFE"
                    ],
                    "region": 76
                },
                "measures": {},
                "natures": [],
                "unites": []
            },
            {
                "info": {
                    "accepts": [],
                    "includes": [],
                    "names": [
                        "Folate",
                        "Folate, Total"
                    ],
                    "region": 77
                },
                "measures": {},
                "natures": [],
                "unites": []
            }
        ]
    },
    "cautionary ingredients": {
        "natures": [
            {
                "amount": "1",
                "identity": {
                    "name": "Organic Lion's Mane Mushroom 1 g Unflavored",
                    "FDC ID": "",
                    "UPC": "8 10014 67049 2",
                    "DSLD ID": "270619"
                }
            }
        ],
        "measures": {
            "mass + mass equivalents": {
                "per recipe": {
                    "grams": {
                        "fraction string": "0"
                    }
                }
            },
            "energy": {
                "per recipe": {
                    "food calories": {
                        "fraction string": "0"
                    }
                }
            }
        },
        "grove": [
            {
                "info": {
                    "includes": [],
                    "names": [
                        "trans fat",
                        "fatty acids, total trans"
                    ],
                    "region": 1
                },
                "measures": {},
                "natures": [],
                "unites": []
            }
        ]
    }
}