{
    "essential nutrients": {
        "natures": [
            {
                "amount": "1",
                "identity": {
                    "name": "Vegan Multivitamin & Mineral Supplement with Greens",
                    "FDC ID": "",
                    "UPC": "8 95634 00002 7",
                    "DSLD ID": "276336"
                }
            }
        ],
        "measures": {
            "mass + mass equivalents": {
                "per recipe": {
                    "grams": {
                        "fraction string": "4092475024587098159793/90071992547409920000",
                        "scinote string": "4.5436e+1"
                    }
                }
            },
            "energy": {
                "per recipe": {
                    "food calories": {
                        "fraction string": "0",
                        "scinote string": "0.0000e+0"
                    }
                }
            }
        },
        "grove": [
            {
                "info": {
                    "includes": [],
                    "names": [
                        "protein"
                    ],
                    "region": 1
                },
                "measures": {},
                "natures": [],
                "unites": [],
                "goal": {}
            },
            {
                "info": {
                    "accepts": [
                        "carbohydrate, by difference",
                        "total carbohydrates"
                    ],
                    "includes": [
                        6,
                        7
                    ],
                    "names": [
                        "carbohydrates"
                    ],
                    "region": 2
                },
                "measures": {},
                "natures": [],
                "unites": [
                    {
                        "info": {
                            "includes": [],
                            "names": [
                                "dietary fiber",
                                "fiber, total dietary"
                            ],
                            "region": 6
                        },
                        "measures": {},
                        "natures": [],
                        "unites": [],
                        "goal": {}
                    },
                    {
                        "info": {
                            "accepts": [
                                "sugars, total including nlea"
                            ],
                            "includes": [
                                8
                            ],
                            "names": [
                                "sugars, total",
                                "total sugar",
                                "sugar",
                                "total sugars"
                            ],
                            "region": 7
                        },
                        "measures": {},
                        "natures": [],
                        "unites": [
                            {
                                "info": {
                                    "includes": [],
                                    "names": [
                                        "added sugars",
                                        "sugars, added"
                                    ],
                                    "region": 8
                                },
                                "measures": {},
                                "natures": [],
                                "unites": [],
                                "goal": {}
                            }
                        ],
                        "goal": {}
                    }
                ],
                "goal": {}
            },
            {
                "info": {
                    "includes": [
                        4,
                        15,
                        51
                    ],
                    "names": [
                        "fats",
                        "total fat",
                        "lipids",
                        "total lipid (fat)"
                    ],
                    "region": 3
                },
                "measures": {},
                "natures": [],
                "unites": [
                    {
                        "info": {
                            "includes": [],
                            "names": [
                                "saturated fat",
                                "fatty acids, total saturated"
                            ],
                            "region": 4
                        },
                        "measures": {},
                        "natures": [],
                        "unites": [],
                        "goal": {}
                    },
                    {
                        "info": {
                            "includes": [],
                            "names": [
                                "polyunsaturated fat",
                                "fatty acids, total polyunsaturated"
                            ],
                            "region": 15
                        },
                        "measures": {},
                        "natures": [],
                        "unites": [],
                        "goal": {}
                    },
                    {
                        "info": {
                            "includes": [],
                            "names": [
                                "monounsaturated fat",
                                "fatty acids, total monounsaturated"
                            ],
                            "region": 51
                        },
                        "measures": {},
                        "natures": [],
                        "unites": [],
                        "goal": {}
                    }
                ],
                "goal": {}
            },
            {
                "info": {
                    "includes": [],
                    "names": [
                        "calcium",
                        "calcium, ca"
                    ],
                    "region": 9
                },
                "measures": {
                    "mass + mass equivalents": {
                        "per recipe": {
                            "grams": {
                                "fraction string": "9",
                                "scinote string": "9.0000e+0"
                            }
                        },
                        "portion of grove": {
                            "fraction string": "90071992547409920000/454719447176344239977",
                            "scinote percentage string": "1.9808e+1"
                        }
                    }
                },
                "natures": [
                    {
                        "amount": "1",
                        "source": {
                            "name": "Vegan Multivitamin & Mineral Supplement with Greens",
                            "FDC ID": "",
                            "UPC": "8 95634 00002 7",
                            "DSLD ID": "276336"
                        },
                        "ingredient": {
                            "name": "Calcium"
                        },
                        "measures": {
                            "mass + mass equivalents": {
                                "is equivalent": "no",
                                "listed operator": "=",
                                "per form": {
                                    "listed": [
                                        "100.000",
                                        "mg"
                                    ],
                                    "grams": {
                                        "decimal string": "0.100",
                                        "fraction string": "1/10"
                                    }
                                },
                                "per package": {
                                    "is equivalent": "no",
                                    "listed operator": "=",
                                    "listed": [
                                        "9000.000",
                                        "mg"
                                    ],
                                    "grams": {
                                        "decimal string": "9.000",
                                        "fraction string": "9"
                                    }
                                }
                            }
                        }
                    }
                ],
                "unites": [],
                "goal": {
                    "days of ingredient": {
                        "mass + mass equivalents": {
                            "per recipe": {
                                "fraction string": "90/13",
                                "decimal string": "6.923"
                            }
                        }
                    }
                }
            },
            {
                "info": {
                    "includes": [],
                    "names": [
                        "cholesterol"
                    ],
                    "region": 12
                },
                "measures": {},
                "natures": [],
                "unites": [],
                "goal": {}
            },
            {
                "info": {
                    "includes": [],
                    "names": [
                        "vitamin a",
                        "vitamin a, iu"
                    ],
                    "region": 16
                },
                "measures": {
                    "mass + mass equivalents": {
                        "per recipe": {
                            "grams": {
                                "fraction string": "27/200",
                                "scinote string": "1.3500e-1"
                            }
                        },
                        "portion of grove": {
                            "fraction string": "1351079888211148800/454719447176344239977",
                            "scinote percentage string": "2.9712e-1"
                        }
                    }
                },
                "natures": [
                    {
                        "amount": "1",
                        "source": {
                            "name": "Vegan Multivitamin & Mineral Supplement with Greens",
                            "FDC ID": "",
                            "UPC": "8 95634 00002 7",
                            "DSLD ID": "276336"
                        },
                        "ingredient": {
                            "name": "Vitamin A"
                        },
                        "measures": {
                            "mass + mass equivalents": {
                                "is equivalent": "yes",
                                "listed operator": "=",
                                "per form": {
                                    "listed": [
                                        "1500.000",
                                        "mcg RAE"
                                    ],
                                    "grams": {
                                        "decimal string": "0.002",
                                        "fraction string": "3/2000"
                                    }
                                },
                                "per package": {
                                    "is equivalent": "yes",
                                    "listed operator": "=",
                                    "listed": [
                                        "135000.000",
                                        "mcg RAE"
                                    ],
                                    "grams": {
                                        "decimal string": "0.135",
                                        "fraction string": "27/200"
                                    }
                                }
                            }
                        }
                    }
                ],
                "unites": [],
                "goal": {
                    "days of ingredient": {
                        "mass + mass equivalents": {
                            "per recipe": {
                                "fraction string": "150",
                                "decimal string": "150.000"
                            }
                        }
                    }
                }
            },
            {
                "info": {
                    "includes": [],
                    "names": [
                        "vitamin e"
                    ],
                    "region": 19
                },
                "measures": {
                    "mass + mass equivalents": {
                        "per recipe": {
                            "grams": {
                                "fraction string": "27/10",
                                "scinote string": "2.7000e+0"
                            }
                        },
                        "portion of grove": {
                            "fraction string": "27021597764222976000/454719447176344239977",
                            "scinote percentage string": "5.9425e+0"
                        }
                    }
                },
                "natures": [
                    {
                        "amount": "1",
                        "source": {
                            "name": "Vegan Multivitamin & Mineral Supplement with Greens",
                            "FDC ID": "",
                            "UPC": "8 95634 00002 7",
                            "DSLD ID": "276336"
                        },
                        "ingredient": {
                            "name": "Vitamin E"
                        },
                        "measures": {
                            "mass + mass equivalents": {
                                "is equivalent": "no",
                                "listed operator": "=",
                                "per form": {
                                    "listed": [
                                        "30.000",
                                        "mg"
                                    ],
                                    "grams": {
                                        "decimal string": "0.030",
                                        "fraction string": "3/100"
                                    }
                                },
                                "per package": {
                                    "is equivalent": "no",
                                    "listed operator": "=",
                                    "listed": [
                                        "2700.000",
                                        "mg"
                                    ],
                                    "grams": {
                                        "decimal string": "2.700",
                                        "fraction string": "27/10"
                                    }
                                }
                            }
                        }
                    }
                ],
                "unites": [],
                "goal": {
                    "days of ingredient": {
                        "mass + mass equivalents": {
                            "per recipe": {
                                "fraction string": "180",
                                "decimal string": "180.000"
                            }
                        }
                    }
                }
            },
            {
                "info": {
                    "includes": [],
                    "names": [
                        "iodine"
                    ],
                    "region": 29
                },
                "measures": {
                    "mass + mass equivalents": {
                        "per recipe": {
                            "grams": {
                                "fraction string": "27/2000",
                                "scinote string": "1.3500e-2"
                            }
                        },
                        "portion of grove": {
                            "fraction string": "135107988821114880/454719447176344239977",
                            "scinote percentage string": "2.9712e-2"
                        }
                    }
                },
                "natures": [
                    {
                        "amount": "1",
                        "source": {
                            "name": "Vegan Multivitamin & Mineral Supplement with Greens",
                            "FDC ID": "",
                            "UPC": "8 95634 00002 7",
                            "DSLD ID": "276336"
                        },
                        "ingredient": {
                            "name": "Iodine"
                        },
                        "measures": {
                            "mass + mass equivalents": {
                                "is equivalent": "no",
                                "listed operator": "=",
                                "per form": {
                                    "listed": [
                                        "150.000",
                                        "mcg"
                                    ],
                                    "grams": {
                                        "decimal string": "0.000",
                                        "fraction string": "3/20000"
                                    }
                                },
                                "per package": {
                                    "is equivalent": "no",
                                    "listed operator": "=",
                                    "listed": [
                                        "13500.000",
                                        "mcg"
                                    ],
                                    "grams": {
                                        "decimal string": "0.014",
                                        "fraction string": "27/2000"
                                    }
                                }
                            }
                        }
                    }
                ],
                "unites": [],
                "goal": {
                    "days of ingredient": {
                        "mass + mass equivalents": {
                            "per recipe": {
                                "fraction string": "90",
                                "decimal string": "90.000"
                            }
                        }
                    }
                }
            },
            {
                "info": {
                    "includes": [],
                    "names": [
                        "magnesium"
                    ],
                    "region": 30
                },
                "measures": {
                    "mass + mass equivalents": {
                        "per recipe": {
                            "grams": {
                                "fraction string": "18/5",
                                "scinote string": "3.6000e+0"
                            }
                        },
                        "portion of grove": {
                            "fraction string": "36028797018963968000/454719447176344239977",
                            "scinote percentage string": "7.9233e+0"
                        }
                    }
                },
                "natures": [
                    {
                        "amount": "1",
                        "source": {
                            "name": "Vegan Multivitamin & Mineral Supplement with Greens",
                            "FDC ID": "",
                            "UPC": "8 95634 00002 7",
                            "DSLD ID": "276336"
                        },
                        "ingredient": {
                            "name": "Magnesium"
                        },
                        "measures": {
                            "mass + mass equivalents": {
                                "is equivalent": "no",
                                "listed operator": "=",
                                "per form": {
                                    "listed": [
                                        "40.000",
                                        "mg"
                                    ],
                                    "grams": {
                                        "decimal string": "0.040",
                                        "fraction string": "1/25"
                                    }
                                },
                                "per package": {
                                    "is equivalent": "no",
                                    "listed operator": "=",
                                    "listed": [
                                        "3600.000",
                                        "mg"
                                    ],
                                    "grams": {
                                        "decimal string": "3.600",
                                        "fraction string": "18/5"
                                    }
                                }
                            }
                        }
                    }
                ],
                "unites": [],
                "goal": {
                    "days of ingredient": {
                        "mass + mass equivalents": {
                            "per recipe": {
                                "fraction string": "60/7",
                                "decimal string": "8.571"
                            }
                        }
                    }
                }
            },
            {
                "info": {
                    "accepts": [],
                    "includes": [],
                    "names": [
                        "Zinc, Zn",
                        "Zinc"
                    ],
                    "region": 31
                },
                "measures": {
                    "mass + mass equivalents": {
                        "per recipe": {
                            "grams": {
                                "fraction string": "63/50",
                                "scinote string": "1.2600e+0"
                            }
                        },
                        "portion of grove": {
                            "fraction string": "12610078956637388800/454719447176344239977",
                            "scinote percentage string": "2.7732e+0"
                        }
                    }
                },
                "natures": [
                    {
                        "amount": "1",
                        "source": {
                            "name": "Vegan Multivitamin & Mineral Supplement with Greens",
                            "FDC ID": "",
                            "UPC": "8 95634 00002 7",
                            "DSLD ID": "276336"
                        },
                        "ingredient": {
                            "name": "Zinc"
                        },
                        "measures": {
                            "mass + mass equivalents": {
                                "is equivalent": "no",
                                "listed operator": "=",
                                "per form": {
                                    "listed": [
                                        "14.000",
                                        "mg"
                                    ],
                                    "grams": {
                                        "decimal string": "0.014",
                                        "fraction string": "7/500"
                                    }
                                },
                                "per package": {
                                    "is equivalent": "no",
                                    "listed operator": "=",
                                    "listed": [
                                        "1260.000",
                                        "mg"
                                    ],
                                    "grams": {
                                        "decimal string": "1.260",
                                        "fraction string": "63/50"
                                    }
                                }
                            }
                        }
                    }
                ],
                "unites": [],
                "goal": {
                    "days of ingredient": {
                        "mass + mass equivalents": {
                            "per recipe": {
                                "fraction string": "1260/11",
                                "decimal string": "114.545"
                            }
                        }
                    }
                }
            },
            {
                "info": {
                    "includes": [],
                    "names": [
                        "selenium"
                    ],
                    "region": 32
                },
                "measures": {
                    "mass + mass equivalents": {
                        "per recipe": {
                            "grams": {
                                "fraction string": "63/10000",
                                "scinote string": "6.3000e-3"
                            }
                        },
                        "portion of grove": {
                            "fraction string": "63050394783186944/454719447176344239977",
                            "scinote percentage string": "1.3866e-2"
                        }
                    }
                },
                "natures": [
                    {
                        "amount": "1",
                        "source": {
                            "name": "Vegan Multivitamin & Mineral Supplement with Greens",
                            "FDC ID": "",
                            "UPC": "8 95634 00002 7",
                            "DSLD ID": "276336"
                        },
                        "ingredient": {
                            "name": "Selenium"
                        },
                        "measures": {
                            "mass + mass equivalents": {
                                "is equivalent": "no",
                                "listed operator": "=",
                                "per form": {
                                    "listed": [
                                        "70.000",
                                        "mcg"
                                    ],
                                    "grams": {
                                        "decimal string": "0.000",
                                        "fraction string": "7/100000"
                                    }
                                },
                                "per package": {
                                    "is equivalent": "no",
                                    "listed operator": "=",
                                    "listed": [
                                        "6300.000",
                                        "mcg"
                                    ],
                                    "grams": {
                                        "decimal string": "0.006",
                                        "fraction string": "63/10000"
                                    }
                                }
                            }
                        }
                    }
                ],
                "unites": [],
                "goal": {
                    "days of ingredient": {
                        "mass + mass equivalents": {
                            "per recipe": {
                                "fraction string": "1260/11",
                                "decimal string": "114.545"
                            }
                        }
                    }
                }
            },
            {
                "info": {
                    "includes": [],
                    "names": [
                        "copper"
                    ],
                    "region": 33
                },
                "measures": {
                    "mass + mass equivalents": {
                        "per recipe": {
                            "grams": {
                                "fraction string": "74579609829255417/3602879701896396800",
                                "scinote string": "2.0700e-2"
                            }
                        },
                        "portion of grove": {
                            "fraction string": "207165582859042825/454719447176344239977",
                            "scinote percentage string": "4.5559e-2"
                        }
                    }
                },
                "natures": [
                    {
                        "amount": "1",
                        "source": {
                            "name": "Vegan Multivitamin & Mineral Supplement with Greens",
                            "FDC ID": "",
                            "UPC": "8 95634 00002 7",
                            "DSLD ID": "276336"
                        },
                        "ingredient": {
                            "name": "Copper"
                        },
                        "measures": {
                            "mass + mass equivalents": {
                                "is equivalent": "no",
                                "listed operator": "=",
                                "per form": {
                                    "listed": [
                                        "0.230",
                                        "mg"
                                    ],
                                    "grams": {
                                        "decimal string": "0.000",
                                        "fraction string": "8286623314361713/36028797018963968000"
                                    }
                                },
                                "per package": {
                                    "is equivalent": "no",
                                    "listed operator": "=",
                                    "listed": [
                                        "20.700",
                                        "mg"
                                    ],
                                    "grams": {
                                        "decimal string": "0.021",
                                        "fraction string": "74579609829255417/3602879701896396800"
                                    }
                                }
                            }
                        }
                    }
                ],
                "unites": [],
                "goal": {
                    "days of ingredient": {
                        "mass + mass equivalents": {
                            "per recipe": {
                                "fraction string": "207165582859042825/9007199254740992",
                                "decimal string": "23.000"
                            }
                        }
                    }
                }
            },
            {
                "info": {
                    "includes": [],
                    "names": [
                        "manganese"
                    ],
                    "region": 34
                },
                "measures": {
                    "mass + mass equivalents": {
                        "per recipe": {
                            "grams": {
                                "fraction string": "4661225614328463/22517998136852480",
                                "scinote string": "2.0700e-1"
                            }
                        },
                        "portion of grove": {
                            "fraction string": "2071655828590428000/454719447176344239977",
                            "scinote percentage string": "4.5559e-1"
                        }
                    }
                },
                "natures": [
                    {
                        "amount": "1",
                        "source": {
                            "name": "Vegan Multivitamin & Mineral Supplement with Greens",
                            "FDC ID": "",
                            "UPC": "8 95634 00002 7",
                            "DSLD ID": "276336"
                        },
                        "ingredient": {
                            "name": "Manganese"
                        },
                        "measures": {
                            "mass + mass equivalents": {
                                "is equivalent": "no",
                                "listed operator": "=",
                                "per form": {
                                    "listed": [
                                        "2.300",
                                        "mg"
                                    ],
                                    "grams": {
                                        "decimal string": "0.002",
                                        "fraction string": "517913957147607/225179981368524800"
                                    }
                                },
                                "per package": {
                                    "is equivalent": "no",
                                    "listed operator": "=",
                                    "listed": [
                                        "207.000",
                                        "mg"
                                    ],
                                    "grams": {
                                        "decimal string": "0.207",
                                        "fraction string": "4661225614328463/22517998136852480"
                                    }
                                }
                            }
                        }
                    }
                ],
                "unites": [],
                "goal": {
                    "days of ingredient": {
                        "mass + mass equivalents": {
                            "per recipe": {
                                "fraction string": "582653201791057875/6473924464345088",
                                "decimal string": "90.000"
                            }
                        }
                    }
                }
            },
            {
                "info": {
                    "includes": [],
                    "names": [
                        "chromium"
                    ],
                    "region": 35
                },
                "measures": {
                    "mass + mass equivalents": {
                        "per recipe": {
                            "grams": {
                                "fraction string": "27/2500",
                                "scinote string": "1.0800e-2"
                            }
                        },
                        "portion of grove": {
                            "fraction string": "108086391056891904/454719447176344239977",
                            "scinote percentage string": "2.3770e-2"
                        }
                    }
                },
                "natures": [
                    {
                        "amount": "1",
                        "source": {
                            "name": "Vegan Multivitamin & Mineral Supplement with Greens",
                            "FDC ID": "",
                            "UPC": "8 95634 00002 7",
                            "DSLD ID": "276336"
                        },
                        "ingredient": {
                            "name": "Chromium"
                        },
                        "measures": {
                            "mass + mass equivalents": {
                                "is equivalent": "no",
                                "listed operator": "=",
                                "per form": {
                                    "listed": [
                                        "120.000",
                                        "mcg"
                                    ],
                                    "grams": {
                                        "decimal string": "0.000",
                                        "fraction string": "3/25000"
                                    }
                                },
                                "per package": {
                                    "is equivalent": "no",
                                    "listed operator": "=",
                                    "listed": [
                                        "10800.000",
                                        "mcg"
                                    ],
                                    "grams": {
                                        "decimal string": "0.011",
                                        "fraction string": "27/2500"
                                    }
                                }
                            }
                        }
                    }
                ],
                "unites": [],
                "goal": {
                    "days of ingredient": {
                        "mass + mass equivalents": {
                            "per recipe": {
                                "fraction string": "2160/7",
                                "decimal string": "308.571"
                            }
                        }
                    }
                }
            },
            {
                "info": {
                    "includes": [],
                    "names": [
                        "molybdenum"
                    ],
                    "region": 36
                },
                "measures": {
                    "mass + mass equivalents": {
                        "per recipe": {
                            "grams": {
                                "fraction string": "27/4000",
                                "scinote string": "6.7500e-3"
                            }
                        },
                        "portion of grove": {
                            "fraction string": "67553994410557440/454719447176344239977",
                            "scinote percentage string": "1.4856e-2"
                        }
                    }
                },
                "natures": [
                    {
                        "amount": "1",
                        "source": {
                            "name": "Vegan Multivitamin & Mineral Supplement with Greens",
                            "FDC ID": "",
                            "UPC": "8 95634 00002 7",
                            "DSLD ID": "276336"
                        },
                        "ingredient": {
                            "name": "Molybdenum"
                        },
                        "measures": {
                            "mass + mass equivalents": {
                                "is equivalent": "no",
                                "listed operator": "=",
                                "per form": {
                                    "listed": [
                                        "75.000",
                                        "mcg"
                                    ],
                                    "grams": {
                                        "decimal string": "0.000",
                                        "fraction string": "3/40000"
                                    }
                                },
                                "per package": {
                                    "is equivalent": "no",
                                    "listed operator": "=",
                                    "listed": [
                                        "6750.000",
                                        "mcg"
                                    ],
                                    "grams": {
                                        "decimal string": "0.007",
                                        "fraction string": "27/4000"
                                    }
                                }
                            }
                        }
                    }
                ],
                "unites": [],
                "goal": {
                    "days of ingredient": {
                        "mass + mass equivalents": {
                            "per recipe": {
                                "fraction string": "150",
                                "decimal string": "150.000"
                            }
                        }
                    }
                }
            },
            {
                "info": {
                    "includes": [],
                    "names": [
                        "choline"
                    ],
                    "region": 37
                },
                "measures": {
                    "mass + mass equivalents": {
                        "per recipe": {
                            "grams": {
                                "fraction string": "27/20",
                                "scinote string": "1.3500e+0"
                            }
                        },
                        "portion of grove": {
                            "fraction string": "13510798882111488000/454719447176344239977",
                            "scinote percentage string": "2.9712e+0"
                        }
                    }
                },
                "natures": [
                    {
                        "amount": "1",
                        "source": {
                            "name": "Vegan Multivitamin & Mineral Supplement with Greens",
                            "FDC ID": "",
                            "UPC": "8 95634 00002 7",
                            "DSLD ID": "276336"
                        },
                        "ingredient": {
                            "name": "Choline"
                        },
                        "measures": {
                            "mass + mass equivalents": {
                                "is equivalent": "no",
                                "listed operator": "=",
                                "per form": {
                                    "listed": [
                                        "15.000",
                                        "mg"
                                    ],
                                    "grams": {
                                        "decimal string": "0.015",
                                        "fraction string": "3/200"
                                    }
                                },
                                "per package": {
                                    "is equivalent": "no",
                                    "listed operator": "=",
                                    "listed": [
                                        "1350.000",
                                        "mg"
                                    ],
                                    "grams": {
                                        "decimal string": "1.350",
                                        "fraction string": "27/20"
                                    }
                                }
                            }
                        }
                    }
                ],
                "unites": [],
                "goal": {
                    "days of ingredient": {
                        "mass + mass equivalents": {
                            "per recipe": {
                                "fraction string": "27/11",
                                "decimal string": "2.455"
                            }
                        }
                    }
                }
            },
            {
                "info": {
                    "includes": [],
                    "names": [
                        "lutein"
                    ],
                    "region": 40
                },
                "measures": {
                    "mass + mass equivalents": {
                        "per recipe": {
                            "grams": {
                                "fraction string": "9/2000",
                                "scinote string": "4.5000e-3"
                            }
                        },
                        "portion of grove": {
                            "fraction string": "45035996273704960/454719447176344239977",
                            "scinote percentage string": "9.9041e-3"
                        }
                    }
                },
                "natures": [
                    {
                        "amount": "1",
                        "source": {
                            "name": "Vegan Multivitamin & Mineral Supplement with Greens",
                            "FDC ID": "",
                            "UPC": "8 95634 00002 7",
                            "DSLD ID": "276336"
                        },
                        "ingredient": {
                            "name": "Lutein"
                        },
                        "measures": {
                            "mass + mass equivalents": {
                                "is equivalent": "no",
                                "listed operator": "=",
                                "per form": {
                                    "listed": [
                                        "50.000",
                                        "mcg"
                                    ],
                                    "grams": {
                                        "decimal string": "0.000",
                                        "fraction string": "1/20000"
                                    }
                                },
                                "per package": {
                                    "is equivalent": "no",
                                    "listed operator": "=",
                                    "listed": [
                                        "4500.000",
                                        "mcg"
                                    ],
                                    "grams": {
                                        "decimal string": "0.005",
                                        "fraction string": "9/2000"
                                    }
                                }
                            }
                        }
                    }
                ],
                "unites": [],
                "goal": {}
            },
            {
                "info": {
                    "includes": [],
                    "names": [
                        "betaine hydrochloride"
                    ],
                    "region": 43
                },
                "measures": {
                    "mass + mass equivalents": {
                        "per recipe": {
                            "grams": {
                                "fraction string": "9/10",
                                "scinote string": "9.0000e-1"
                            }
                        },
                        "portion of grove": {
                            "fraction string": "9007199254740992000/454719447176344239977",
                            "scinote percentage string": "1.9808e+0"
                        }
                    }
                },
                "natures": [
                    {
                        "amount": "1",
                        "source": {
                            "name": "Vegan Multivitamin & Mineral Supplement with Greens",
                            "FDC ID": "",
                            "UPC": "8 95634 00002 7",
                            "DSLD ID": "276336"
                        },
                        "ingredient": {
                            "name": "Betaine Hydrochloride"
                        },
                        "measures": {
                            "mass + mass equivalents": {
                                "is equivalent": "no",
                                "listed operator": "=",
                                "per form": {
                                    "listed": [
                                        "10.000",
                                        "mg"
                                    ],
                                    "grams": {
                                        "decimal string": "0.010",
                                        "fraction string": "1/100"
                                    }
                                },
                                "per package": {
                                    "is equivalent": "no",
                                    "listed operator": "=",
                                    "listed": [
                                        "900.000",
                                        "mg"
                                    ],
                                    "grams": {
                                        "decimal string": "0.900",
                                        "fraction string": "9/10"
                                    }
                                }
                            }
                        }
                    }
                ],
                "unites": [],
                "goal": {}
            },
            {
                "info": {
                    "includes": [],
                    "names": [
                        "rutin"
                    ],
                    "region": 44
                },
                "measures": {
                    "mass + mass equivalents": {
                        "per recipe": {
                            "grams": {
                                "fraction string": "9/10",
                                "scinote string": "9.0000e-1"
                            }
                        },
                        "portion of grove": {
                            "fraction string": "9007199254740992000/454719447176344239977",
                            "scinote percentage string": "1.9808e+0"
                        }
                    }
                },
                "natures": [
                    {
                        "amount": "1",
                        "source": {
                            "name": "Vegan Multivitamin & Mineral Supplement with Greens",
                            "FDC ID": "",
                            "UPC": "8 95634 00002 7",
                            "DSLD ID": "276336"
                        },
                        "ingredient": {
                            "name": "Rutin"
                        },
                        "measures": {
                            "mass + mass equivalents": {
                                "is equivalent": "no",
                                "listed operator": "=",
                                "per form": {
                                    "listed": [
                                        "10.000",
                                        "mg"
                                    ],
                                    "grams": {
                                        "decimal string": "0.010",
                                        "fraction string": "1/100"
                                    }
                                },
                                "per package": {
                                    "is equivalent": "no",
                                    "listed operator": "=",
                                    "listed": [
                                        "900.000",
                                        "mg"
                                    ],
                                    "grams": {
                                        "decimal string": "0.900",
                                        "fraction string": "9/10"
                                    }
                                }
                            }
                        }
                    }
                ],
                "unites": [],
                "goal": {}
            },
            {
                "info": {
                    "includes": [],
                    "names": [
                        "strontium"
                    ],
                    "region": 47
                },
                "measures": {},
                "natures": [],
                "unites": [],
                "goal": {}
            },
            {
                "info": {
                    "includes": [],
                    "names": [
                        "vanadium"
                    ],
                    "region": 49
                },
                "measures": {},
                "natures": [],
                "unites": [],
                "goal": {}
            },
            {
                "info": {
                    "accepts": [],
                    "includes": [],
                    "names": [
                        "Phosphorus, P",
                        "Phosphorus"
                    ],
                    "region": 57
                },
                "measures": {},
                "natures": [],
                "unites": [],
                "goal": {}
            },
            {
                "info": {
                    "includes": [],
                    "names": [
                        "potassium",
                        "potassium K",
                        "potassium, K",
                        "K"
                    ],
                    "region": 58
                },
                "measures": {},
                "natures": [],
                "unites": [],
                "goal": {}
            },
            {
                "info": {
                    "includes": [],
                    "names": [
                        "sodium Na",
                        "sodium, Na",
                        "sodium",
                        "Na"
                    ],
                    "region": 59
                },
                "measures": {},
                "natures": [],
                "unites": [],
                "goal": {}
            },
            {
                "info": {
                    "includes": [],
                    "names": [
                        "vitamin d",
                        "vitamin d (d2 + d3)",
                        "vitamin d2",
                        "vitamin d3",
                        "vitamin d (d2 + d3), international units"
                    ],
                    "region": 63
                },
                "measures": {
                    "mass + mass equivalents": {
                        "per recipe": {
                            "grams": {
                                "fraction string": "9/5000",
                                "scinote string": "1.8000e-3"
                            }
                        },
                        "portion of grove": {
                            "fraction string": "18014398509481984/454719447176344239977",
                            "scinote percentage string": "3.9617e-3"
                        }
                    }
                },
                "natures": [
                    {
                        "amount": "1",
                        "source": {
                            "name": "Vegan Multivitamin & Mineral Supplement with Greens",
                            "FDC ID": "",
                            "UPC": "8 95634 00002 7",
                            "DSLD ID": "276336"
                        },
                        "ingredient": {
                            "name": "Vitamin D2"
                        },
                        "measures": {
                            "mass + mass equivalents": {
                                "is equivalent": "no",
                                "listed operator": "=",
                                "per form": {
                                    "listed": [
                                        "20.000",
                                        "mcg"
                                    ],
                                    "grams": {
                                        "decimal string": "0.000",
                                        "fraction string": "1/50000"
                                    }
                                },
                                "per package": {
                                    "is equivalent": "no",
                                    "listed operator": "=",
                                    "listed": [
                                        "1800.000",
                                        "mcg"
                                    ],
                                    "grams": {
                                        "decimal string": "0.002",
                                        "fraction string": "9/5000"
                                    }
                                }
                            }
                        }
                    }
                ],
                "unites": [],
                "goal": {
                    "days of ingredient": {
                        "mass + mass equivalents": {
                            "per recipe": {
                                "fraction string": "90",
                                "decimal string": "90.000"
                            }
                        }
                    }
                }
            },
            {
                "info": {
                    "includes": [],
                    "names": [
                        "vitamin c",
                        "vitamin c (form: as calcium ascorbate)",
                        "vitamin c, total ascorbic acid"
                    ],
                    "region": 64
                },
                "measures": {
                    "mass + mass equivalents": {
                        "per recipe": {
                            "grams": {
                                "fraction string": "27/2",
                                "scinote string": "1.3500e+1"
                            }
                        },
                        "portion of grove": {
                            "fraction string": "135107988821114880000/454719447176344239977",
                            "scinote percentage string": "2.9712e+1"
                        }
                    }
                },
                "natures": [
                    {
                        "amount": "1",
                        "source": {
                            "name": "Vegan Multivitamin & Mineral Supplement with Greens",
                            "FDC ID": "",
                            "UPC": "8 95634 00002 7",
                            "DSLD ID": "276336"
                        },
                        "ingredient": {
                            "name": "Vitamin C"
                        },
                        "measures": {
                            "mass + mass equivalents": {
                                "is equivalent": "no",
                                "listed operator": "=",
                                "per form": {
                                    "listed": [
                                        "150.000",
                                        "mg"
                                    ],
                                    "grams": {
                                        "decimal string": "0.150",
                                        "fraction string": "3/20"
                                    }
                                },
                                "per package": {
                                    "is equivalent": "no",
                                    "listed operator": "=",
                                    "listed": [
                                        "13500.000",
                                        "mg"
                                    ],
                                    "grams": {
                                        "decimal string": "13.500",
                                        "fraction string": "27/2"
                                    }
                                }
                            }
                        }
                    }
                ],
                "unites": [],
                "goal": {
                    "days of ingredient": {
                        "mass + mass equivalents": {
                            "per recipe": {
                                "fraction string": "150",
                                "decimal string": "150.000"
                            }
                        }
                    }
                }
            },
            {
                "info": {
                    "includes": [],
                    "names": [
                        "vitamin k",
                        "vitamin k1",
                        "vitamin k2"
                    ],
                    "region": 65
                },
                "measures": {},
                "natures": [],
                "unites": [],
                "goal": {}
            },
            {
                "info": {
                    "includes": [],
                    "names": [
                        "thiamin",
                        "thiamine",
                        "vitamin b1"
                    ],
                    "region": 66
                },
                "measures": {
                    "mass + mass equivalents": {
                        "per recipe": {
                            "grams": {
                                "fraction string": "27/25",
                                "scinote string": "1.0800e+0"
                            }
                        },
                        "portion of grove": {
                            "fraction string": "10808639105689190400/454719447176344239977",
                            "scinote percentage string": "2.3770e+0"
                        }
                    }
                },
                "natures": [
                    {
                        "amount": "1",
                        "source": {
                            "name": "Vegan Multivitamin & Mineral Supplement with Greens",
                            "FDC ID": "",
                            "UPC": "8 95634 00002 7",
                            "DSLD ID": "276336"
                        },
                        "ingredient": {
                            "name": "Vitamin B1"
                        },
                        "measures": {
                            "mass + mass equivalents": {
                                "is equivalent": "no",
                                "listed operator": "=",
                                "per form": {
                                    "listed": [
                                        "12.000",
                                        "mg"
                                    ],
                                    "grams": {
                                        "decimal string": "0.012",
                                        "fraction string": "3/250"
                                    }
                                },
                                "per package": {
                                    "is equivalent": "no",
                                    "listed operator": "=",
                                    "listed": [
                                        "1080.000",
                                        "mg"
                                    ],
                                    "grams": {
                                        "decimal string": "1.080",
                                        "fraction string": "27/25"
                                    }
                                }
                            }
                        }
                    }
                ],
                "unites": [],
                "goal": {
                    "days of ingredient": {
                        "mass + mass equivalents": {
                            "per recipe": {
                                "fraction string": "900",
                                "decimal string": "900.000"
                            }
                        }
                    }
                }
            },
            {
                "info": {
                    "includes": [],
                    "names": [
                        "riboflavin",
                        "vitamin b2"
                    ],
                    "region": 67
                },
                "measures": {
                    "mass + mass equivalents": {
                        "per recipe": {
                            "grams": {
                                "fraction string": "117/100",
                                "scinote string": "1.1700e+0"
                            }
                        },
                        "portion of grove": {
                            "fraction string": "11709359031163289600/454719447176344239977",
                            "scinote percentage string": "2.5751e+0"
                        }
                    }
                },
                "natures": [
                    {
                        "amount": "1",
                        "source": {
                            "name": "Vegan Multivitamin & Mineral Supplement with Greens",
                            "FDC ID": "",
                            "UPC": "8 95634 00002 7",
                            "DSLD ID": "276336"
                        },
                        "ingredient": {
                            "name": "Vitamin B2"
                        },
                        "measures": {
                            "mass + mass equivalents": {
                                "is equivalent": "no",
                                "listed operator": "=",
                                "per form": {
                                    "listed": [
                                        "13.000",
                                        "mg"
                                    ],
                                    "grams": {
                                        "decimal string": "0.013",
                                        "fraction string": "13/1000"
                                    }
                                },
                                "per package": {
                                    "is equivalent": "no",
                                    "listed operator": "=",
                                    "listed": [
                                        "1170.000",
                                        "mg"
                                    ],
                                    "grams": {
                                        "decimal string": "1.170",
                                        "fraction string": "117/100"
                                    }
                                }
                            }
                        }
                    }
                ],
                "unites": [],
                "goal": {
                    "days of ingredient": {
                        "mass + mass equivalents": {
                            "per recipe": {
                                "fraction string": "900",
                                "decimal string": "900.000"
                            }
                        }
                    }
                }
            },
            {
                "info": {
                    "includes": [],
                    "names": [
                        "vitamin b3",
                        "niacin",
                        "nicotinamide",
                        "nicotinamide riboside"
                    ],
                    "region": 68
                },
                "measures": {
                    "mass + mass equivalents": {
                        "per recipe": {
                            "grams": {
                                "fraction string": "9/2",
                                "scinote string": "4.5000e+0"
                            }
                        },
                        "portion of grove": {
                            "fraction string": "45035996273704960000/454719447176344239977",
                            "scinote percentage string": "9.9041e+0"
                        }
                    }
                },
                "natures": [
                    {
                        "amount": "1",
                        "source": {
                            "name": "Vegan Multivitamin & Mineral Supplement with Greens",
                            "FDC ID": "",
                            "UPC": "8 95634 00002 7",
                            "DSLD ID": "276336"
                        },
                        "ingredient": {
                            "name": "Vitamin B3"
                        },
                        "measures": {
                            "mass + mass equivalents": {
                                "is equivalent": "no",
                                "listed operator": "=",
                                "per form": {
                                    "listed": [
                                        "50.000",
                                        "mg"
                                    ],
                                    "grams": {
                                        "decimal string": "0.050",
                                        "fraction string": "1/20"
                                    }
                                },
                                "per package": {
                                    "is equivalent": "no",
                                    "listed operator": "=",
                                    "listed": [
                                        "4500.000",
                                        "mg"
                                    ],
                                    "grams": {
                                        "decimal string": "4.500",
                                        "fraction string": "9/2"
                                    }
                                }
                            }
                        }
                    }
                ],
                "unites": [],
                "goal": {
                    "days of ingredient": {
                        "mass + mass equivalents": {
                            "per recipe": {
                                "fraction string": "1125/4",
                                "decimal string": "281.250"
                            }
                        }
                    }
                }
            },
            {
                "info": {
                    "includes": [],
                    "names": [
                        "vitamin b5",
                        "pantothenic acid"
                    ],
                    "region": 69
                },
                "measures": {
                    "mass + mass equivalents": {
                        "per recipe": {
                            "grams": {
                                "fraction string": "9/4",
                                "scinote string": "2.2500e+0"
                            }
                        },
                        "portion of grove": {
                            "fraction string": "22517998136852480000/454719447176344239977",
                            "scinote percentage string": "4.9521e+0"
                        }
                    }
                },
                "natures": [
                    {
                        "amount": "1",
                        "source": {
                            "name": "Vegan Multivitamin & Mineral Supplement with Greens",
                            "FDC ID": "",
                            "UPC": "8 95634 00002 7",
                            "DSLD ID": "276336"
                        },
                        "ingredient": {
                            "name": "Vitamin B5"
                        },
                        "measures": {
                            "mass + mass equivalents": {
                                "is equivalent": "no",
                                "listed operator": "=",
                                "per form": {
                                    "listed": [
                                        "25.000",
                                        "mg"
                                    ],
                                    "grams": {
                                        "decimal string": "0.025",
                                        "fraction string": "1/40"
                                    }
                                },
                                "per package": {
                                    "is equivalent": "no",
                                    "listed operator": "=",
                                    "listed": [
                                        "2250.000",
                                        "mg"
                                    ],
                                    "grams": {
                                        "decimal string": "2.250",
                                        "fraction string": "9/4"
                                    }
                                }
                            }
                        }
                    }
                ],
                "unites": [],
                "goal": {
                    "days of ingredient": {
                        "mass + mass equivalents": {
                            "per recipe": {
                                "fraction string": "450",
                                "decimal string": "450.000"
                            }
                        }
                    }
                }
            },
            {
                "info": {
                    "accepts": [
                        "pyridoxine",
                        "pyridoxal",
                        "pyridoxamine"
                    ],
                    "includes": [],
                    "names": [
                        "Vitamin B6",
                        "Vitamin B-6"
                    ],
                    "region": 70
                },
                "measures": {
                    "mass + mass equivalents": {
                        "per recipe": {
                            "grams": {
                                "fraction string": "459/400",
                                "scinote string": "1.1475e+0"
                            }
                        },
                        "portion of grove": {
                            "fraction string": "11484179049794764800/454719447176344239977",
                            "scinote percentage string": "2.5256e+0"
                        }
                    }
                },
                "natures": [
                    {
                        "amount": "1",
                        "source": {
                            "name": "Vegan Multivitamin & Mineral Supplement with Greens",
                            "FDC ID": "",
                            "UPC": "8 95634 00002 7",
                            "DSLD ID": "276336"
                        },
                        "ingredient": {
                            "name": "Vitamin B6"
                        },
                        "measures": {
                            "mass + mass equivalents": {
                                "is equivalent": "no",
                                "listed operator": "=",
                                "per form": {
                                    "listed": [
                                        "12.750",
                                        "mg"
                                    ],
                                    "grams": {
                                        "decimal string": "0.013",
                                        "fraction string": "51/4000"
                                    }
                                },
                                "per package": {
                                    "is equivalent": "no",
                                    "listed operator": "=",
                                    "listed": [
                                        "1147.500",
                                        "mg"
                                    ],
                                    "grams": {
                                        "decimal string": "1.148",
                                        "fraction string": "459/400"
                                    }
                                }
                            }
                        }
                    }
                ],
                "unites": [],
                "goal": {
                    "days of ingredient": {
                        "mass + mass equivalents": {
                            "per recipe": {
                                "fraction string": "675",
                                "decimal string": "675.000"
                            }
                        }
                    }
                }
            },
            {
                "info": {
                    "includes": [],
                    "names": [
                        "vitamin b7",
                        "biotin",
                        "vitamin h"
                    ],
                    "region": 71
                },
                "measures": {
                    "mass + mass equivalents": {
                        "per recipe": {
                            "grams": {
                                "fraction string": "27/4000",
                                "scinote string": "6.7500e-3"
                            }
                        },
                        "portion of grove": {
                            "fraction string": "67553994410557440/454719447176344239977",
                            "scinote percentage string": "1.4856e-2"
                        }
                    }
                },
                "natures": [
                    {
                        "amount": "1",
                        "source": {
                            "name": "Vegan Multivitamin & Mineral Supplement with Greens",
                            "FDC ID": "",
                            "UPC": "8 95634 00002 7",
                            "DSLD ID": "276336"
                        },
                        "ingredient": {
                            "name": "Biotin"
                        },
                        "measures": {
                            "mass + mass equivalents": {
                                "is equivalent": "no",
                                "listed operator": "=",
                                "per form": {
                                    "listed": [
                                        "75.000",
                                        "mcg"
                                    ],
                                    "grams": {
                                        "decimal string": "0.000",
                                        "fraction string": "3/40000"
                                    }
                                },
                                "per package": {
                                    "is equivalent": "no",
                                    "listed operator": "=",
                                    "listed": [
                                        "6750.000",
                                        "mcg"
                                    ],
                                    "grams": {
                                        "decimal string": "0.007",
                                        "fraction string": "27/4000"
                                    }
                                }
                            }
                        }
                    }
                ],
                "unites": [],
                "goal": {
                    "days of ingredient": {
                        "mass + mass equivalents": {
                            "per recipe": {
                                "fraction string": "225",
                                "decimal string": "225.000"
                            }
                        }
                    }
                }
            },
            {
                "info": {
                    "includes": [],
                    "names": [
                        "vitamin b9",
                        "folate",
                        "folacin"
                    ],
                    "region": 72
                },
                "measures": {
                    "mass + mass equivalents": {
                        "per recipe": {
                            "grams": {
                                "fraction string": "9/250",
                                "scinote string": "3.6000e-2"
                            }
                        },
                        "portion of grove": {
                            "fraction string": "360287970189639680/454719447176344239977",
                            "scinote percentage string": "7.9233e-2"
                        }
                    }
                },
                "natures": [
                    {
                        "amount": "1",
                        "source": {
                            "name": "Vegan Multivitamin & Mineral Supplement with Greens",
                            "FDC ID": "",
                            "UPC": "8 95634 00002 7",
                            "DSLD ID": "276336"
                        },
                        "ingredient": {
                            "name": "Folate"
                        },
                        "measures": {
                            "mass + mass equivalents": {
                                "is equivalent": "yes",
                                "listed operator": "=",
                                "per form": {
                                    "listed": [
                                        "400.000",
                                        "mcg DFE"
                                    ],
                                    "grams": {
                                        "decimal string": "0.000",
                                        "fraction string": "1/2500"
                                    }
                                },
                                "per package": {
                                    "is equivalent": "yes",
                                    "listed operator": "=",
                                    "listed": [
                                        "36000.000",
                                        "mcg DFE"
                                    ],
                                    "grams": {
                                        "decimal string": "0.036",
                                        "fraction string": "9/250"
                                    }
                                }
                            }
                        }
                    }
                ],
                "unites": [],
                "goal": {
                    "days of ingredient": {
                        "mass + mass equivalents": {
                            "per recipe": {
                                "fraction string": "90",
                                "decimal string": "90.000"
                            }
                        }
                    }
                }
            },
            {
                "info": {
                    "accepts": [],
                    "includes": [],
                    "names": [
                        "Vitamin B12",
                        "Vitamin B-12",
                        "cobalamin"
                    ],
                    "region": 73
                },
                "measures": {
                    "mass + mass equivalents": {
                        "per recipe": {
                            "grams": {
                                "fraction string": "9/1000",
                                "scinote string": "9.0000e-3"
                            }
                        },
                        "portion of grove": {
                            "fraction string": "90071992547409920/454719447176344239977",
                            "scinote percentage string": "1.9808e-2"
                        }
                    }
                },
                "natures": [
                    {
                        "amount": "1",
                        "source": {
                            "name": "Vegan Multivitamin & Mineral Supplement with Greens",
                            "FDC ID": "",
                            "UPC": "8 95634 00002 7",
                            "DSLD ID": "276336"
                        },
                        "ingredient": {
                            "name": "Vitamin B12"
                        },
                        "measures": {
                            "mass + mass equivalents": {
                                "is equivalent": "no",
                                "listed operator": "=",
                                "per form": {
                                    "listed": [
                                        "100.000",
                                        "mcg"
                                    ],
                                    "grams": {
                                        "decimal string": "0.000",
                                        "fraction string": "1/10000"
                                    }
                                },
                                "per package": {
                                    "is equivalent": "no",
                                    "listed operator": "=",
                                    "listed": [
                                        "9000.000",
                                        "mcg"
                                    ],
                                    "grams": {
                                        "decimal string": "0.009",
                                        "fraction string": "9/1000"
                                    }
                                }
                            }
                        }
                    }
                ],
                "unites": [],
                "goal": {
                    "days of ingredient": {
                        "mass + mass equivalents": {
                            "per recipe": {
                                "fraction string": "3750",
                                "decimal string": "3750.000"
                            }
                        }
                    }
                }
            },
            {
                "info": {
                    "includes": [],
                    "names": [
                        "calories",
                        "energy"
                    ],
                    "region": 74
                },
                "measures": {},
                "natures": [],
                "unites": [],
                "goal": {}
            },
            {
                "info": {
                    "includes": [],
                    "names": [
                        "iron",
                        "iron, fe"
                    ],
                    "region": 75
                },
                "measures": {
                    "mass + mass equivalents": {
                        "per recipe": {
                            "grams": {
                                "fraction string": "81/50",
                                "scinote string": "1.6200e+0"
                            }
                        },
                        "portion of grove": {
                            "fraction string": "16212958658533785600/454719447176344239977",
                            "scinote percentage string": "3.5655e+0"
                        }
                    }
                },
                "natures": [
                    {
                        "amount": "1",
                        "source": {
                            "name": "Vegan Multivitamin & Mineral Supplement with Greens",
                            "FDC ID": "",
                            "UPC": "8 95634 00002 7",
                            "DSLD ID": "276336"
                        },
                        "ingredient": {
                            "name": "Iron"
                        },
                        "measures": {
                            "mass + mass equivalents": {
                                "is equivalent": "no",
                                "listed operator": "=",
                                "per form": {
                                    "listed": [
                                        "18.000",
                                        "mg"
                                    ],
                                    "grams": {
                                        "decimal string": "0.018",
                                        "fraction string": "9/500"
                                    }
                                },
                                "per package": {
                                    "is equivalent": "no",
                                    "listed operator": "=",
                                    "listed": [
                                        "1620.000",
                                        "mg"
                                    ],
                                    "grams": {
                                        "decimal string": "1.620",
                                        "fraction string": "81/50"
                                    }
                                }
                            }
                        }
                    }
                ],
                "unites": [],
                "goal": {
                    "days of ingredient": {
                        "mass + mass equivalents": {
                            "per recipe": {
                                "fraction string": "90",
                                "decimal string": "90.000"
                            }
                        }
                    }
                }
            },
            {
                "info": {
                    "accepts": [],
                    "includes": [],
                    "names": [
                        "Folate, DFE"
                    ],
                    "region": 76
                },
                "measures": {},
                "natures": [],
                "unites": [],
                "goal": {}
            },
            {
                "info": {
                    "accepts": [],
                    "includes": [],
                    "names": [
                        "Folate",
                        "Folate, Total"
                    ],
                    "region": 77
                },
                "measures": {},
                "natures": [],
                "unites": [],
                "goal": {}
            }
        ]
    },
    "cautionary ingredients": {
        "natures": [
            {
                "amount": "1",
                "identity": {
                    "name": "Vegan Multivitamin & Mineral Supplement with Greens",
                    "FDC ID": "",
                    "UPC": "8 95634 00002 7",
                    "DSLD ID": "276336"
                }
            }
        ],
        "measures": {
            "mass + mass equivalents": {
                "per recipe": {
                    "grams": {
                        "fraction string": "0",
                        "scinote string": "0.0000e+0"
                    }
                }
            },
            "energy": {
                "per recipe": {
                    "food calories": {
                        "fraction string": "0",
                        "scinote string": "0.0000e+0"
                    }
                }
            }
        },
        "grove": [
            {
                "info": {
                    "includes": [],
                    "names": [
                        "trans fat",
                        "fatty acids, total trans"
                    ],
                    "region": 1
                },
                "measures": {},
                "natures": [],
                "unites": []
            }
        ]
    },
    "goal notes": {
        "goal not found for": [],
        "skipped_composition": []
    }
}