{
  "src": "01-raw/2022-10-25/data/label_531.json",
  "id": 270619,
  "nhanesId": "",
  "bundleName": "",
  "fullName": "Organic Lion's Mane Mushroom 1 g Unflavored",
  "brandName": "Nutricost",
  "brandIpSymbol": "®",
  "upcSku": "8 10014 67049 2",
  "productVersionCode": "402126",
  "pdf": "270619_document.pdf",
  "thumbnail": "270619_thumbnail.jpg",
  "servingsPerContainer": "113",
  "hasOuterCarton": false,
  "percentDvFootnote": "Percent Daily Values (DV) are based on a 2,000 calorie diet ",
  "labelRelationships": [],
  "contacts": [
    {
      "contactId": 19196,
      "text": "Distributed by",
      "types": [
        "Distributor"
      ],
      "contactDetails": {
        "src": "01-raw/2023-03-22/data/contact_4.json",
        "id": 19196,
        "name": "Nutricost",
        "streetAddress": "351 E 1750 N Vineyard",
        "city": "",
        "state": "UT",
        "country": "",
        "zipCode": "84059",
        "phoneNumber": "(866) 438-3694",
        "email": "support@nutricost.com",
        "webAddress": "www.nutricost.com"
      }
    }
  ],
  "netContents": [
    {
      "order": 1,
      "quantity": 4,
      "unit": "oz",
      "display": "4 oz"
    },
    {
      "order": 2,
      "quantity": 113,
      "unit": "Gram(s)",
      "display": "113 Gram(s)"
    },
    {
      "order": 3,
      "quantity": 0.25,
      "unit": "Pound(s)",
      "display": "0.25 Pound(s)"
    }
  ],
  "physicalState": {
    "langualCode": "E0162",
    "langualCodeDescription": "Powder"
  },
  "servingSizes": [
    {
      "order": 1,
      "minQuantity": 1,
      "maxQuantity": 1,
      "minDailyServings": 1,
      "maxDailyServings": 1,
      "unit": "Gram(s)",
      "notes": "1 Scoop",
      "inSFB": true
    }
  ],
  "targetGroups": [
    "Vegetarian",
    "Adult (18 - 50 Years)",
    "Organic",
    "Gluten Free"
  ],
  "productType": {
    "langualCode": "A1306",
    "langualCodeDescription": "Botanical"
  },
  "statements": [
    {
      "type": "Suggested/Recommended/Usage/Directions",
      "notes": "Recommended Use: As a dietary supplement, mix 1 scoop daily with 6-10 oz of water or as directed by your healthcare professional."
    },
    {
      "type": "Precautions re: All Other",
      "notes": "Warning: For healthy individuals 18 years and older."
    },
    {
      "type": "Precautions re: Pregnant or Nursing or Prescription Medications",
      "notes": "Consult a healthcare professional prior to use if you are pregnant or nursing, taking medication, or have a medical condition."
    },
    {
      "type": "Precautions re: Children",
      "notes": "Keep out of reach of children."
    },
    {
      "type": "Precautions re: All Other",
      "notes": "Do not use if safety seal is broken or missing."
    },
    {
      "type": "Storage",
      "notes": "Notice: Store in a cool, dry place."
    },
    {
      "type": "General Statements: All Other Content",
      "notes": "Contents are sold by weight, not volume. Some settling may occur."
    },
    {
      "type": "FDA Disclaimer Statement",
      "notes": "These statements have not been evaluated by the Food and Drug Administration. This product is not intended to diagnose, treat, cure, or prevent any disease."
    },
    {
      "type": "Seals/Symbols",
      "notes": "CCOF Certified Organic\nUSDA Organic"
    },
    {
      "type": "Formulation re: Organic",
      "notes": "CCOF Certified Organic\nUSDA Organic"
    },
    {
      "type": "FDA Statement of Identity",
      "notes": "Dietary Supplement"
    },
    {
      "type": "Seals/Symbols",
      "notes": "Quality Guaranteed Nutricost"
    },
    {
      "type": "Formulation re: Vegetarian/Vegan",
      "notes": "Vegetarian"
    },
    {
      "type": "Formulation re: Does NOT Contain",
      "notes": "Gluten-Free Product\nNon-GMO"
    },
    {
      "type": "Formula re: Contains",
      "notes": "Organic lion's mane mushroom 1 g per serving"
    }
  ],
  "claims": [
    {
      "langualCode": "P0115",
      "langualCodeDescription": "All Other"
    },
    {
      "langualCode": "P0265",
      "langualCodeDescription": "Structure/Function"
    }
  ],
  "events": [
    {
      "date": "2022-06-16",
      "type": "Date entered into DSLD"
    }
  ],
  "userGroups": [
    {
      "dailyValueTargetGroupName": "Adults and children 4 or more years of age",
      "langualCode": "P0250",
      "langualCodeDescription": "Adults and Children 4 years and above"
    }
  ],
  "ingredientRows": [
    {
      "order": 1,
      "ingredientId": 283702,
      "description": "",
      "notes": "",
      "quantity": [
        {
          "servingSizeOrder": 1,
          "servingSizeQuantity": 1,
          "operator": "<",
          "quantity": 1,
          "unit": "Gram(s)",
          "dailyValueTargetGroup": [
            {
              "name": "Adults and children 4 or more years of age",
              "operator": "=",
              "percent": 0,
              "footnote": null
            }
          ],
          "servingSizeUnit": "Gram(s)"
        }
      ],
      "nestedRows": [],
      "name": "Total Carbohydrates",
      "category": "sugar",
      "ingredientGroup": "Carbohydrate",
      "uniiCode": "0",
      "alternateNames": [],
      "forms": []
    },
    {
      "order": 2,
      "ingredientId": 273869,
      "description": "",
      "notes": "Organic",
      "quantity": [
        {
          "servingSizeOrder": 1,
          "servingSizeQuantity": 1,
          "operator": "=",
          "quantity": 1,
          "unit": "Gram(s)",
          "dailyValueTargetGroup": [
            {
              "name": "Adults and children 4 or more years of age",
              "operator": null,
              "percent": null,
              "footnote": "Daily Value (DV) Not Established"
            }
          ],
          "servingSizeUnit": "Gram(s)"
        }
      ],
      "nestedRows": [],
      "name": "Lions Mane",
      "category": "other",
      "ingredientGroup": "Hericium mushroom",
      "uniiCode": null,
      "alternateNames": [],
      "forms": []
    }
  ],
  "otheringredients": {
    "text": null,
    "ingredients": [
      {
        "order": 1,
        "ingredientId": 5923,
        "name": "None",
        "category": "other",
        "ingredientGroup": "None",
        "uniiCode": null,
        "alternateNames": [],
        "forms": []
      }
    ]
  },
  "offMarket": 0,
  "entryDate": "2022-06-16"
}