{
  "src": "01-raw/2023-03-22/data/label_349.json",
  "id": 261967,
  "nhanesId": "",
  "bundleName": "",
  "fullName": "Vegan Plant-Based Calcium 1,000 mg",
  "brandName": "PlantFusion",
  "brandIpSymbol": "®",
  "upcSku": "8 40052 40011 9",
  "productVersionCode": "LM1612-6112 T000",
  "pdf": "261967_document.pdf",
  "thumbnail": "261967_thumbnail.jpg",
  "servingsPerContainer": "30",
  "hasOuterCarton": false,
  "percentDvFootnote": "Not Present",
  "labelRelationships": [],
  "contacts": [
    {
      "contactId": 23537,
      "text": null,
      "types": [
        "Manufacturer"
      ],
      "contactDetails": {
        "src": "01-raw/2023-03-22/data/contact_4.json",
        "id": 23537,
        "name": "PlantFusion",
        "streetAddress": "3775 Park Ave #1",
        "city": "Edison",
        "state": "NJ",
        "country": "",
        "zipCode": "08820",
        "phoneNumber": "",
        "email": "",
        "webAddress": "plantfusion.com"
      }
    }
  ],
  "netContents": [
    {
      "order": 1,
      "quantity": 90,
      "unit": "Tablet(s)",
      "display": "90 Tablet(s)"
    }
  ],
  "physicalState": {
    "langualCode": "E0155",
    "langualCodeDescription": "Tablet or Pill"
  },
  "servingSizes": [
    {
      "order": 1,
      "minQuantity": 3,
      "maxQuantity": 3,
      "minDailyServings": 1,
      "maxDailyServings": 1,
      "unit": "Tablet(s)",
      "notes": "",
      "inSFB": true
    }
  ],
  "targetGroups": [
    "Vegan",
    "Vegetarian",
    "Adult (18 - 50 Years)",
    "Gluten Free",
    "Dairy Free",
    "Sugar Free"
  ],
  "productType": {
    "langualCode": "A1325",
    "langualCodeDescription": "Other Combinations"
  },
  "statements": [
    {
      "type": "Formula re: Contains",
      "notes": "Aquamin mineralized red algae is collected in the pristine Artic waters of Iceland. It is rich in calcium, magnesium and 72 trace minerals."
    },
    {
      "type": "Formulation re: Other",
      "notes": "Aquamin helps to mineralize bone cells, and supports bone density and strength. Bone mineralization is also enhanced when taken with Vitamins D-3 and K-2."
    },
    {
      "type": "Formula re: Contains",
      "notes": "Bone mineralization is also enhanced when taken with Vitamins D-3 and K-2."
    },
    {
      "type": "Formulation re: Does NOT Contain",
      "notes": "Contains no sugar, dairy, yeast, wheat, gluten, eggs, peanuts, soy, tree nuts, fish, shellfish, preservatives, artificial colors or flavors.\n"
    },
    {
      "type": "Suggested/Recommended/Usage/Directions",
      "notes": "Suggested Use: As a dietary supplement, adults take three (3) tablets daily, preferably with a meal, or as directed by a health care professional."
    },
    {
      "type": "Storage",
      "notes": "Store in a cool, dry place away from direct light.\t\n"
    },
    {
      "type": "Brand IP Statement(s) re: (c), (TM), (SM)",
      "notes": "Aquamin is a trademark of Marigot Limited."
    },
    {
      "type": "Precautions re: Children",
      "notes": "Keep out of reach of children.\n"
    },
    {
      "type": "Formulation re: Other",
      "notes": "Supports bone density & strength"
    },
    {
      "type": "Seals/Symbols",
      "notes": "Certified\nVegan\nVegan.org"
    },
    {
      "type": "Formulation re: Vegetarian/Vegan",
      "notes": "Certified\nVegan\nVegan.org"
    },
    {
      "type": "FDA Statement of Identity",
      "notes": "Dietary Supplement"
    },
    {
      "type": "FDA Disclaimer Statement",
      "notes": "These statements have not been evaluated by the Food and Drug Administration. This product is not intended to diagnose, treat, cure or prevent any disease."
    }
  ],
  "claims": [
    {
      "langualCode": "P0065",
      "langualCodeDescription": "Nutrient "
    },
    {
      "langualCode": "P0115",
      "langualCodeDescription": "All Other"
    },
    {
      "langualCode": "P0265",
      "langualCodeDescription": "Structure/Function"
    }
  ],
  "events": [
    {
      "date": "2022-06-16",
      "type": "Date entered into DSLD"
    }
  ],
  "userGroups": [
    {
      "dailyValueTargetGroupName": "Adults and children 4 or more years of age",
      "langualCode": "P0250",
      "langualCodeDescription": "Adults and Children 4 years and above"
    }
  ],
  "ingredientRows": [
    {
      "order": 1,
      "ingredientId": 123625,
      "description": "",
      "notes": "800 IU",
      "quantity": [
        {
          "servingSizeOrder": 1,
          "servingSizeQuantity": 3,
          "operator": "=",
          "quantity": 20,
          "unit": "mcg",
          "dailyValueTargetGroup": [
            {
              "name": "Adults and children 4 or more years of age",
              "operator": "=",
              "percent": 100,
              "footnote": null
            }
          ],
          "servingSizeUnit": "Tablet(s)"
        }
      ],
      "nestedRows": [],
      "name": "Vitamin D3",
      "category": "vitamin",
      "ingredientGroup": "Vitamin D (cholecalciferol)",
      "uniiCode": null,
      "alternateNames": [],
      "forms": [
        {
          "order": 1,
          "ingredientId": 123626,
          "prefix": "from",
          "percent": null,
          "name": "Lichen"
        }
      ]
    },
    {
      "order": 2,
      "ingredientId": 130844,
      "description": "",
      "notes": "",
      "quantity": [
        {
          "servingSizeOrder": 1,
          "servingSizeQuantity": 3,
          "operator": "=",
          "quantity": 85,
          "unit": "mcg",
          "dailyValueTargetGroup": [
            {
              "name": "Adults and children 4 or more years of age",
              "operator": "=",
              "percent": 71,
              "footnote": null
            }
          ],
          "servingSizeUnit": "Tablet(s)"
        }
      ],
      "nestedRows": [],
      "name": "Vitamin K2",
      "category": "vitamin",
      "ingredientGroup": "Vitamin K (menaquinone)",
      "uniiCode": null,
      "alternateNames": [],
      "forms": [
        {
          "order": 1,
          "ingredientId": 291881,
          "prefix": "as",
          "percent": null,
          "name": "Menaquinone-7"
        }
      ]
    },
    {
      "order": 3,
      "ingredientId": 303620,
      "description": "",
      "notes": "",
      "quantity": [
        {
          "servingSizeOrder": 1,
          "servingSizeQuantity": 3,
          "operator": "=",
          "quantity": 1000,
          "unit": "mg",
          "dailyValueTargetGroup": [
            {
              "name": "Adults and children 4 or more years of age",
              "operator": "=",
              "percent": 77,
              "footnote": null
            }
          ],
          "servingSizeUnit": "Tablet(s)"
        }
      ],
      "nestedRows": [],
      "name": "Calcium",
      "category": "mineral",
      "ingredientGroup": "Calcium",
      "uniiCode": "SY7Q814VUP",
      "alternateNames": [
        "Ca"
      ],
      "forms": [
        {
          "order": 1,
          "ingredientId": 303619,
          "prefix": null,
          "percent": null,
          "name": "Aquamin"
        }
      ]
    },
    {
      "order": 4,
      "ingredientId": 303621,
      "description": "",
      "notes": "",
      "quantity": [
        {
          "servingSizeOrder": 1,
          "servingSizeQuantity": 3,
          "operator": "=",
          "quantity": 96,
          "unit": "mg",
          "dailyValueTargetGroup": [
            {
              "name": "Adults and children 4 or more years of age",
              "operator": "=",
              "percent": 23,
              "footnote": null
            }
          ],
          "servingSizeUnit": "Tablet(s)"
        }
      ],
      "nestedRows": [],
      "name": "Magnesium",
      "category": "mineral",
      "ingredientGroup": "Magnesium",
      "uniiCode": "I38ZP9992A",
      "alternateNames": [
        "Mg"
      ],
      "forms": [
        {
          "order": 1,
          "ingredientId": 303619,
          "prefix": null,
          "percent": null,
          "name": "Aquamin"
        }
      ]
    },
    {
      "order": 5,
      "ingredientId": 303622,
      "description": "",
      "notes": "",
      "quantity": [
        {
          "servingSizeOrder": 1,
          "servingSizeQuantity": 3,
          "operator": "=",
          "quantity": 7,
          "unit": "mg",
          "dailyValueTargetGroup": [
            {
              "name": "Adults and children 4 or more years of age",
              "operator": null,
              "percent": null,
              "footnote": "Daily Value not established"
            }
          ],
          "servingSizeUnit": "Tablet(s)"
        }
      ],
      "nestedRows": [],
      "name": "Strontium",
      "category": "mineral",
      "ingredientGroup": "Strontium",
      "uniiCode": "YZS2RPE8LE",
      "alternateNames": [
        "Sr"
      ],
      "forms": [
        {
          "order": 1,
          "ingredientId": 303619,
          "prefix": null,
          "percent": null,
          "name": "Aquamin"
        }
      ]
    },
    {
      "order": 6,
      "ingredientId": 303623,
      "description": "",
      "notes": "",
      "quantity": [
        {
          "servingSizeOrder": 1,
          "servingSizeQuantity": 3,
          "operator": "=",
          "quantity": 3,
          "unit": "mg",
          "dailyValueTargetGroup": [
            {
              "name": "Adults and children 4 or more years of age",
              "operator": null,
              "percent": null,
              "footnote": "Daily Value not established"
            }
          ],
          "servingSizeUnit": "Tablet(s)"
        }
      ],
      "nestedRows": [],
      "name": "Silica",
      "category": "mineral",
      "ingredientGroup": "Silicon",
      "uniiCode": "ETJ7Z6XBU4",
      "alternateNames": [],
      "forms": [
        {
          "order": 1,
          "ingredientId": 303619,
          "prefix": null,
          "percent": null,
          "name": "Aquamin"
        }
      ]
    },
    {
      "order": 7,
      "ingredientId": 303624,
      "description": "",
      "notes": "",
      "quantity": [
        {
          "servingSizeOrder": 1,
          "servingSizeQuantity": 3,
          "operator": "=",
          "quantity": 93,
          "unit": "mcg",
          "dailyValueTargetGroup": [
            {
              "name": "Adults and children 4 or more years of age",
              "operator": null,
              "percent": null,
              "footnote": "Daily Value not established"
            }
          ],
          "servingSizeUnit": "Tablet(s)"
        }
      ],
      "nestedRows": [],
      "name": "Boron",
      "category": "mineral",
      "ingredientGroup": "Boron",
      "uniiCode": "N9E3X5056Q",
      "alternateNames": [],
      "forms": [
        {
          "order": 1,
          "ingredientId": 303619,
          "prefix": null,
          "percent": null,
          "name": "Aquamin"
        }
      ]
    },
    {
      "order": 8,
      "ingredientId": 303625,
      "description": "",
      "notes": "",
      "quantity": [
        {
          "servingSizeOrder": 1,
          "servingSizeQuantity": 3,
          "operator": "=",
          "quantity": 26,
          "unit": "mcg",
          "dailyValueTargetGroup": [
            {
              "name": "Adults and children 4 or more years of age",
              "operator": null,
              "percent": null,
              "footnote": "Daily Value not established"
            }
          ],
          "servingSizeUnit": "Tablet(s)"
        }
      ],
      "nestedRows": [],
      "name": "Vanadium",
      "category": "mineral",
      "ingredientGroup": "Vanadium",
      "uniiCode": "00J9J9XKDE",
      "alternateNames": [],
      "forms": [
        {
          "order": 1,
          "ingredientId": 303619,
          "prefix": null,
          "percent": null,
          "name": "Aquamin"
        }
      ]
    },
    {
      "order": 9,
      "ingredientId": 305074,
      "description": "",
      "notes": "place holder",
      "quantity": [
        {
          "servingSizeOrder": 1,
          "servingSizeQuantity": 3,
          "operator": "=",
          "quantity": 3535,
          "unit": "mg",
          "dailyValueTargetGroup": [
            {
              "name": "Adults and children 4 or more years of age",
              "operator": null,
              "percent": null,
              "footnote": "Daily Value not established"
            }
          ],
          "servingSizeUnit": "Tablet(s)"
        }
      ],
      "nestedRows": [
        {
          "order": 10,
          "ingredientId": 303618,
          "description": "",
          "notes": "mineralized",
          "quantity": [
            {
              "servingSizeOrder": 1,
              "servingSizeQuantity": 3,
              "operator": "=",
              "quantity": 0,
              "unit": "NP",
              "dailyValueTargetGroup": [],
              "servingSizeUnit": "Tablet(s)"
            }
          ],
          "nestedRows": [],
          "name": "Icelandic Red Algae",
          "category": "botanical",
          "ingredientGroup": "Red Algae",
          "uniiCode": "0",
          "alternateNames": [],
          "forms": []
        },
        {
          "order": 11,
          "ingredientId": 7248,
          "description": "",
          "notes": "organic",
          "quantity": [
            {
              "servingSizeOrder": 1,
              "servingSizeQuantity": 3,
              "operator": "=",
              "quantity": 0,
              "unit": "NP",
              "dailyValueTargetGroup": [],
              "servingSizeUnit": "Tablet(s)"
            }
          ],
          "nestedRows": [],
          "name": "Strawberry",
          "category": "botanical",
          "ingredientGroup": "Strawberry",
          "uniiCode": null,
          "alternateNames": [],
          "forms": []
        },
        {
          "order": 12,
          "ingredientId": 4584,
          "description": "",
          "notes": "organic",
          "quantity": [
            {
              "servingSizeOrder": 1,
              "servingSizeQuantity": 3,
              "operator": "=",
              "quantity": 0,
              "unit": "NP",
              "dailyValueTargetGroup": [],
              "servingSizeUnit": "Tablet(s)"
            }
          ],
          "nestedRows": [],
          "name": "Raspberry",
          "category": "botanical",
          "ingredientGroup": "Raspberry (unspecified)",
          "uniiCode": null,
          "alternateNames": [],
          "forms": []
        },
        {
          "order": 13,
          "ingredientId": 11948,
          "description": "",
          "notes": "organic",
          "quantity": [
            {
              "servingSizeOrder": 1,
              "servingSizeQuantity": 3,
              "operator": "=",
              "quantity": 0,
              "unit": "NP",
              "dailyValueTargetGroup": [],
              "servingSizeUnit": "Tablet(s)"
            }
          ],
          "nestedRows": [],
          "name": "Blueberry",
          "category": "botanical",
          "ingredientGroup": "Blueberry",
          "uniiCode": null,
          "alternateNames": [],
          "forms": []
        },
        {
          "order": 14,
          "ingredientId": 7252,
          "description": "",
          "notes": "organic",
          "quantity": [
            {
              "servingSizeOrder": 1,
              "servingSizeQuantity": 3,
              "operator": "=",
              "quantity": 0,
              "unit": "NP",
              "dailyValueTargetGroup": [],
              "servingSizeUnit": "Tablet(s)"
            }
          ],
          "nestedRows": [],
          "name": "Tart Cherry",
          "category": "botanical",
          "ingredientGroup": "Sour Cherry",
          "uniiCode": null,
          "alternateNames": [],
          "forms": []
        },
        {
          "order": 15,
          "ingredientId": 7186,
          "description": "",
          "notes": "organic",
          "quantity": [
            {
              "servingSizeOrder": 1,
              "servingSizeQuantity": 3,
              "operator": "=",
              "quantity": 0,
              "unit": "NP",
              "dailyValueTargetGroup": [],
              "servingSizeUnit": "Tablet(s)"
            }
          ],
          "nestedRows": [],
          "name": "Pomegranate",
          "category": "botanical",
          "ingredientGroup": "Pomegranate",
          "uniiCode": null,
          "alternateNames": [],
          "forms": []
        },
        {
          "order": 16,
          "ingredientId": 7010,
          "description": "",
          "notes": "organic",
          "quantity": [
            {
              "servingSizeOrder": 1,
              "servingSizeQuantity": 3,
              "operator": "=",
              "quantity": 0,
              "unit": "NP",
              "dailyValueTargetGroup": [],
              "servingSizeUnit": "Tablet(s)"
            }
          ],
          "nestedRows": [],
          "name": "Cranberry",
          "category": "botanical",
          "ingredientGroup": "cranberry",
          "uniiCode": null,
          "alternateNames": [],
          "forms": []
        },
        {
          "order": 17,
          "ingredientId": 151994,
          "description": "",
          "notes": "",
          "quantity": [
            {
              "servingSizeOrder": 1,
              "servingSizeQuantity": 3,
              "operator": "=",
              "quantity": 0,
              "unit": "NP",
              "dailyValueTargetGroup": [],
              "servingSizeUnit": "Tablet(s)"
            }
          ],
          "nestedRows": [],
          "name": "Broccoli Sprouts",
          "category": "botanical",
          "ingredientGroup": "Broccoli",
          "uniiCode": null,
          "alternateNames": [],
          "forms": []
        },
        {
          "order": 18,
          "ingredientId": 289502,
          "description": "",
          "notes": "oraganic",
          "quantity": [
            {
              "servingSizeOrder": 1,
              "servingSizeQuantity": 3,
              "operator": "=",
              "quantity": 0,
              "unit": "NP",
              "dailyValueTargetGroup": [],
              "servingSizeUnit": "Tablet(s)"
            }
          ],
          "nestedRows": [],
          "name": "Broccoli",
          "category": "botanical",
          "ingredientGroup": "Broccoli",
          "uniiCode": "UOI4FT57BZ",
          "alternateNames": [],
          "forms": []
        },
        {
          "order": 19,
          "ingredientId": 4184,
          "description": "",
          "notes": "organic",
          "quantity": [
            {
              "servingSizeOrder": 1,
              "servingSizeQuantity": 3,
              "operator": "=",
              "quantity": 0,
              "unit": "NP",
              "dailyValueTargetGroup": [],
              "servingSizeUnit": "Tablet(s)"
            }
          ],
          "nestedRows": [],
          "name": "Tomato",
          "category": "botanical",
          "ingredientGroup": "Tomato",
          "uniiCode": null,
          "alternateNames": [],
          "forms": []
        },
        {
          "order": 20,
          "ingredientId": 7148,
          "description": "",
          "notes": "organic",
          "quantity": [
            {
              "servingSizeOrder": 1,
              "servingSizeQuantity": 3,
              "operator": "=",
              "quantity": 0,
              "unit": "NP",
              "dailyValueTargetGroup": [],
              "servingSizeUnit": "Tablet(s)"
            }
          ],
          "nestedRows": [],
          "name": "Carrot",
          "category": "botanical",
          "ingredientGroup": "Carrot ",
          "uniiCode": null,
          "alternateNames": [],
          "forms": []
        },
        {
          "order": 21,
          "ingredientId": 12190,
          "description": "",
          "notes": "organic",
          "quantity": [
            {
              "servingSizeOrder": 1,
              "servingSizeQuantity": 3,
              "operator": "=",
              "quantity": 0,
              "unit": "NP",
              "dailyValueTargetGroup": [],
              "servingSizeUnit": "Tablet(s)"
            }
          ],
          "nestedRows": [],
          "name": "Spinach",
          "category": "botanical",
          "ingredientGroup": "Spinach",
          "uniiCode": null,
          "alternateNames": [],
          "forms": []
        },
        {
          "order": 22,
          "ingredientId": 6507,
          "description": "",
          "notes": "organic",
          "quantity": [
            {
              "servingSizeOrder": 1,
              "servingSizeQuantity": 3,
              "operator": "=",
              "quantity": 0,
              "unit": "NP",
              "dailyValueTargetGroup": [],
              "servingSizeUnit": "Tablet(s)"
            }
          ],
          "nestedRows": [],
          "name": "Kale",
          "category": "botanical",
          "ingredientGroup": "Kale",
          "uniiCode": null,
          "alternateNames": [],
          "forms": []
        }
      ],
      "name": "Organic Vegan & Red Algae Blend",
      "category": "blend",
      "ingredientGroup": "Blend",
      "uniiCode": "1",
      "alternateNames": [],
      "forms": []
    }
  ],
  "otheringredients": {
    "text": null,
    "ingredients": [
      {
        "order": 1,
        "ingredientId": 9747,
        "name": "Cellulose",
        "category": "fiber",
        "ingredientGroup": "Cellulose",
        "uniiCode": null,
        "alternateNames": [],
        "forms": []
      },
      {
        "order": 2,
        "ingredientId": 4048,
        "name": "Magnesium Stearate",
        "category": "other",
        "ingredientGroup": "Magnesium stearate",
        "uniiCode": null,
        "alternateNames": [],
        "forms": []
      },
      {
        "order": 3,
        "ingredientId": 3713,
        "name": "Food Glaze",
        "category": "other",
        "ingredientGroup": "Coating",
        "uniiCode": null,
        "alternateNames": [],
        "forms": []
      },
      {
        "order": 4,
        "ingredientId": 7866,
        "name": "Silica",
        "category": "mineral",
        "ingredientGroup": "Silicon",
        "uniiCode": null,
        "alternateNames": [],
        "forms": []
      }
    ]
  },
  "offMarket": 0,
  "entryDate": "2022-06-16"
}