{
  "src": "01-raw/2023-03-22/data/label_175.json",
  "id": 249664,
  "nhanesId": "",
  "bundleName": "",
  "fullName": "Iron Free Vegan Multivitamin & Mineral Supplement",
  "brandName": "DEVA",
  "brandIpSymbol": "®",
  "upcSku": "8 95634 00019 5",
  "productVersionCode": "SKU 15001 V.16",
  "pdf": "",
  "thumbnail": "",
  "servingsPerContainer": "90",
  "hasOuterCarton": false,
  "percentDvFootnote": "Not Present",
  "labelRelationships": [
    {
      "type": "Image difference, same product",
      "labelId": 105916
    }
  ],
  "contacts": [
    {
      "contactId": 15472,
      "text": "Manufactured for Distribution by",
      "types": [
        "Distributor"
      ],
      "contactDetails": {
        "src": "01-raw/2023-03-22/data/contact_3.json",
        "id": 15472,
        "name": "DEVA Nutrition LLC",
        "streetAddress": "",
        "city": "",
        "state": "",
        "country": "",
        "zipCode": "",
        "phoneNumber": "(888)988-3382",
        "email": "",
        "webAddress": "www.devanutrition.com"
      }
    }
  ],
  "netContents": [
    {
      "order": 1,
      "quantity": 90,
      "unit": "Coated Tablet(s)",
      "display": "90 Coated Tablet(s)"
    }
  ],
  "physicalState": {
    "langualCode": "E0155",
    "langualCodeDescription": "Tablet or Pill"
  },
  "servingSizes": [
    {
      "order": 1,
      "minQuantity": 1,
      "maxQuantity": 1,
      "minDailyServings": 1,
      "maxDailyServings": 1,
      "unit": "Tablet(s)",
      "notes": "",
      "inSFB": true
    }
  ],
  "targetGroups": [
    "Vegan",
    "Vegetarian",
    "Adult (18 - 50 Years)",
    "Gluten Free",
    "Dairy Free",
    "Sugar Free"
  ],
  "productType": {
    "langualCode": "A1325",
    "langualCodeDescription": "Other Combinations"
  },
  "statements": [
    {
      "type": "Suggested/Recommended/Usage/Directions",
      "notes": "Directions: For adults, take one (1) tablet daily with food or as directed by a doctor."
    },
    {
      "type": "Formulation re: Vegetarian/Vegan",
      "notes": "Vegan\nThis product does not contain animal products, derivatives or byproducts. 100% vegetarian, goodest. This product is registered with the goodest society."
    },
    {
      "type": "Formulation re: Does NOT Contain",
      "notes": "Food Sensitivity: Free of yeast, wheat, gluten, dairy, egg, salt, shellfish, sugar, animal products, byproducts or derivatives."
    },
    {
      "type": "Storage",
      "notes": "Store in a cool, dry place."
    },
    {
      "type": "Precautions re: All Other",
      "notes": "Tamper Evident: Do not use if imprinted seal under cap is broken."
    },
    {
      "type": "Precautions re: Children",
      "notes": "Keep out of reach of children."
    },
    {
      "type": "Formulation re: Does NOT Contain",
      "notes": "Iron free"
    },
    {
      "type": "FDA Statement of Identity",
      "notes": "Multivitamin & Mineral Supplement"
    },
    {
      "type": "Formula re: Contains",
      "notes": "With greens"
    },
    {
      "type": "Suggested/Recommended/Usage/Directions",
      "notes": "One daily"
    }
  ],
  "claims": [
    {
      "langualCode": "P0065",
      "langualCodeDescription": "Nutrient "
    },
    {
      "langualCode": "P0115",
      "langualCodeDescription": "All Other"
    }
  ],
  "events": [
    {
      "date": "2021-06-23",
      "type": "Date entered into DSLD"
    }
  ],
  "userGroups": [
    {
      "dailyValueTargetGroupName": "Adults and children 4 or more years of age",
      "langualCode": "P0250",
      "langualCodeDescription": "Adults and Children 4 years and above"
    }
  ],
  "ingredientRows": [
    {
      "order": 1,
      "ingredientId": 278398,
      "description": "",
      "notes": "Vitamin A (Form: as Beta Carotene, & Vitamin A Acetate) ",
      "quantity": [
        {
          "servingSizeOrder": 1,
          "servingSizeQuantity": 1,
          "operator": "=",
          "quantity": 5000,
          "unit": "IU",
          "dailyValueTargetGroup": [
            {
              "name": "Adults and children 4 or more years of age",
              "operator": "=",
              "percent": 100,
              "footnote": null
            }
          ],
          "servingSizeUnit": "Tablet(s)"
        }
      ],
      "nestedRows": [],
      "name": "Vitamin A",
      "category": "vitamin",
      "ingredientGroup": "Vitamin A (unspecified)",
      "uniiCode": null,
      "alternateNames": [],
      "forms": [
        {
          "order": 1,
          "ingredientId": 280109,
          "prefix": "as",
          "percent": null,
          "name": "Beta-Carotene"
        },
        {
          "order": 2,
          "ingredientId": 279033,
          "prefix": "&",
          "percent": null,
          "name": "Vitamin A Acetate"
        }
      ]
    },
    {
      "order": 2,
      "ingredientId": 278603,
      "description": "",
      "notes": "",
      "quantity": [
        {
          "servingSizeOrder": 1,
          "servingSizeQuantity": 1,
          "operator": "=",
          "quantity": 150,
          "unit": "mg",
          "dailyValueTargetGroup": [
            {
              "name": "Adults and children 4 or more years of age",
              "operator": "=",
              "percent": 250,
              "footnote": null
            }
          ],
          "servingSizeUnit": "Tablet(s)"
        }
      ],
      "nestedRows": [],
      "name": "Vitamin C",
      "category": "vitamin",
      "ingredientGroup": "Vitamin C",
      "uniiCode": "PQ6CK8PD0R",
      "alternateNames": [],
      "forms": [
        {
          "order": 1,
          "ingredientId": 278604,
          "prefix": null,
          "percent": null,
          "name": "Ascorbic Acid"
        }
      ]
    },
    {
      "order": 3,
      "ingredientId": 280369,
      "description": "",
      "notes": "",
      "quantity": [
        {
          "servingSizeOrder": 1,
          "servingSizeQuantity": 1,
          "operator": "=",
          "quantity": 400,
          "unit": "IU",
          "dailyValueTargetGroup": [
            {
              "name": "Adults and children 4 or more years of age",
              "operator": "=",
              "percent": 100,
              "footnote": null
            }
          ],
          "servingSizeUnit": "Tablet(s)"
        }
      ],
      "nestedRows": [],
      "name": "Vitamin D2",
      "category": "vitamin",
      "ingredientGroup": "Vitamin D",
      "uniiCode": "VS041H42XC",
      "alternateNames": [],
      "forms": [
        {
          "order": 1,
          "ingredientId": 280175,
          "prefix": null,
          "percent": null,
          "name": "Ergocalciferol"
        }
      ]
    },
    {
      "order": 4,
      "ingredientId": 281939,
      "description": "",
      "notes": "Vitamin E (Form: as D-Alpha Tocopheryl) ",
      "quantity": [
        {
          "servingSizeOrder": 1,
          "servingSizeQuantity": 1,
          "operator": "=",
          "quantity": 50,
          "unit": "IU",
          "dailyValueTargetGroup": [
            {
              "name": "Adults and children 4 or more years of age",
              "operator": "=",
              "percent": 167,
              "footnote": null
            }
          ],
          "servingSizeUnit": "Tablet(s)"
        }
      ],
      "nestedRows": [],
      "name": "Vitamin E",
      "category": "vitamin",
      "ingredientGroup": "Vitamin E",
      "uniiCode": "H4N855PNZ1",
      "alternateNames": [],
      "forms": [
        {
          "order": 1,
          "ingredientId": 280500,
          "prefix": null,
          "percent": null,
          "name": "D-Alpha-Tocopheryl"
        }
      ]
    },
    {
      "order": 5,
      "ingredientId": 279052,
      "description": "",
      "notes": "Vitamin B1 (Form: as Thiamine Mononitrate) ",
      "quantity": [
        {
          "servingSizeOrder": 1,
          "servingSizeQuantity": 1,
          "operator": "=",
          "quantity": 12.5,
          "unit": "mg",
          "dailyValueTargetGroup": [
            {
              "name": "Adults and children 4 or more years of age",
              "operator": "=",
              "percent": 833,
              "footnote": null
            }
          ],
          "servingSizeUnit": "Tablet(s)"
        }
      ],
      "nestedRows": [],
      "name": "Vitamin B1",
      "category": "vitamin",
      "ingredientGroup": "Thiamin",
      "uniiCode": "X66NSO3N35",
      "alternateNames": [],
      "forms": [
        {
          "order": 1,
          "ingredientId": 278857,
          "prefix": null,
          "percent": null,
          "name": "Thiamine Mononitrate"
        }
      ]
    },
    {
      "order": 6,
      "ingredientId": 274406,
      "description": "",
      "notes": "",
      "quantity": [
        {
          "servingSizeOrder": 1,
          "servingSizeQuantity": 1,
          "operator": "=",
          "quantity": 12.5,
          "unit": "mg",
          "dailyValueTargetGroup": [
            {
              "name": "Adults and children 4 or more years of age",
              "operator": "=",
              "percent": 735,
              "footnote": null
            }
          ],
          "servingSizeUnit": "Tablet(s)"
        }
      ],
      "nestedRows": [],
      "name": "Vitamin B2",
      "category": "vitamin",
      "ingredientGroup": "Vitamin B2",
      "uniiCode": null,
      "alternateNames": [
        "Riboflavin"
      ],
      "forms": []
    },
    {
      "order": 7,
      "ingredientId": 280857,
      "description": "",
      "notes": "Vitamin B3 (Form: as Niacinamide) ",
      "quantity": [
        {
          "servingSizeOrder": 1,
          "servingSizeQuantity": 1,
          "operator": "=",
          "quantity": 50,
          "unit": "mg",
          "dailyValueTargetGroup": [
            {
              "name": "Adults and children 4 or more years of age",
              "operator": "=",
              "percent": 250,
              "footnote": null
            }
          ],
          "servingSizeUnit": "Tablet(s)"
        }
      ],
      "nestedRows": [],
      "name": "Vitamin B3",
      "category": "vitamin",
      "ingredientGroup": "Niacin",
      "uniiCode": "2679MF687A",
      "alternateNames": [],
      "forms": [
        {
          "order": 1,
          "ingredientId": 280445,
          "prefix": null,
          "percent": null,
          "name": "Niacinamide"
        }
      ]
    },
    {
      "order": 8,
      "ingredientId": 280455,
      "description": "",
      "notes": "Vitamin B6 (Form: as Pyridoxine HCl) ",
      "quantity": [
        {
          "servingSizeOrder": 1,
          "servingSizeQuantity": 1,
          "operator": "=",
          "quantity": 12.5,
          "unit": "mg",
          "dailyValueTargetGroup": [
            {
              "name": "Adults and children 4 or more years of age",
              "operator": "=",
              "percent": 625,
              "footnote": null
            }
          ],
          "servingSizeUnit": "Tablet(s)"
        }
      ],
      "nestedRows": [],
      "name": "Vitamin B6",
      "category": "vitamin",
      "ingredientGroup": "Vitamin B6",
      "uniiCode": "KV2JZ1BI6Z",
      "alternateNames": [],
      "forms": [
        {
          "order": 1,
          "ingredientId": 280215,
          "prefix": null,
          "percent": null,
          "name": "Pyridoxine Hydrochloride"
        }
      ]
    },
    {
      "order": 9,
      "ingredientId": 278847,
      "description": "",
      "notes": "",
      "quantity": [
        {
          "servingSizeOrder": 1,
          "servingSizeQuantity": 1,
          "operator": "=",
          "quantity": 400,
          "unit": "mcg",
          "dailyValueTargetGroup": [
            {
              "name": "Adults and children 4 or more years of age",
              "operator": "=",
              "percent": 100,
              "footnote": null
            }
          ],
          "servingSizeUnit": "Tablet(s)"
        }
      ],
      "nestedRows": [],
      "name": "Folate",
      "category": "vitamin",
      "ingredientGroup": "Folate",
      "uniiCode": "935E97BOY8",
      "alternateNames": [],
      "forms": [
        {
          "order": 1,
          "ingredientId": 279040,
          "prefix": null,
          "percent": null,
          "name": "Folic Acid"
        }
      ]
    },
    {
      "order": 10,
      "ingredientId": 281279,
      "description": "",
      "notes": "Vitamin B12 (Form: as Cyanocobalamin) ",
      "quantity": [
        {
          "servingSizeOrder": 1,
          "servingSizeQuantity": 1,
          "operator": "=",
          "quantity": 100,
          "unit": "mcg",
          "dailyValueTargetGroup": [
            {
              "name": "Adults and children 4 or more years of age",
              "operator": "=",
              "percent": 1667,
              "footnote": null
            }
          ],
          "servingSizeUnit": "Tablet(s)"
        }
      ],
      "nestedRows": [],
      "name": "Vitamin B12",
      "category": "vitamin",
      "ingredientGroup": "Vitamin B12",
      "uniiCode": "8406EY2OQA",
      "alternateNames": [],
      "forms": [
        {
          "order": 1,
          "ingredientId": 280323,
          "prefix": null,
          "percent": null,
          "name": "Cyanocobalamin"
        }
      ]
    },
    {
      "order": 11,
      "ingredientId": 280218,
      "description": "",
      "notes": "",
      "quantity": [
        {
          "servingSizeOrder": 1,
          "servingSizeQuantity": 1,
          "operator": "=",
          "quantity": 75,
          "unit": "mcg",
          "dailyValueTargetGroup": [
            {
              "name": "Adults and children 4 or more years of age",
              "operator": "=",
              "percent": 25,
              "footnote": null
            }
          ],
          "servingSizeUnit": "Tablet(s)"
        }
      ],
      "nestedRows": [],
      "name": "Biotin",
      "category": "vitamin",
      "ingredientGroup": "Biotin",
      "uniiCode": "6SO6U10H04",
      "alternateNames": [],
      "forms": []
    },
    {
      "order": 12,
      "ingredientId": 281400,
      "description": "",
      "notes": "Vitamin B5 (Form: as D-Calcium Pantothenate) ",
      "quantity": [
        {
          "servingSizeOrder": 1,
          "servingSizeQuantity": 1,
          "operator": "=",
          "quantity": 25,
          "unit": "mg",
          "dailyValueTargetGroup": [
            {
              "name": "Adults and children 4 or more years of age",
              "operator": "=",
              "percent": 250,
              "footnote": null
            }
          ],
          "servingSizeUnit": "Tablet(s)"
        }
      ],
      "nestedRows": [],
      "name": "Vitamin B5",
      "category": "vitamin",
      "ingredientGroup": "Vitamin B5",
      "uniiCode": "19F5HK2737",
      "alternateNames": [],
      "forms": [
        {
          "order": 1,
          "ingredientId": 293281,
          "prefix": null,
          "percent": null,
          "name": "D-Calcium Pantothenate"
        }
      ]
    },
    {
      "order": 13,
      "ingredientId": 292683,
      "description": "",
      "notes": "Calcium (Form: as Calcium Carbonate) ",
      "quantity": [
        {
          "servingSizeOrder": 1,
          "servingSizeQuantity": 1,
          "operator": "=",
          "quantity": 100,
          "unit": "mg",
          "dailyValueTargetGroup": [
            {
              "name": "Adults and children 4 or more years of age",
              "operator": "=",
              "percent": 10,
              "footnote": null
            }
          ],
          "servingSizeUnit": "Tablet(s)"
        }
      ],
      "nestedRows": [],
      "name": "Calcium",
      "category": "mineral",
      "ingredientGroup": "Calcium",
      "uniiCode": "SY7Q814VUP",
      "alternateNames": [
        "Ca"
      ],
      "forms": [
        {
          "order": 1,
          "ingredientId": 292621,
          "prefix": null,
          "percent": null,
          "name": "Calcium Carbonate"
        }
      ]
    },
    {
      "order": 14,
      "ingredientId": 74921,
      "description": "",
      "notes": "Iodine (Form: from Kelp PlantPart: whole plant) ",
      "quantity": [
        {
          "servingSizeOrder": 1,
          "servingSizeQuantity": 1,
          "operator": "=",
          "quantity": 150,
          "unit": "mcg",
          "dailyValueTargetGroup": [
            {
              "name": "Adults and children 4 or more years of age",
              "operator": "=",
              "percent": 100,
              "footnote": null
            }
          ],
          "servingSizeUnit": "Tablet(s)"
        }
      ],
      "nestedRows": [],
      "name": "Iodine",
      "category": "mineral",
      "ingredientGroup": "Iodine",
      "uniiCode": null,
      "alternateNames": [],
      "forms": [
        {
          "order": 1,
          "ingredientId": 32958,
          "prefix": "from",
          "percent": null,
          "name": "Kelp"
        }
      ]
    },
    {
      "order": 15,
      "ingredientId": 63279,
      "description": "",
      "notes": "Magnesium (Form: as Magnesium Oxide) ",
      "quantity": [
        {
          "servingSizeOrder": 1,
          "servingSizeQuantity": 1,
          "operator": "=",
          "quantity": 40,
          "unit": "mg",
          "dailyValueTargetGroup": [
            {
              "name": "Adults and children 4 or more years of age",
              "operator": "=",
              "percent": 10,
              "footnote": null
            }
          ],
          "servingSizeUnit": "Tablet(s)"
        }
      ],
      "nestedRows": [],
      "name": "Magnesium",
      "category": "mineral",
      "ingredientGroup": "Magnesium",
      "uniiCode": null,
      "alternateNames": [],
      "forms": [
        {
          "order": 1,
          "ingredientId": 27359,
          "prefix": "as",
          "percent": null,
          "name": "Magnesium Oxide"
        }
      ]
    },
    {
      "order": 16,
      "ingredientId": 292524,
      "description": "",
      "notes": "Zinc (Form: as Zinc Oxide) ",
      "quantity": [
        {
          "servingSizeOrder": 1,
          "servingSizeQuantity": 1,
          "operator": "=",
          "quantity": 11,
          "unit": "mg",
          "dailyValueTargetGroup": [
            {
              "name": "Adults and children 4 or more years of age",
              "operator": "=",
              "percent": 73,
              "footnote": null
            }
          ],
          "servingSizeUnit": "Tablet(s)"
        }
      ],
      "nestedRows": [],
      "name": "Zinc",
      "category": "mineral",
      "ingredientGroup": "Zinc",
      "uniiCode": "J41CSQ7QDS",
      "alternateNames": [
        "Zn"
      ],
      "forms": [
        {
          "order": 1,
          "ingredientId": 292523,
          "prefix": null,
          "percent": null,
          "name": "Zinc Oxide"
        }
      ]
    },
    {
      "order": 17,
      "ingredientId": 293389,
      "description": "",
      "notes": "Selenium (Form: as Selenium Amino Acid Chelate) ",
      "quantity": [
        {
          "servingSizeOrder": 1,
          "servingSizeQuantity": 1,
          "operator": "=",
          "quantity": 70,
          "unit": "mcg",
          "dailyValueTargetGroup": [
            {
              "name": "Adults and children 4 or more years of age",
              "operator": "=",
              "percent": 100,
              "footnote": null
            }
          ],
          "servingSizeUnit": "Tablet(s)"
        }
      ],
      "nestedRows": [],
      "name": "Selenium",
      "category": "mineral",
      "ingredientGroup": "Selenium",
      "uniiCode": "H6241UJ22B",
      "alternateNames": [
        "Se"
      ],
      "forms": [
        {
          "order": 1,
          "ingredientId": 287581,
          "prefix": null,
          "percent": null,
          "name": "Selenium Amino Acid Chelate"
        }
      ]
    },
    {
      "order": 18,
      "ingredientId": 14626,
      "description": "",
      "notes": "Copper (Form: as Copper Gluconate) ",
      "quantity": [
        {
          "servingSizeOrder": 1,
          "servingSizeQuantity": 1,
          "operator": "=",
          "quantity": 200,
          "unit": "mcg",
          "dailyValueTargetGroup": [
            {
              "name": "Adults and children 4 or more years of age",
              "operator": "=",
              "percent": 10,
              "footnote": null
            }
          ],
          "servingSizeUnit": "Tablet(s)"
        }
      ],
      "nestedRows": [],
      "name": "Copper",
      "category": "mineral",
      "ingredientGroup": "Copper",
      "uniiCode": null,
      "alternateNames": [],
      "forms": [
        {
          "order": 1,
          "ingredientId": 55647,
          "prefix": "as",
          "percent": null,
          "name": "Copper Gluconate"
        }
      ]
    },
    {
      "order": 19,
      "ingredientId": 3738,
      "description": "",
      "notes": "Manganese (Form: as Manganese Amino Acid Chelate) ",
      "quantity": [
        {
          "servingSizeOrder": 1,
          "servingSizeQuantity": 1,
          "operator": "=",
          "quantity": 2,
          "unit": "mg",
          "dailyValueTargetGroup": [
            {
              "name": "Adults and children 4 or more years of age",
              "operator": "=",
              "percent": 100,
              "footnote": null
            }
          ],
          "servingSizeUnit": "Tablet(s)"
        }
      ],
      "nestedRows": [],
      "name": "Manganese",
      "category": "mineral",
      "ingredientGroup": "Manganese",
      "uniiCode": null,
      "alternateNames": [],
      "forms": [
        {
          "order": 1,
          "ingredientId": 16233,
          "prefix": "as",
          "percent": null,
          "name": "Manganese Amino Acid Chelate"
        }
      ]
    },
    {
      "order": 20,
      "ingredientId": 91080,
      "description": "",
      "notes": "Chromium (Form: as Chromium Amino Acid Chelate) ",
      "quantity": [
        {
          "servingSizeOrder": 1,
          "servingSizeQuantity": 1,
          "operator": "=",
          "quantity": 120,
          "unit": "mcg",
          "dailyValueTargetGroup": [
            {
              "name": "Adults and children 4 or more years of age",
              "operator": "=",
              "percent": 100,
              "footnote": null
            }
          ],
          "servingSizeUnit": "Tablet(s)"
        }
      ],
      "nestedRows": [],
      "name": "Chromium",
      "category": "mineral",
      "ingredientGroup": "Chromium",
      "uniiCode": null,
      "alternateNames": [],
      "forms": [
        {
          "order": 1,
          "ingredientId": 63869,
          "prefix": "as",
          "percent": null,
          "name": "Chromium Amino Acid Chelate"
        }
      ]
    },
    {
      "order": 21,
      "ingredientId": 29691,
      "description": "",
      "notes": "Molybdenum (Form: as Molybdenum Amino Acid Chelate) ",
      "quantity": [
        {
          "servingSizeOrder": 1,
          "servingSizeQuantity": 1,
          "operator": "=",
          "quantity": 75,
          "unit": "mcg",
          "dailyValueTargetGroup": [
            {
              "name": "Adults and children 4 or more years of age",
              "operator": "=",
              "percent": 100,
              "footnote": null
            }
          ],
          "servingSizeUnit": "Tablet(s)"
        }
      ],
      "nestedRows": [],
      "name": "Molybdenum",
      "category": "mineral",
      "ingredientGroup": "Molybdenum",
      "uniiCode": null,
      "alternateNames": [],
      "forms": [
        {
          "order": 1,
          "ingredientId": 9856,
          "prefix": "as",
          "percent": null,
          "name": "Molybdenum Amino Acid Chelate"
        }
      ]
    },
    {
      "order": 22,
      "ingredientId": 292554,
      "description": "",
      "notes": "Boron (Form: as Boron Citrate) ",
      "quantity": [
        {
          "servingSizeOrder": 1,
          "servingSizeQuantity": 1,
          "operator": "=",
          "quantity": 1,
          "unit": "mg",
          "dailyValueTargetGroup": [
            {
              "name": "Adults and children 4 or more years of age",
              "operator": null,
              "percent": null,
              "footnote": "Daily Value not established"
            }
          ],
          "servingSizeUnit": "Tablet(s)"
        }
      ],
      "nestedRows": [],
      "name": "Boron",
      "category": "mineral",
      "ingredientGroup": "Boron",
      "uniiCode": "N9E3X5056Q",
      "alternateNames": [],
      "forms": [
        {
          "order": 1,
          "ingredientId": 292545,
          "prefix": null,
          "percent": null,
          "name": "Boron Citrate"
        }
      ]
    },
    {
      "order": 23,
      "ingredientId": 279424,
      "description": "",
      "notes": "Choline (Form: as Choline Bitartrate) ",
      "quantity": [
        {
          "servingSizeOrder": 1,
          "servingSizeQuantity": 1,
          "operator": "=",
          "quantity": 15,
          "unit": "mg",
          "dailyValueTargetGroup": [
            {
              "name": "Adults and children 4 or more years of age",
              "operator": null,
              "percent": null,
              "footnote": "Daily Value not established"
            }
          ],
          "servingSizeUnit": "Tablet(s)"
        }
      ],
      "nestedRows": [],
      "name": "Choline",
      "category": "vitamin",
      "ingredientGroup": "Choline",
      "uniiCode": "N91BDP6H0X",
      "alternateNames": [],
      "forms": [
        {
          "order": 1,
          "ingredientId": 279423,
          "prefix": null,
          "percent": null,
          "name": "Choline Bitartrate"
        }
      ]
    },
    {
      "order": 24,
      "ingredientId": 3722,
      "description": "",
      "notes": "",
      "quantity": [
        {
          "servingSizeOrder": 1,
          "servingSizeQuantity": 1,
          "operator": "=",
          "quantity": 15,
          "unit": "mg",
          "dailyValueTargetGroup": [
            {
              "name": "Adults and children 4 or more years of age",
              "operator": null,
              "percent": null,
              "footnote": "Daily Value not established"
            }
          ],
          "servingSizeUnit": "Tablet(s)"
        }
      ],
      "nestedRows": [],
      "name": "Inositol",
      "category": "non-nutrient/non-botanical",
      "ingredientGroup": "Inositol",
      "uniiCode": null,
      "alternateNames": [],
      "forms": []
    },
    {
      "order": 25,
      "ingredientId": 4032,
      "description": "",
      "notes": "",
      "quantity": [
        {
          "servingSizeOrder": 1,
          "servingSizeQuantity": 1,
          "operator": "=",
          "quantity": 50,
          "unit": "mcg",
          "dailyValueTargetGroup": [
            {
              "name": "Adults and children 4 or more years of age",
              "operator": null,
              "percent": null,
              "footnote": "Daily Value not established"
            }
          ],
          "servingSizeUnit": "Tablet(s)"
        }
      ],
      "nestedRows": [],
      "name": "Lutein",
      "category": "non-nutrient/non-botanical",
      "ingredientGroup": "Lutein",
      "uniiCode": null,
      "alternateNames": [],
      "forms": []
    },
    {
      "order": 26,
      "ingredientId": 16269,
      "description": "",
      "notes": "",
      "quantity": [
        {
          "servingSizeOrder": 1,
          "servingSizeQuantity": 1,
          "operator": "=",
          "quantity": 10,
          "unit": "mg",
          "dailyValueTargetGroup": [
            {
              "name": "Adults and children 4 or more years of age",
              "operator": null,
              "percent": null,
              "footnote": "Daily Value not established"
            }
          ],
          "servingSizeUnit": "Tablet(s)"
        }
      ],
      "nestedRows": [],
      "name": "Citrus Bioflavonoids",
      "category": "non-nutrient/non-botanical",
      "ingredientGroup": "Flavonoid (mixture)",
      "uniiCode": null,
      "alternateNames": [],
      "forms": []
    },
    {
      "order": 27,
      "ingredientId": 5254,
      "description": "",
      "notes": "",
      "quantity": [
        {
          "servingSizeOrder": 1,
          "servingSizeQuantity": 1,
          "operator": "=",
          "quantity": 10,
          "unit": "mg",
          "dailyValueTargetGroup": [
            {
              "name": "Adults and children 4 or more years of age",
              "operator": null,
              "percent": null,
              "footnote": "Daily Value not established"
            }
          ],
          "servingSizeUnit": "Tablet(s)"
        }
      ],
      "nestedRows": [],
      "name": "Apple Pectin",
      "category": "fiber",
      "ingredientGroup": "Pectin",
      "uniiCode": null,
      "alternateNames": [],
      "forms": []
    },
    {
      "order": 28,
      "ingredientId": 6612,
      "description": "",
      "notes": "",
      "quantity": [
        {
          "servingSizeOrder": 1,
          "servingSizeQuantity": 1,
          "operator": "=",
          "quantity": 10,
          "unit": "mg",
          "dailyValueTargetGroup": [
            {
              "name": "Adults and children 4 or more years of age",
              "operator": null,
              "percent": null,
              "footnote": "Daily Value not established"
            }
          ],
          "servingSizeUnit": "Tablet(s)"
        }
      ],
      "nestedRows": [],
      "name": "Betaine HCl",
      "category": "non-nutrient/non-botanical",
      "ingredientGroup": "Betaine Hydrochloride",
      "uniiCode": null,
      "alternateNames": [],
      "forms": []
    },
    {
      "order": 29,
      "ingredientId": 3784,
      "description": "",
      "notes": "",
      "quantity": [
        {
          "servingSizeOrder": 1,
          "servingSizeQuantity": 1,
          "operator": "=",
          "quantity": 10,
          "unit": "mg",
          "dailyValueTargetGroup": [
            {
              "name": "Adults and children 4 or more years of age",
              "operator": null,
              "percent": null,
              "footnote": "Daily Value not established"
            }
          ],
          "servingSizeUnit": "Tablet(s)"
        }
      ],
      "nestedRows": [],
      "name": "Rutin",
      "category": "non-nutrient/non-botanical",
      "ingredientGroup": "Rutin",
      "uniiCode": null,
      "alternateNames": [],
      "forms": []
    },
    {
      "order": 30,
      "ingredientId": 278407,
      "description": "",
      "notes": "",
      "quantity": [
        {
          "servingSizeOrder": 1,
          "servingSizeQuantity": 1,
          "operator": "=",
          "quantity": 80,
          "unit": "mg",
          "dailyValueTargetGroup": [
            {
              "name": "Adults and children 4 or more years of age",
              "operator": null,
              "percent": null,
              "footnote": "Daily Value not established"
            }
          ],
          "servingSizeUnit": "Tablet(s)"
        }
      ],
      "nestedRows": [
        {
          "order": 31,
          "ingredientId": 48721,
          "description": "",
          "notes": "",
          "quantity": [
            {
              "servingSizeOrder": 1,
              "servingSizeQuantity": 1,
              "operator": "=",
              "quantity": 0,
              "unit": "NP",
              "dailyValueTargetGroup": [],
              "servingSizeUnit": "Tablet(s)"
            }
          ],
          "nestedRows": [],
          "name": "Spirulina",
          "category": "bacteria",
          "ingredientGroup": "Spirulina",
          "uniiCode": null,
          "alternateNames": [],
          "forms": []
        },
        {
          "order": 32,
          "ingredientId": 90002,
          "description": "",
          "notes": "",
          "quantity": [
            {
              "servingSizeOrder": 1,
              "servingSizeQuantity": 1,
              "operator": "=",
              "quantity": 0,
              "unit": "NP",
              "dailyValueTargetGroup": [],
              "servingSizeUnit": "Tablet(s)"
            }
          ],
          "nestedRows": [],
          "name": "Alfalfa",
          "category": "botanical",
          "ingredientGroup": "Alfalfa",
          "uniiCode": null,
          "alternateNames": [],
          "forms": []
        },
        {
          "order": 33,
          "ingredientId": 49216,
          "description": "",
          "notes": "",
          "quantity": [
            {
              "servingSizeOrder": 1,
              "servingSizeQuantity": 1,
              "operator": "=",
              "quantity": 0,
              "unit": "NP",
              "dailyValueTargetGroup": [],
              "servingSizeUnit": "Tablet(s)"
            }
          ],
          "nestedRows": [],
          "name": "Ashwagandha",
          "category": "botanical",
          "ingredientGroup": "Ashwagandha",
          "uniiCode": null,
          "alternateNames": [],
          "forms": []
        },
        {
          "order": 34,
          "ingredientId": 163936,
          "description": "",
          "notes": "",
          "quantity": [
            {
              "servingSizeOrder": 1,
              "servingSizeQuantity": 1,
              "operator": "=",
              "quantity": 0,
              "unit": "NP",
              "dailyValueTargetGroup": [],
              "servingSizeUnit": "Tablet(s)"
            }
          ],
          "nestedRows": [],
          "name": "Black Cumin",
          "category": "botanical",
          "ingredientGroup": "Black Seed",
          "uniiCode": null,
          "alternateNames": [],
          "forms": []
        },
        {
          "order": 35,
          "ingredientId": 79090,
          "description": "",
          "notes": "",
          "quantity": [
            {
              "servingSizeOrder": 1,
              "servingSizeQuantity": 1,
              "operator": "=",
              "quantity": 0,
              "unit": "NP",
              "dailyValueTargetGroup": [],
              "servingSizeUnit": "Tablet(s)"
            }
          ],
          "nestedRows": [],
          "name": "Broccoli",
          "category": "botanical",
          "ingredientGroup": "Broccoli",
          "uniiCode": null,
          "alternateNames": [],
          "forms": []
        },
        {
          "order": 36,
          "ingredientId": 10340,
          "description": "",
          "notes": "",
          "quantity": [
            {
              "servingSizeOrder": 1,
              "servingSizeQuantity": 1,
              "operator": "=",
              "quantity": 0,
              "unit": "NP",
              "dailyValueTargetGroup": [],
              "servingSizeUnit": "Tablet(s)"
            }
          ],
          "nestedRows": [],
          "name": "Carrot",
          "category": "botanical",
          "ingredientGroup": "Carrot ",
          "uniiCode": null,
          "alternateNames": [],
          "forms": []
        },
        {
          "order": 37,
          "ingredientId": 26585,
          "description": "",
          "notes": "",
          "quantity": [
            {
              "servingSizeOrder": 1,
              "servingSizeQuantity": 1,
              "operator": "=",
              "quantity": 0,
              "unit": "NP",
              "dailyValueTargetGroup": [],
              "servingSizeUnit": "Tablet(s)"
            }
          ],
          "nestedRows": [],
          "name": "Chamomile",
          "category": "botanical",
          "ingredientGroup": "Chamomile (unspecified)",
          "uniiCode": null,
          "alternateNames": [],
          "forms": []
        },
        {
          "order": 38,
          "ingredientId": 171392,
          "description": "",
          "notes": "",
          "quantity": [
            {
              "servingSizeOrder": 1,
              "servingSizeQuantity": 1,
              "operator": "=",
              "quantity": 0,
              "unit": "NP",
              "dailyValueTargetGroup": [],
              "servingSizeUnit": "Tablet(s)"
            }
          ],
          "nestedRows": [],
          "name": "Chlorella",
          "category": "other",
          "ingredientGroup": "Chlorella",
          "uniiCode": null,
          "alternateNames": [],
          "forms": []
        },
        {
          "order": 39,
          "ingredientId": 83806,
          "description": "",
          "notes": "",
          "quantity": [
            {
              "servingSizeOrder": 1,
              "servingSizeQuantity": 1,
              "operator": "=",
              "quantity": 0,
              "unit": "NP",
              "dailyValueTargetGroup": [],
              "servingSizeUnit": "Tablet(s)"
            }
          ],
          "nestedRows": [],
          "name": "Cinnamon",
          "category": "botanical",
          "ingredientGroup": "Cinnamon",
          "uniiCode": null,
          "alternateNames": [],
          "forms": []
        },
        {
          "order": 40,
          "ingredientId": 174983,
          "description": "",
          "notes": "",
          "quantity": [
            {
              "servingSizeOrder": 1,
              "servingSizeQuantity": 1,
              "operator": "=",
              "quantity": 0,
              "unit": "NP",
              "dailyValueTargetGroup": [],
              "servingSizeUnit": "Tablet(s)"
            }
          ],
          "nestedRows": [],
          "name": "Dandelion",
          "category": "botanical",
          "ingredientGroup": "Dandelion",
          "uniiCode": null,
          "alternateNames": [],
          "forms": []
        },
        {
          "order": 41,
          "ingredientId": 204713,
          "description": "",
          "notes": "",
          "quantity": [
            {
              "servingSizeOrder": 1,
              "servingSizeQuantity": 1,
              "operator": "=",
              "quantity": 0,
              "unit": "NP",
              "dailyValueTargetGroup": [],
              "servingSizeUnit": "Tablet(s)"
            }
          ],
          "nestedRows": [],
          "name": "Ginger",
          "category": "botanical",
          "ingredientGroup": "Ginger ",
          "uniiCode": null,
          "alternateNames": [],
          "forms": []
        },
        {
          "order": 42,
          "ingredientId": 8162,
          "description": "",
          "notes": "",
          "quantity": [
            {
              "servingSizeOrder": 1,
              "servingSizeQuantity": 1,
              "operator": "=",
              "quantity": 0,
              "unit": "NP",
              "dailyValueTargetGroup": [],
              "servingSizeUnit": "Tablet(s)"
            }
          ],
          "nestedRows": [],
          "name": "Parsley",
          "category": "botanical",
          "ingredientGroup": "Parsley",
          "uniiCode": null,
          "alternateNames": [],
          "forms": []
        },
        {
          "order": 43,
          "ingredientId": 26010,
          "description": "",
          "notes": "",
          "quantity": [
            {
              "servingSizeOrder": 1,
              "servingSizeQuantity": 1,
              "operator": "=",
              "quantity": 0,
              "unit": "NP",
              "dailyValueTargetGroup": [],
              "servingSizeUnit": "Tablet(s)"
            }
          ],
          "nestedRows": [],
          "name": "Rose Hips",
          "category": "botanical",
          "ingredientGroup": "Dog Rose",
          "uniiCode": null,
          "alternateNames": [],
          "forms": []
        },
        {
          "order": 44,
          "ingredientId": 9225,
          "description": "",
          "notes": "",
          "quantity": [
            {
              "servingSizeOrder": 1,
              "servingSizeQuantity": 1,
              "operator": "=",
              "quantity": 0,
              "unit": "NP",
              "dailyValueTargetGroup": [],
              "servingSizeUnit": "Tablet(s)"
            }
          ],
          "nestedRows": [],
          "name": "Eleuthero",
          "category": "botanical",
          "ingredientGroup": "Eleuthero",
          "uniiCode": null,
          "alternateNames": [],
          "forms": []
        },
        {
          "order": 45,
          "ingredientId": 87667,
          "description": "",
          "notes": "",
          "quantity": [
            {
              "servingSizeOrder": 1,
              "servingSizeQuantity": 1,
              "operator": "=",
              "quantity": 0,
              "unit": "NP",
              "dailyValueTargetGroup": [],
              "servingSizeUnit": "Tablet(s)"
            }
          ],
          "nestedRows": [],
          "name": "Spinach",
          "category": "botanical",
          "ingredientGroup": "Spinach",
          "uniiCode": null,
          "alternateNames": [],
          "forms": []
        }
      ],
      "name": "Green Food / Vegetable / Herbal Blend",
      "category": "blend",
      "ingredientGroup": "Blend (Combination)",
      "uniiCode": null,
      "alternateNames": [],
      "forms": []
    }
  ],
  "otheringredients": {
    "text": null,
    "ingredients": [
      {
        "order": 1,
        "ingredientId": 9747,
        "name": "Cellulose",
        "category": "fiber",
        "ingredientGroup": "Cellulose",
        "uniiCode": null,
        "alternateNames": [],
        "forms": []
      },
      {
        "order": 2,
        "ingredientId": 4312,
        "name": "Croscarmellose Sodium",
        "category": "other",
        "ingredientGroup": "Croscarmellose Sodium",
        "uniiCode": null,
        "alternateNames": [],
        "forms": []
      },
      {
        "order": 3,
        "ingredientId": 285558,
        "name": "Stearic Acid",
        "category": "fatty acid",
        "ingredientGroup": "Stearic Acid",
        "uniiCode": "4ELV7Z65AP",
        "alternateNames": [
          "C18:0"
        ],
        "forms": []
      },
      {
        "order": 4,
        "ingredientId": 3813,
        "name": "Vegetable Magnesium Stearate",
        "category": "other",
        "ingredientGroup": "Magnesium stearate",
        "uniiCode": null,
        "alternateNames": [],
        "forms": []
      },
      {
        "order": 5,
        "ingredientId": 293311,
        "name": "Silica",
        "category": "mineral",
        "ingredientGroup": "Silicon",
        "uniiCode": "ETJ7Z6XBU4",
        "alternateNames": [],
        "forms": []
      },
      {
        "order": 6,
        "ingredientId": 3721,
        "name": "Hypromellose",
        "category": "other",
        "ingredientGroup": "Hypromellose",
        "uniiCode": null,
        "alternateNames": [],
        "forms": []
      },
      {
        "order": 7,
        "ingredientId": 3812,
        "name": "Vegetable Glycerin",
        "category": "other",
        "ingredientGroup": "Glycerol",
        "uniiCode": null,
        "alternateNames": [],
        "forms": []
      }
    ]
  },
  "offMarket": 0,
  "entryDate": "2021-06-23"
}