{
    "product": {
        "name": "Vegan Plant-Based Calcium 1,000 mg",
        "DSLD ID": "261967",
        "UPC": "8 40052 40011 9"
    },
    "brand": {
        "name": "PlantFusion"
    },
    "statements": [
        {
            "type": "Formula re: Contains",
            "notes": "Aquamin mineralized red algae is collected in the pristine Artic waters of Iceland. It is rich in calcium, magnesium and 72 trace minerals."
        },
        {
            "type": "Formulation re: Other",
            "notes": "Aquamin helps to mineralize bone cells, and supports bone density and strength. Bone mineralization is also enhanced when taken with Vitamins D-3 and K-2."
        },
        {
            "type": "Formula re: Contains",
            "notes": "Bone mineralization is also enhanced when taken with Vitamins D-3 and K-2."
        },
        {
            "type": "Formulation re: Does NOT Contain",
            "notes": "Contains no sugar, dairy, yeast, wheat, gluten, eggs, peanuts, soy, tree nuts, fish, shellfish, preservatives, artificial colors or flavors.\n"
        },
        {
            "type": "Suggested/Recommended/Usage/Directions",
            "notes": "Suggested Use: As a dietary supplement, adults take three (3) tablets daily, preferably with a meal, or as directed by a health care professional."
        },
        {
            "type": "Storage",
            "notes": "Store in a cool, dry place away from direct light.\t\n"
        },
        {
            "type": "Brand IP Statement(s) re: (c), (TM), (SM)",
            "notes": "Aquamin is a trademark of Marigot Limited."
        },
        {
            "type": "Precautions re: Children",
            "notes": "Keep out of reach of children.\n"
        },
        {
            "type": "Formulation re: Other",
            "notes": "Supports bone density & strength"
        },
        {
            "type": "Seals/Symbols",
            "notes": "Certified\nVegan\nVegan.org"
        },
        {
            "type": "Formulation re: Vegetarian/Vegan",
            "notes": "Certified\nVegan\nVegan.org"
        },
        {
            "type": "FDA Statement of Identity",
            "notes": "Dietary Supplement"
        },
        {
            "type": "FDA Disclaimer Statement",
            "notes": "These statements have not been evaluated by the Food and Drug Administration. This product is not intended to diagnose, treat, cure or prevent any disease."
        }
    ],
    "form": {
        "unit": "Tablet",
        "quantity": "90",
        "rounded": "?"
    },
    "stated recommendations": {},
    "defined": {
        "servings per container": "30",
        "serving size": {
            "quantity": 3
        }
    },
    "ingredients": {
        "quantified grove": [
            {
                "name": "Boron",
                "mass": {
                    "per package": {
                        "fraction string grams": "279/100000",
                        "float string grams": "0.00279"
                    },
                    "per form": {
                        "fraction string grams": "31/1000000",
                        "float string grams": "3.1e-05"
                    },
                    "per serving": {},
                    "effectual portion per package": {
                        "from quantified ingredients": {
                            "fraction float string": "2.003781761018214e-05",
                            "fraction string": "93/4641224",
                            "percentage string": "0.002%"
                        }
                    },
                    "compositional portion per package": {
                        "from defined package mass": {
                            "fraction float string": "",
                            "fraction string": "",
                            "percentage string": ""
                        }
                    }
                },
                "quantity": {
                    "per package": {
                        "listed": {
                            "unit": "mcg"
                        }
                    },
                    "per form": {
                        "listed": {
                            "unit": "mcg",
                            "fraction string": "31",
                            "float string": "31.0"
                        }
                    }
                },
                "quantified grove": []
            },
            {
                "name": "Calcium",
                "mass": {
                    "per package": {
                        "fraction string grams": "30",
                        "float string grams": "30.0"
                    },
                    "per form": {
                        "fraction string grams": "1/3",
                        "float string grams": "0.3333333333333333"
                    },
                    "per serving": {},
                    "effectual portion per package": {
                        "from quantified ingredients": {
                            "fraction float string": "0.21546040441056066",
                            "fraction string": "125000/580153",
                            "percentage string": "21.546%"
                        }
                    },
                    "compositional portion per package": {
                        "from defined package mass": {
                            "fraction float string": "",
                            "fraction string": "",
                            "percentage string": ""
                        }
                    }
                },
                "quantity": {
                    "per package": {
                        "listed": {
                            "unit": "mg"
                        }
                    },
                    "per form": {
                        "listed": {
                            "unit": "mg",
                            "fraction string": "1000/3",
                            "float string": "333.3333333333333"
                        }
                    }
                },
                "quantified grove": []
            },
            {
                "name": "Magnesium",
                "mass": {
                    "per package": {
                        "fraction string grams": "72/25",
                        "float string grams": "2.88"
                    },
                    "per form": {
                        "fraction string grams": "4/125",
                        "float string grams": "0.032"
                    },
                    "per serving": {},
                    "effectual portion per package": {
                        "from quantified ingredients": {
                            "fraction float string": "0.020684198823413824",
                            "fraction string": "12000/580153",
                            "percentage string": "2.068%"
                        }
                    },
                    "compositional portion per package": {
                        "from defined package mass": {
                            "fraction float string": "",
                            "fraction string": "",
                            "percentage string": ""
                        }
                    }
                },
                "quantity": {
                    "per package": {
                        "listed": {
                            "unit": "mg"
                        }
                    },
                    "per form": {
                        "listed": {
                            "unit": "mg",
                            "fraction string": "32",
                            "float string": "32.0"
                        }
                    }
                },
                "quantified grove": []
            },
            {
                "name": "Organic Vegan & Red Algae Blend",
                "mass": {
                    "per package": {
                        "fraction string grams": "2121/20",
                        "float string grams": "106.05"
                    },
                    "per form": {
                        "fraction string grams": "707/600",
                        "float string grams": "1.1783333333333332"
                    },
                    "per serving": {},
                    "effectual portion per package": {
                        "from quantified ingredients": {
                            "fraction float string": "0.7616525295913319",
                            "fraction string": "63125/82879",
                            "percentage string": "76.165%"
                        }
                    },
                    "compositional portion per package": {
                        "from defined package mass": {
                            "fraction float string": "",
                            "fraction string": "",
                            "percentage string": ""
                        }
                    }
                },
                "quantity": {
                    "per package": {
                        "listed": {
                            "unit": "mg"
                        }
                    },
                    "per form": {
                        "listed": {
                            "unit": "mg",
                            "fraction string": "3535/3",
                            "float string": "1178.3333333333333"
                        }
                    }
                },
                "quantified grove": [
                    {
                        "name": "Blueberry",
                        "mass": {
                            "per package": {
                                "fraction string grams": "?",
                                "float string grams": "?"
                            },
                            "per form": {
                                "fraction string grams": "?",
                                "float string grams": "?"
                            },
                            "per serving": {}
                        },
                        "quantity": {
                            "per package": {
                                "listed": {
                                    "unit": "NP"
                                }
                            },
                            "per form": {
                                "listed": {
                                    "unit": "NP",
                                    "fraction string": "0",
                                    "float string": "0.0"
                                }
                            }
                        },
                        "quantified grove": []
                    },
                    {
                        "name": "Broccoli",
                        "mass": {
                            "per package": {
                                "fraction string grams": "?",
                                "float string grams": "?"
                            },
                            "per form": {
                                "fraction string grams": "?",
                                "float string grams": "?"
                            },
                            "per serving": {}
                        },
                        "quantity": {
                            "per package": {
                                "listed": {
                                    "unit": "NP"
                                }
                            },
                            "per form": {
                                "listed": {
                                    "unit": "NP",
                                    "fraction string": "0",
                                    "float string": "0.0"
                                }
                            }
                        },
                        "quantified grove": []
                    },
                    {
                        "name": "Broccoli Sprouts",
                        "mass": {
                            "per package": {
                                "fraction string grams": "?",
                                "float string grams": "?"
                            },
                            "per form": {
                                "fraction string grams": "?",
                                "float string grams": "?"
                            },
                            "per serving": {}
                        },
                        "quantity": {
                            "per package": {
                                "listed": {
                                    "unit": "NP"
                                }
                            },
                            "per form": {
                                "listed": {
                                    "unit": "NP",
                                    "fraction string": "0",
                                    "float string": "0.0"
                                }
                            }
                        },
                        "quantified grove": []
                    },
                    {
                        "name": "Carrot",
                        "mass": {
                            "per package": {
                                "fraction string grams": "?",
                                "float string grams": "?"
                            },
                            "per form": {
                                "fraction string grams": "?",
                                "float string grams": "?"
                            },
                            "per serving": {}
                        },
                        "quantity": {
                            "per package": {
                                "listed": {
                                    "unit": "NP"
                                }
                            },
                            "per form": {
                                "listed": {
                                    "unit": "NP",
                                    "fraction string": "0",
                                    "float string": "0.0"
                                }
                            }
                        },
                        "quantified grove": []
                    },
                    {
                        "name": "Cranberry",
                        "mass": {
                            "per package": {
                                "fraction string grams": "?",
                                "float string grams": "?"
                            },
                            "per form": {
                                "fraction string grams": "?",
                                "float string grams": "?"
                            },
                            "per serving": {}
                        },
                        "quantity": {
                            "per package": {
                                "listed": {
                                    "unit": "NP"
                                }
                            },
                            "per form": {
                                "listed": {
                                    "unit": "NP",
                                    "fraction string": "0",
                                    "float string": "0.0"
                                }
                            }
                        },
                        "quantified grove": []
                    },
                    {
                        "name": "Icelandic Red Algae",
                        "mass": {
                            "per package": {
                                "fraction string grams": "?",
                                "float string grams": "?"
                            },
                            "per form": {
                                "fraction string grams": "?",
                                "float string grams": "?"
                            },
                            "per serving": {}
                        },
                        "quantity": {
                            "per package": {
                                "listed": {
                                    "unit": "NP"
                                }
                            },
                            "per form": {
                                "listed": {
                                    "unit": "NP",
                                    "fraction string": "0",
                                    "float string": "0.0"
                                }
                            }
                        },
                        "quantified grove": []
                    },
                    {
                        "name": "Kale",
                        "mass": {
                            "per package": {
                                "fraction string grams": "?",
                                "float string grams": "?"
                            },
                            "per form": {
                                "fraction string grams": "?",
                                "float string grams": "?"
                            },
                            "per serving": {}
                        },
                        "quantity": {
                            "per package": {
                                "listed": {
                                    "unit": "NP"
                                }
                            },
                            "per form": {
                                "listed": {
                                    "unit": "NP",
                                    "fraction string": "0",
                                    "float string": "0.0"
                                }
                            }
                        },
                        "quantified grove": []
                    },
                    {
                        "name": "Pomegranate",
                        "mass": {
                            "per package": {
                                "fraction string grams": "?",
                                "float string grams": "?"
                            },
                            "per form": {
                                "fraction string grams": "?",
                                "float string grams": "?"
                            },
                            "per serving": {}
                        },
                        "quantity": {
                            "per package": {
                                "listed": {
                                    "unit": "NP"
                                }
                            },
                            "per form": {
                                "listed": {
                                    "unit": "NP",
                                    "fraction string": "0",
                                    "float string": "0.0"
                                }
                            }
                        },
                        "quantified grove": []
                    },
                    {
                        "name": "Raspberry",
                        "mass": {
                            "per package": {
                                "fraction string grams": "?",
                                "float string grams": "?"
                            },
                            "per form": {
                                "fraction string grams": "?",
                                "float string grams": "?"
                            },
                            "per serving": {}
                        },
                        "quantity": {
                            "per package": {
                                "listed": {
                                    "unit": "NP"
                                }
                            },
                            "per form": {
                                "listed": {
                                    "unit": "NP",
                                    "fraction string": "0",
                                    "float string": "0.0"
                                }
                            }
                        },
                        "quantified grove": []
                    },
                    {
                        "name": "Spinach",
                        "mass": {
                            "per package": {
                                "fraction string grams": "?",
                                "float string grams": "?"
                            },
                            "per form": {
                                "fraction string grams": "?",
                                "float string grams": "?"
                            },
                            "per serving": {}
                        },
                        "quantity": {
                            "per package": {
                                "listed": {
                                    "unit": "NP"
                                }
                            },
                            "per form": {
                                "listed": {
                                    "unit": "NP",
                                    "fraction string": "0",
                                    "float string": "0.0"
                                }
                            }
                        },
                        "quantified grove": []
                    },
                    {
                        "name": "Strawberry",
                        "mass": {
                            "per package": {
                                "fraction string grams": "?",
                                "float string grams": "?"
                            },
                            "per form": {
                                "fraction string grams": "?",
                                "float string grams": "?"
                            },
                            "per serving": {}
                        },
                        "quantity": {
                            "per package": {
                                "listed": {
                                    "unit": "NP"
                                }
                            },
                            "per form": {
                                "listed": {
                                    "unit": "NP",
                                    "fraction string": "0",
                                    "float string": "0.0"
                                }
                            }
                        },
                        "quantified grove": []
                    },
                    {
                        "name": "Tart Cherry",
                        "mass": {
                            "per package": {
                                "fraction string grams": "?",
                                "float string grams": "?"
                            },
                            "per form": {
                                "fraction string grams": "?",
                                "float string grams": "?"
                            },
                            "per serving": {}
                        },
                        "quantity": {
                            "per package": {
                                "listed": {
                                    "unit": "NP"
                                }
                            },
                            "per form": {
                                "listed": {
                                    "unit": "NP",
                                    "fraction string": "0",
                                    "float string": "0.0"
                                }
                            }
                        },
                        "quantified grove": []
                    },
                    {
                        "name": "Tomato",
                        "mass": {
                            "per package": {
                                "fraction string grams": "?",
                                "float string grams": "?"
                            },
                            "per form": {
                                "fraction string grams": "?",
                                "float string grams": "?"
                            },
                            "per serving": {}
                        },
                        "quantity": {
                            "per package": {
                                "listed": {
                                    "unit": "NP"
                                }
                            },
                            "per form": {
                                "listed": {
                                    "unit": "NP",
                                    "fraction string": "0",
                                    "float string": "0.0"
                                }
                            }
                        },
                        "quantified grove": []
                    }
                ]
            },
            {
                "name": "Silica",
                "mass": {
                    "per package": {
                        "fraction string grams": "9/100",
                        "float string grams": "0.09"
                    },
                    "per form": {
                        "fraction string grams": "1/1000",
                        "float string grams": "0.001"
                    },
                    "per serving": {},
                    "effectual portion per package": {
                        "from quantified ingredients": {
                            "fraction float string": "0.000646381213231682",
                            "fraction string": "375/580153",
                            "percentage string": "0.650%"
                        }
                    },
                    "compositional portion per package": {
                        "from defined package mass": {
                            "fraction float string": "",
                            "fraction string": "",
                            "percentage string": ""
                        }
                    }
                },
                "quantity": {
                    "per package": {
                        "listed": {
                            "unit": "mg"
                        }
                    },
                    "per form": {
                        "listed": {
                            "unit": "mg",
                            "fraction string": "1",
                            "float string": "1.0"
                        }
                    }
                },
                "quantified grove": []
            },
            {
                "name": "Strontium",
                "mass": {
                    "per package": {
                        "fraction string grams": "21/100",
                        "float string grams": "0.21"
                    },
                    "per form": {
                        "fraction string grams": "7/3000",
                        "float string grams": "0.0023333333333333335"
                    },
                    "per serving": {},
                    "effectual portion per package": {
                        "from quantified ingredients": {
                            "fraction float string": "0.0015082228308739246",
                            "fraction string": "125/82879",
                            "percentage string": "0.151%"
                        }
                    },
                    "compositional portion per package": {
                        "from defined package mass": {
                            "fraction float string": "",
                            "fraction string": "",
                            "percentage string": ""
                        }
                    }
                },
                "quantity": {
                    "per package": {
                        "listed": {
                            "unit": "mg"
                        }
                    },
                    "per form": {
                        "listed": {
                            "unit": "mg",
                            "fraction string": "7/3",
                            "float string": "2.3333333333333335"
                        }
                    }
                },
                "quantified grove": []
            },
            {
                "name": "Vanadium",
                "mass": {
                    "per package": {
                        "fraction string grams": "39/50000",
                        "float string grams": "0.00078"
                    },
                    "per form": {
                        "fraction string grams": "13/1500000",
                        "float string grams": "8.666666666666666e-06"
                    },
                    "per serving": {},
                    "effectual portion per package": {
                        "from quantified ingredients": {
                            "fraction float string": "5.601970514674577e-06",
                            "fraction string": "13/2320612",
                            "percentage string": "0.100%"
                        }
                    },
                    "compositional portion per package": {
                        "from defined package mass": {
                            "fraction float string": "",
                            "fraction string": "",
                            "percentage string": ""
                        }
                    }
                },
                "quantity": {
                    "per package": {
                        "listed": {
                            "unit": "mcg"
                        }
                    },
                    "per form": {
                        "listed": {
                            "unit": "mcg",
                            "fraction string": "26/3",
                            "float string": "8.666666666666666"
                        }
                    }
                },
                "quantified grove": []
            },
            {
                "name": "Vitamin D3",
                "mass": {
                    "per package": {
                        "fraction string grams": "3/5000",
                        "float string grams": "0.0006"
                    },
                    "per form": {
                        "fraction string grams": "1/150000",
                        "float string grams": "6.666666666666667e-06"
                    },
                    "per serving": {},
                    "effectual portion per package": {
                        "from quantified ingredients": {
                            "fraction float string": "4.3092080882112135e-06",
                            "fraction string": "5/1160306",
                            "percentage string": "0.000%"
                        }
                    },
                    "compositional portion per package": {
                        "from defined package mass": {
                            "fraction float string": "",
                            "fraction string": "",
                            "percentage string": ""
                        }
                    }
                },
                "quantity": {
                    "per package": {
                        "listed": {
                            "unit": "mcg"
                        }
                    },
                    "per form": {
                        "listed": {
                            "unit": "mcg",
                            "fraction string": "20/3",
                            "float string": "6.666666666666667"
                        }
                    }
                },
                "quantified grove": []
            },
            {
                "name": "Vitamin K2",
                "mass": {
                    "per package": {
                        "fraction string grams": "51/20000",
                        "float string grams": "0.00255"
                    },
                    "per form": {
                        "fraction string grams": "17/600000",
                        "float string grams": "2.8333333333333332e-05"
                    },
                    "per serving": {},
                    "effectual portion per package": {
                        "from quantified ingredients": {
                            "fraction float string": "1.8314134374897658e-05",
                            "fraction string": "85/4641224",
                            "percentage string": "0.200%"
                        }
                    },
                    "compositional portion per package": {
                        "from defined package mass": {
                            "fraction float string": "",
                            "fraction string": "",
                            "percentage string": ""
                        }
                    }
                },
                "quantity": {
                    "per package": {
                        "listed": {
                            "unit": "mcg"
                        }
                    },
                    "per form": {
                        "listed": {
                            "unit": "mcg",
                            "fraction string": "85/3",
                            "float string": "28.333333333333332"
                        }
                    }
                },
                "quantified grove": []
            }
        ],
        "unquantified": [
            {
                "order": 1,
                "ingredientId": 9747,
                "name": "Cellulose",
                "category": "fiber",
                "ingredientGroup": "Cellulose",
                "uniiCode": null,
                "alternateNames": [],
                "forms": []
            },
            {
                "order": 2,
                "ingredientId": 4048,
                "name": "Magnesium Stearate",
                "category": "other",
                "ingredientGroup": "Magnesium stearate",
                "uniiCode": null,
                "alternateNames": [],
                "forms": []
            },
            {
                "order": 3,
                "ingredientId": 3713,
                "name": "Food Glaze",
                "category": "other",
                "ingredientGroup": "Coating",
                "uniiCode": null,
                "alternateNames": [],
                "forms": []
            },
            {
                "order": 4,
                "ingredientId": 7866,
                "name": "Silica",
                "category": "mineral",
                "ingredientGroup": "Silicon",
                "uniiCode": null,
                "alternateNames": [],
                "forms": []
            }
        ]
    },
    "mass": {
        "sum of quantified ingredients, exluding effectual": {
            "skipped": [],
            "per package": {
                "fraction string grams": "580153/375000"
            },
            "per form": {
                "fraction string grams": "580153/33750000"
            }
        },
        "of quantified ingredients, with effectuals": {
            "fraction string grams": "1740459/12500",
            "float grams": 139.23672,
            "skipped": []
        },
        "of quantified ingredients, without effectuals": {
            "fraction string grams": "1740459/12500",
            "float grams": 139.23672,
            "skipped": []
        }
    }
}