{
    "product": {
        "name": "WALNUTS HALVES & PIECES, WALNUTS",
        "FDC ID": "1882785",
        "UPC": "099482434618"
    },
    "brand": {
        "name": "365 WHOLE FOODS MARKET",
        "owner": "Whole Foods Market, Inc."
    },
    "defined": {
        "servings per package": {},
        "serving size": {
            "unit": "g",
            "amount": "28",
            "kind": "mass"
        },
        "quantity": {
            "reported": "16 OZ/1 LB/454 g",
            "notes": "This could be the 'mass' and or 'volume', etc."
        },
        "servings per package, fraction string": "227/14",
        "servings per package, float string": "16.214285714285715"
    },
    "mass": {
        "listed": {
            "per package, in grams": "454"
        },
        "of quantified ingredients, with effectuals": {
            "fraction string grams": "47746738154613173415299/112589990684262400000",
            "float grams": 424.0762244,
            "skipped": []
        },
        "of quantified ingredients, without effectuals": {
            "fraction string grams": "47746738154613173415299/112589990684262400000",
            "float grams": 424.0762244,
            "skipped": []
        }
    },
    "volume": {
        "listed": {
            "per package, in liters": "?"
        }
    },
    "ingredients": {
        "quantified list": [
            {
                "name": "Fatty acids, total monounsaturated",
                "struct": {
                    "includes": [],
                    "names": [
                        "monounsaturated fat",
                        "fatty acids, total monounsaturated"
                    ],
                    "region": 51
                },
                "mass": {
                    "per package": {
                        "float": {
                            "amount": 40.5422,
                            "unit": "g"
                        },
                        "fraction string": {
                            "amount": "285290370019968933/7036874417766400",
                            "unit": "g"
                        },
                        "fraction string grams": "285290370019968933/7036874417766400",
                        "float grams": 40.5422
                    },
                    "per serving": {
                        "float": {
                            "amount": 2.5004,
                            "unit": "g"
                        },
                        "fraction string": {
                            "amount": "8797500397091553/3518437208883200",
                            "unit": "g"
                        }
                    }
                }
            },
            {
                "name": "Fatty acids, total trans",
                "struct": {
                    "includes": [],
                    "names": [
                        "trans fat",
                        "fatty acids, total trans"
                    ],
                    "region": 5
                },
                "mass": {
                    "per package": {
                        "float": {
                            "amount": 0.0,
                            "unit": "g"
                        },
                        "fraction string": {
                            "amount": "0",
                            "unit": "g"
                        },
                        "fraction string grams": "0",
                        "float grams": 0.0
                    },
                    "per serving": {
                        "float": {
                            "amount": 0.0,
                            "unit": "g"
                        },
                        "fraction string": {
                            "amount": "0",
                            "unit": "g"
                        }
                    }
                }
            },
            {
                "name": "Iron, Fe",
                "struct": {
                    "includes": [],
                    "names": [
                        "iron",
                        "iron, fe"
                    ],
                    "region": 75
                },
                "mass": {
                    "per package": {
                        "float": {
                            "amount": 12.984399999999999,
                            "unit": "mg"
                        },
                        "fraction string": {
                            "amount": "1461913475040736643/112589990684262400",
                            "unit": "mg"
                        },
                        "fraction string grams": "1461913475040736643/112589990684262400000",
                        "float grams": 0.0129844
                    },
                    "per serving": {
                        "float": {
                            "amount": 0.8008,
                            "unit": "mg"
                        },
                        "fraction string": {
                            "amount": "45081032269978663/56294995342131200",
                            "unit": "mg"
                        }
                    }
                }
            },
            {
                "name": "Sodium, Na",
                "struct": {
                    "includes": [],
                    "names": [
                        "sodium Na",
                        "sodium, Na",
                        "sodium",
                        "Na"
                    ],
                    "region": 59
                },
                "mass": {
                    "per package": {
                        "float": {
                            "amount": 0.0,
                            "unit": "mg"
                        },
                        "fraction string": {
                            "amount": "0",
                            "unit": "mg"
                        },
                        "fraction string grams": "0",
                        "float grams": 0.0
                    },
                    "per serving": {
                        "float": {
                            "amount": 0.0,
                            "unit": "mg"
                        },
                        "fraction string": {
                            "amount": "0",
                            "unit": "mg"
                        }
                    }
                }
            },
            {
                "name": "Total lipid (fat)",
                "struct": {
                    "includes": [
                        4,
                        5,
                        15,
                        51
                    ],
                    "names": [
                        "fats",
                        "total fat",
                        "lipids",
                        "total lipid (fat)"
                    ],
                    "region": 3
                },
                "mass": {
                    "per package": {
                        "float": {
                            "amount": 291.87660000000005,
                            "unit": "g"
                        },
                        "fraction string": {
                            "amount": "1026949489842318313/3518437208883200",
                            "unit": "g"
                        },
                        "fraction string grams": "1026949489842318313/3518437208883200",
                        "float grams": 291.87660000000005
                    },
                    "per serving": {
                        "float": {
                            "amount": 18.0012,
                            "unit": "g"
                        },
                        "fraction string": {
                            "amount": "31668045942274133/1759218604441600",
                            "unit": "g"
                        }
                    }
                }
            },
            {
                "name": "Fatty acids, total polyunsaturated",
                "struct": {
                    "includes": [],
                    "names": [
                        "polyunsaturated fat",
                        "fatty acids, total polyunsaturated"
                    ],
                    "region": 15
                },
                "mass": {
                    "per package": {
                        "float": {
                            "amount": 210.7922,
                            "unit": "g"
                        },
                        "fraction string": {
                            "amount": "1483318239644698533/7036874417766400",
                            "unit": "g"
                        },
                        "fraction string grams": "1483318239644698533/7036874417766400",
                        "float grams": 210.7922
                    },
                    "per serving": {
                        "float": {
                            "amount": 13.000399999999999,
                            "unit": "g"
                        },
                        "fraction string": {
                            "amount": "45741091090365153/3518437208883200",
                            "unit": "g"
                        }
                    }
                }
            },
            {
                "name": "Vitamin D (D2 + D3), International Units",
                "struct": {
                    "includes": [],
                    "names": [
                        "vitamin d",
                        "vitamin d (d2 + d3)",
                        "vitamin d2",
                        "vitamin d3",
                        "vitamin d (d2 + d3), international units"
                    ],
                    "region": 63
                },
                "effectual mass": {
                    "per package": {
                        "float": {
                            "amount": 0.0,
                            "unit": "IU"
                        },
                        "fraction string": {
                            "amount": "0",
                            "unit": "IU"
                        }
                    },
                    "per serving": {
                        "float": {
                            "amount": 0.0,
                            "unit": "IU"
                        },
                        "fraction string": {
                            "amount": "0",
                            "unit": "IU"
                        }
                    }
                }
            },
            {
                "name": "Sugars, added",
                "struct": {
                    "includes": [],
                    "names": [
                        "added sugars",
                        "sugars, added"
                    ],
                    "region": 8
                },
                "mass": {
                    "per package": {
                        "float": {
                            "amount": 0.0,
                            "unit": "g"
                        },
                        "fraction string": {
                            "amount": "0",
                            "unit": "g"
                        },
                        "fraction string grams": "0",
                        "float grams": 0.0
                    },
                    "per serving": {
                        "float": {
                            "amount": 0.0,
                            "unit": "g"
                        },
                        "fraction string": {
                            "amount": "0",
                            "unit": "g"
                        }
                    }
                }
            },
            {
                "name": "Calcium, Ca",
                "struct": {
                    "includes": [],
                    "names": [
                        "calcium",
                        "calcium, ca"
                    ],
                    "region": 9
                },
                "mass": {
                    "per package": {
                        "float": {
                            "amount": 485.78,
                            "unit": "mg"
                        },
                        "fraction string": {
                            "amount": "24289/50",
                            "unit": "mg"
                        },
                        "fraction string grams": "24289/50000",
                        "float grams": 0.48578
                    },
                    "per serving": {
                        "float": {
                            "amount": 29.96,
                            "unit": "mg"
                        },
                        "fraction string": {
                            "amount": "749/25",
                            "unit": "mg"
                        }
                    }
                }
            },
            {
                "name": "Protein",
                "struct": {
                    "includes": [],
                    "names": [
                        "protein"
                    ],
                    "region": 1
                },
                "mass": {
                    "per package": {
                        "float": {
                            "amount": 64.8766,
                            "unit": "g"
                        },
                        "fraction string": {
                            "amount": "456528486851663599/7036874417766400",
                            "unit": "g"
                        },
                        "fraction string grams": "456528486851663599/7036874417766400",
                        "float grams": 64.8766
                    },
                    "per serving": {
                        "float": {
                            "amount": 4.0012,
                            "unit": "g"
                        },
                        "fraction string": {
                            "amount": "14077970960183459/3518437208883200",
                            "unit": "g"
                        }
                    }
                }
            },
            {
                "name": "Sugars, total including NLEA",
                "struct": {
                    "includes": [
                        8
                    ],
                    "names": [
                        "sugars",
                        "total sugars",
                        "sugars, total including nlea"
                    ],
                    "region": 7
                },
                "mass": {
                    "per package": {
                        "float": {
                            "amount": 16.2078,
                            "unit": "g"
                        },
                        "fraction string": {
                            "amount": "364967210202477609/22517998136852480",
                            "unit": "g"
                        },
                        "fraction string grams": "364967210202477609/22517998136852480",
                        "float grams": 16.2078
                    },
                    "per serving": {
                        "float": {
                            "amount": 0.9995999999999999,
                            "unit": "g"
                        },
                        "fraction string": {
                            "amount": "11254495468798869/11258999068426240",
                            "unit": "g"
                        }
                    }
                }
            },
            {
                "name": "Cholesterol",
                "struct": {
                    "includes": [],
                    "names": [
                        "cholesterol"
                    ],
                    "region": 12
                },
                "mass": {
                    "per package": {
                        "float": {
                            "amount": 0.0,
                            "unit": "mg"
                        },
                        "fraction string": {
                            "amount": "0",
                            "unit": "mg"
                        },
                        "fraction string grams": "0",
                        "float grams": 0.0
                    },
                    "per serving": {
                        "float": {
                            "amount": 0.0,
                            "unit": "mg"
                        },
                        "fraction string": {
                            "amount": "0",
                            "unit": "mg"
                        }
                    }
                }
            },
            {
                "name": "Fiber, total dietary",
                "struct": {
                    "includes": [],
                    "names": [
                        "dietary fiber",
                        "fiber, total dietary"
                    ],
                    "region": 6
                },
                "mass": {
                    "per package": {
                        "float": {
                            "amount": 32.234,
                            "unit": "g"
                        },
                        "fraction string": {
                            "amount": "181461287985825701/5629499534213120",
                            "unit": "g"
                        },
                        "fraction string grams": "181461287985825701/5629499534213120",
                        "float grams": 32.234
                    },
                    "per serving": {
                        "float": {
                            "amount": 1.988,
                            "unit": "g"
                        },
                        "fraction string": {
                            "amount": "5595722537007841/2814749767106560",
                            "unit": "g"
                        }
                    }
                }
            },
            {
                "name": "Carbohydrate, by difference",
                "struct": {
                    "includes": [
                        6,
                        7
                    ],
                    "names": [
                        "carbohydrates",
                        "carbohydrate, by difference",
                        "total carbohydrates"
                    ],
                    "region": 2
                },
                "mass": {
                    "per package": {
                        "float": {
                            "amount": 64.8766,
                            "unit": "g"
                        },
                        "fraction string": {
                            "amount": "456528486851663599/7036874417766400",
                            "unit": "g"
                        },
                        "fraction string grams": "456528486851663599/7036874417766400",
                        "float grams": 64.8766
                    },
                    "per serving": {
                        "float": {
                            "amount": 4.0012,
                            "unit": "g"
                        },
                        "fraction string": {
                            "amount": "14077970960183459/3518437208883200",
                            "unit": "g"
                        }
                    }
                }
            },
            {
                "name": "Fatty acids, total saturated",
                "struct": {
                    "includes": [],
                    "names": [
                        "saturated fat",
                        "fatty acids, total saturated"
                    ],
                    "region": 4
                },
                "mass": {
                    "per package": {
                        "float": {
                            "amount": 24.334400000000002,
                            "unit": "g"
                        },
                        "fraction string": {
                            "amount": "273980986930711511/11258999068426240",
                            "unit": "g"
                        },
                        "fraction string grams": "273980986930711511/11258999068426240",
                        "float grams": 24.334400000000002
                    },
                    "per serving": {
                        "float": {
                            "amount": 1.5008000000000001,
                            "unit": "g"
                        },
                        "fraction string": {
                            "amount": "8448752900947051/5629499534213120",
                            "unit": "g"
                        }
                    }
                }
            },
            {
                "name": "Potassium, K",
                "struct": {
                    "includes": [],
                    "names": [
                        "potassium",
                        "potassium K",
                        "potassium, K",
                        "K"
                    ],
                    "region": 58
                },
                "mass": {
                    "per package": {
                        "float": {
                            "amount": 1947.66,
                            "unit": "mg"
                        },
                        "fraction string": {
                            "amount": "97383/50",
                            "unit": "mg"
                        },
                        "fraction string grams": "97383/50000",
                        "float grams": 1.94766
                    },
                    "per serving": {
                        "float": {
                            "amount": 120.12,
                            "unit": "mg"
                        },
                        "fraction string": {
                            "amount": "3003/25",
                            "unit": "mg"
                        }
                    }
                }
            }
        ],
        "quantified grove": [
            {
                "name": "Fatty acids, total trans",
                "struct": {
                    "includes": [],
                    "names": [
                        "trans fat",
                        "fatty acids, total trans"
                    ],
                    "region": 5
                },
                "mass": {
                    "per package": {
                        "float": {
                            "amount": 0.0,
                            "unit": "g"
                        },
                        "fraction string": {
                            "amount": "0",
                            "unit": "g"
                        },
                        "fraction string grams": "0",
                        "float grams": 0.0
                    },
                    "per serving": {
                        "float": {
                            "amount": 0.0,
                            "unit": "g"
                        },
                        "fraction string": {
                            "amount": "0",
                            "unit": "g"
                        }
                    },
                    "effectual portion per package": {
                        "from quantified ingredients": {
                            "fraction float string": "0.0",
                            "fraction string": "0",
                            "percentage string": "0.000%"
                        }
                    },
                    "compositional portion per package": {
                        "from defined package mass": {
                            "fraction float string": "0.0",
                            "fraction string": "0",
                            "percentage string": "0.000%"
                        }
                    }
                },
                "quantified grove": []
            },
            {
                "name": "Iron, Fe",
                "struct": {
                    "includes": [],
                    "names": [
                        "iron",
                        "iron, fe"
                    ],
                    "region": 75
                },
                "mass": {
                    "per package": {
                        "float": {
                            "amount": 12.984399999999999,
                            "unit": "mg"
                        },
                        "fraction string": {
                            "amount": "1461913475040736643/112589990684262400",
                            "unit": "mg"
                        },
                        "fraction string grams": "1461913475040736643/112589990684262400000",
                        "float grams": 0.0129844
                    },
                    "per serving": {
                        "float": {
                            "amount": 0.8008,
                            "unit": "mg"
                        },
                        "fraction string": {
                            "amount": "45081032269978663/56294995342131200",
                            "unit": "mg"
                        }
                    },
                    "effectual portion per package": {
                        "from quantified ingredients": {
                            "fraction float string": "3.0618080554671146e-05",
                            "fraction string": "6440147467139809/210338053544551424737",
                            "percentage string": "0.003%"
                        }
                    },
                    "compositional portion per package": {
                        "from defined package mass": {
                            "fraction float string": "2.8599999999999997e-05",
                            "fraction string": "6440147467139809/225179981368524800000",
                            "percentage string": "0.300%"
                        }
                    }
                },
                "quantified grove": []
            },
            {
                "name": "Sodium, Na",
                "struct": {
                    "includes": [],
                    "names": [
                        "sodium Na",
                        "sodium, Na",
                        "sodium",
                        "Na"
                    ],
                    "region": 59
                },
                "mass": {
                    "per package": {
                        "float": {
                            "amount": 0.0,
                            "unit": "mg"
                        },
                        "fraction string": {
                            "amount": "0",
                            "unit": "mg"
                        },
                        "fraction string grams": "0",
                        "float grams": 0.0
                    },
                    "per serving": {
                        "float": {
                            "amount": 0.0,
                            "unit": "mg"
                        },
                        "fraction string": {
                            "amount": "0",
                            "unit": "mg"
                        }
                    },
                    "effectual portion per package": {
                        "from quantified ingredients": {
                            "fraction float string": "0.0",
                            "fraction string": "0",
                            "percentage string": "0.000%"
                        }
                    },
                    "compositional portion per package": {
                        "from defined package mass": {
                            "fraction float string": "0.0",
                            "fraction string": "0",
                            "percentage string": "0.000%"
                        }
                    }
                },
                "quantified grove": []
            },
            {
                "name": "Total lipid (fat)",
                "struct": {
                    "includes": [
                        4,
                        5,
                        15,
                        51
                    ],
                    "names": [
                        "fats",
                        "total fat",
                        "lipids",
                        "total lipid (fat)"
                    ],
                    "region": 3
                },
                "mass": {
                    "per package": {
                        "float": {
                            "amount": 291.87660000000005,
                            "unit": "g"
                        },
                        "fraction string": {
                            "amount": "1026949489842318313/3518437208883200",
                            "unit": "g"
                        },
                        "fraction string grams": "1026949489842318313/3518437208883200",
                        "float grams": 291.87660000000005
                    },
                    "per serving": {
                        "float": {
                            "amount": 18.0012,
                            "unit": "g"
                        },
                        "fraction string": {
                            "amount": "31668045942274133/1759218604441600",
                            "unit": "g"
                        }
                    },
                    "effectual portion per package": {
                        "from quantified ingredients": {
                            "fraction float string": "0.6882644751258071",
                            "fraction string": "144768210021824608000/210338053544551424737",
                            "percentage string": "68.826%"
                        }
                    },
                    "compositional portion per package": {
                        "from defined package mass": {
                            "fraction float string": "0.6429",
                            "fraction string": "4524006563182019/7036874417766400",
                            "percentage string": "64.290%"
                        }
                    }
                },
                "quantified grove": [
                    {
                        "name": "Fatty acids, total monounsaturated",
                        "struct": {
                            "includes": [],
                            "names": [
                                "monounsaturated fat",
                                "fatty acids, total monounsaturated"
                            ],
                            "region": 51
                        },
                        "mass": {
                            "per package": {
                                "float": {
                                    "amount": 40.5422,
                                    "unit": "g"
                                },
                                "fraction string": {
                                    "amount": "285290370019968933/7036874417766400",
                                    "unit": "g"
                                },
                                "fraction string grams": "285290370019968933/7036874417766400",
                                "float grams": 40.5422
                            },
                            "per serving": {
                                "float": {
                                    "amount": 2.5004,
                                    "unit": "g"
                                },
                                "fraction string": {
                                    "amount": "8797500397091553/3518437208883200",
                                    "unit": "g"
                                }
                            }
                        },
                        "quantified grove": []
                    },
                    {
                        "name": "Fatty acids, total polyunsaturated",
                        "struct": {
                            "includes": [],
                            "names": [
                                "polyunsaturated fat",
                                "fatty acids, total polyunsaturated"
                            ],
                            "region": 15
                        },
                        "mass": {
                            "per package": {
                                "float": {
                                    "amount": 210.7922,
                                    "unit": "g"
                                },
                                "fraction string": {
                                    "amount": "1483318239644698533/7036874417766400",
                                    "unit": "g"
                                },
                                "fraction string grams": "1483318239644698533/7036874417766400",
                                "float grams": 210.7922
                            },
                            "per serving": {
                                "float": {
                                    "amount": 13.000399999999999,
                                    "unit": "g"
                                },
                                "fraction string": {
                                    "amount": "45741091090365153/3518437208883200",
                                    "unit": "g"
                                }
                            }
                        },
                        "quantified grove": []
                    },
                    {
                        "name": "Fatty acids, total saturated",
                        "struct": {
                            "includes": [],
                            "names": [
                                "saturated fat",
                                "fatty acids, total saturated"
                            ],
                            "region": 4
                        },
                        "mass": {
                            "per package": {
                                "float": {
                                    "amount": 24.334400000000002,
                                    "unit": "g"
                                },
                                "fraction string": {
                                    "amount": "273980986930711511/11258999068426240",
                                    "unit": "g"
                                },
                                "fraction string grams": "273980986930711511/11258999068426240",
                                "float grams": 24.334400000000002
                            },
                            "per serving": {
                                "float": {
                                    "amount": 1.5008000000000001,
                                    "unit": "g"
                                },
                                "fraction string": {
                                    "amount": "8448752900947051/5629499534213120",
                                    "unit": "g"
                                }
                            }
                        },
                        "quantified grove": []
                    }
                ]
            },
            {
                "name": "Vitamin D (D2 + D3), International Units",
                "struct": {
                    "includes": [],
                    "names": [
                        "vitamin d",
                        "vitamin d (d2 + d3)",
                        "vitamin d2",
                        "vitamin d3",
                        "vitamin d (d2 + d3), international units"
                    ],
                    "region": 63
                },
                "effectual mass": {
                    "per package": {
                        "float": {
                            "amount": 0.0,
                            "unit": "IU"
                        },
                        "fraction string": {
                            "amount": "0",
                            "unit": "IU"
                        }
                    },
                    "per serving": {
                        "float": {
                            "amount": 0.0,
                            "unit": "IU"
                        },
                        "fraction string": {
                            "amount": "0",
                            "unit": "IU"
                        }
                    }
                },
                "quantified grove": []
            },
            {
                "name": "Calcium, Ca",
                "struct": {
                    "includes": [],
                    "names": [
                        "calcium",
                        "calcium, ca"
                    ],
                    "region": 9
                },
                "mass": {
                    "per package": {
                        "float": {
                            "amount": 485.78,
                            "unit": "mg"
                        },
                        "fraction string": {
                            "amount": "24289/50",
                            "unit": "mg"
                        },
                        "fraction string grams": "24289/50000",
                        "float grams": 0.48578
                    },
                    "per serving": {
                        "float": {
                            "amount": 29.96,
                            "unit": "mg"
                        },
                        "fraction string": {
                            "amount": "749/25",
                            "unit": "mg"
                        }
                    },
                    "effectual portion per package": {
                        "from quantified ingredients": {
                            "fraction float string": "0.0011455016151572773",
                            "fraction string": "240942580064321536/210338053544551424737",
                            "percentage string": "0.115%"
                        }
                    },
                    "compositional portion per package": {
                        "from defined package mass": {
                            "fraction float string": "0.00107",
                            "fraction string": "107/100000",
                            "percentage string": "0.107%"
                        }
                    }
                },
                "quantified grove": []
            },
            {
                "name": "Protein",
                "struct": {
                    "includes": [],
                    "names": [
                        "protein"
                    ],
                    "region": 1
                },
                "mass": {
                    "per package": {
                        "float": {
                            "amount": 64.8766,
                            "unit": "g"
                        },
                        "fraction string": {
                            "amount": "456528486851663599/7036874417766400",
                            "unit": "g"
                        },
                        "fraction string grams": "456528486851663599/7036874417766400",
                        "float grams": 64.8766
                    },
                    "per serving": {
                        "float": {
                            "amount": 4.0012,
                            "unit": "g"
                        },
                        "fraction string": {
                            "amount": "14077970960183459/3518437208883200",
                            "unit": "g"
                        }
                    },
                    "effectual portion per package": {
                        "from quantified ingredients": {
                            "fraction float string": "0.15298334654764012",
                            "fraction string": "32178219337562192000/210338053544551424737",
                            "percentage string": "15.298%"
                        }
                    },
                    "compositional portion per package": {
                        "from defined package mass": {
                            "fraction float string": "0.1429",
                            "fraction string": "2011138708597637/14073748835532800",
                            "percentage string": "14.290%"
                        }
                    }
                },
                "quantified grove": []
            },
            {
                "name": "Cholesterol",
                "struct": {
                    "includes": [],
                    "names": [
                        "cholesterol"
                    ],
                    "region": 12
                },
                "mass": {
                    "per package": {
                        "float": {
                            "amount": 0.0,
                            "unit": "mg"
                        },
                        "fraction string": {
                            "amount": "0",
                            "unit": "mg"
                        },
                        "fraction string grams": "0",
                        "float grams": 0.0
                    },
                    "per serving": {
                        "float": {
                            "amount": 0.0,
                            "unit": "mg"
                        },
                        "fraction string": {
                            "amount": "0",
                            "unit": "mg"
                        }
                    },
                    "effectual portion per package": {
                        "from quantified ingredients": {
                            "fraction float string": "0.0",
                            "fraction string": "0",
                            "percentage string": "0.000%"
                        }
                    },
                    "compositional portion per package": {
                        "from defined package mass": {
                            "fraction float string": "0.0",
                            "fraction string": "0",
                            "percentage string": "0.000%"
                        }
                    }
                },
                "quantified grove": []
            },
            {
                "name": "Carbohydrate, by difference",
                "struct": {
                    "includes": [
                        6,
                        7
                    ],
                    "names": [
                        "carbohydrates",
                        "carbohydrate, by difference",
                        "total carbohydrates"
                    ],
                    "region": 2
                },
                "mass": {
                    "per package": {
                        "float": {
                            "amount": 64.8766,
                            "unit": "g"
                        },
                        "fraction string": {
                            "amount": "456528486851663599/7036874417766400",
                            "unit": "g"
                        },
                        "fraction string grams": "456528486851663599/7036874417766400",
                        "float grams": 64.8766
                    },
                    "per serving": {
                        "float": {
                            "amount": 4.0012,
                            "unit": "g"
                        },
                        "fraction string": {
                            "amount": "14077970960183459/3518437208883200",
                            "unit": "g"
                        }
                    },
                    "effectual portion per package": {
                        "from quantified ingredients": {
                            "fraction float string": "0.15298334654764012",
                            "fraction string": "32178219337562192000/210338053544551424737",
                            "percentage string": "15.298%"
                        }
                    },
                    "compositional portion per package": {
                        "from defined package mass": {
                            "fraction float string": "0.1429",
                            "fraction string": "2011138708597637/14073748835532800",
                            "percentage string": "14.290%"
                        }
                    }
                },
                "quantified grove": [
                    {
                        "name": "Sugars, total including NLEA",
                        "struct": {
                            "includes": [
                                8
                            ],
                            "names": [
                                "sugars",
                                "total sugars",
                                "sugars, total including nlea"
                            ],
                            "region": 7
                        },
                        "mass": {
                            "per package": {
                                "float": {
                                    "amount": 16.2078,
                                    "unit": "g"
                                },
                                "fraction string": {
                                    "amount": "364967210202477609/22517998136852480",
                                    "unit": "g"
                                },
                                "fraction string grams": "364967210202477609/22517998136852480",
                                "float grams": 16.2078
                            },
                            "per serving": {
                                "float": {
                                    "amount": 0.9995999999999999,
                                    "unit": "g"
                                },
                                "fraction string": {
                                    "amount": "11254495468798869/11258999068426240",
                                    "unit": "g"
                                }
                            }
                        },
                        "quantified grove": [
                            {
                                "name": "Sugars, added",
                                "struct": {
                                    "includes": [],
                                    "names": [
                                        "added sugars",
                                        "sugars, added"
                                    ],
                                    "region": 8
                                },
                                "mass": {
                                    "per package": {
                                        "float": {
                                            "amount": 0.0,
                                            "unit": "g"
                                        },
                                        "fraction string": {
                                            "amount": "0",
                                            "unit": "g"
                                        },
                                        "fraction string grams": "0",
                                        "float grams": 0.0
                                    },
                                    "per serving": {
                                        "float": {
                                            "amount": 0.0,
                                            "unit": "g"
                                        },
                                        "fraction string": {
                                            "amount": "0",
                                            "unit": "g"
                                        }
                                    }
                                },
                                "quantified grove": []
                            }
                        ]
                    },
                    {
                        "name": "Fiber, total dietary",
                        "struct": {
                            "includes": [],
                            "names": [
                                "dietary fiber",
                                "fiber, total dietary"
                            ],
                            "region": 6
                        },
                        "mass": {
                            "per package": {
                                "float": {
                                    "amount": 32.234,
                                    "unit": "g"
                                },
                                "fraction string": {
                                    "amount": "181461287985825701/5629499534213120",
                                    "unit": "g"
                                },
                                "fraction string grams": "181461287985825701/5629499534213120",
                                "float grams": 32.234
                            },
                            "per serving": {
                                "float": {
                                    "amount": 1.988,
                                    "unit": "g"
                                },
                                "fraction string": {
                                    "amount": "5595722537007841/2814749767106560",
                                    "unit": "g"
                                }
                            }
                        },
                        "quantified grove": []
                    }
                ]
            },
            {
                "name": "Potassium, K",
                "struct": {
                    "includes": [],
                    "names": [
                        "potassium",
                        "potassium K",
                        "potassium, K",
                        "K"
                    ],
                    "region": 58
                },
                "mass": {
                    "per package": {
                        "float": {
                            "amount": 1947.66,
                            "unit": "mg"
                        },
                        "fraction string": {
                            "amount": "97383/50",
                            "unit": "mg"
                        },
                        "fraction string grams": "97383/50000",
                        "float grams": 1.94766
                    },
                    "per serving": {
                        "float": {
                            "amount": 120.12,
                            "unit": "mg"
                        },
                        "fraction string": {
                            "amount": "3003/25",
                            "unit": "mg"
                        }
                    },
                    "effectual portion per package": {
                        "from quantified ingredients": {
                            "fraction float string": "0.004592712083200673",
                            "fraction string": "966022120070971392/210338053544551424737",
                            "percentage string": "0.459%"
                        }
                    },
                    "compositional portion per package": {
                        "from defined package mass": {
                            "fraction float string": "0.00429",
                            "fraction string": "429/100000",
                            "percentage string": "0.429%"
                        }
                    }
                },
                "quantified grove": []
            }
        ],
        "unquantified": [],
        "unquantified string": "WALNUTS."
    }
}