[
    {
        "includes": [],
        "names": [
            "protein"
        ],
        "region": 1,
        "includes structs": [],
        "ingredients": [
            {
                "sequential": 1,
                "product": {
                    "name": "Chia Seeds",
                    "DSLD ID": "214893",
                    "UPC": "8 18423 02863 7"
                },
                "mass": {
                    "per package": {
                        "fraction string grams": "227/3"
                    }
                }
            }
        ],
        "mass": {
            "per package": {
                "fraction string grams": "227/3",
                "float string grams": "75.66666666666667"
            }
        }
    },
    {
        "includes": [
            6,
            7
        ],
        "names": [
            "carbohydrates",
            "carbohydrate, by difference",
            "total carbohydrates"
        ],
        "region": 2,
        "includes structs": [
            {
                "includes": [],
                "names": [
                    "dietary fiber",
                    "fiber, total dietary"
                ],
                "region": 6,
                "includes structs": [],
                "ingredients": [
                    {
                        "sequential": 1,
                        "product": {
                            "name": "Chia Seeds",
                            "DSLD ID": "214893",
                            "UPC": "8 18423 02863 7"
                        },
                        "mass": {
                            "per package": {
                                "fraction string grams": "1135/6"
                            }
                        }
                    }
                ],
                "mass": {
                    "per package": {
                        "fraction string grams": "1135/6",
                        "float string grams": "189.16666666666666"
                    }
                }
            },
            {
                "includes": [
                    8
                ],
                "names": [
                    "sugars",
                    "total sugars",
                    "sugars, total including nlea"
                ],
                "region": 7,
                "includes structs": [
                    {
                        "includes": [],
                        "names": [
                            "added sugars",
                            "sugars, added"
                        ],
                        "region": 8,
                        "includes structs": [],
                        "ingredients": [
                            {
                                "sequential": 1,
                                "product": {
                                    "name": "Chia Seeds",
                                    "DSLD ID": "214893",
                                    "UPC": "8 18423 02863 7"
                                },
                                "mass": {
                                    "per package": {
                                        "fraction string grams": "0"
                                    }
                                }
                            }
                        ],
                        "mass": {
                            "per package": {
                                "fraction string grams": "0",
                                "float string grams": "0.0"
                            }
                        }
                    }
                ],
                "ingredients": [
                    {
                        "sequential": 1,
                        "product": {
                            "name": "Chia Seeds",
                            "DSLD ID": "214893",
                            "UPC": "8 18423 02863 7"
                        },
                        "mass": {
                            "per package": {
                                "fraction string grams": "0"
                            }
                        }
                    }
                ],
                "mass": {
                    "per package": {
                        "fraction string grams": "0",
                        "float string grams": "0.0"
                    }
                }
            }
        ],
        "ingredients": [
            {
                "sequential": 1,
                "product": {
                    "name": "Chia Seeds",
                    "DSLD ID": "214893",
                    "UPC": "8 18423 02863 7"
                },
                "mass": {
                    "per package": {
                        "fraction string grams": "1135/6"
                    }
                }
            }
        ],
        "mass": {
            "per package": {
                "fraction string grams": "1135/6",
                "float string grams": "189.16666666666666"
            }
        }
    },
    {
        "includes": [
            4,
            5,
            15,
            51
        ],
        "names": [
            "fats",
            "total fat",
            "lipids",
            "total lipid (fat)"
        ],
        "region": 3,
        "includes structs": [
            {
                "includes": [],
                "names": [
                    "saturated fat",
                    "fatty acids, total saturated"
                ],
                "region": 4,
                "includes structs": [],
                "ingredients": [
                    {
                        "sequential": 1,
                        "product": {
                            "name": "Chia Seeds",
                            "DSLD ID": "214893",
                            "UPC": "8 18423 02863 7"
                        },
                        "mass": {
                            "per package": {
                                "fraction string grams": "776961007713957979/54043195528445952"
                            }
                        }
                    }
                ],
                "mass": {
                    "per package": {
                        "fraction string grams": "776961007713957979/54043195528445952",
                        "float string grams": "14.376666666666667"
                    }
                }
            },
            {
                "includes": [],
                "names": [
                    "trans fat",
                    "fatty acids, total trans"
                ],
                "region": 5,
                "includes structs": [],
                "ingredients": [
                    {
                        "sequential": 1,
                        "product": {
                            "name": "Chia Seeds",
                            "DSLD ID": "214893",
                            "UPC": "8 18423 02863 7"
                        },
                        "mass": {
                            "per package": {
                                "fraction string grams": "0"
                            }
                        }
                    }
                ],
                "mass": {
                    "per package": {
                        "fraction string grams": "0",
                        "float string grams": "0.0"
                    }
                }
            },
            {
                "includes": [],
                "names": [
                    "polyunsaturated fat",
                    "fatty acids, total polyunsaturated"
                ],
                "region": 15,
                "includes structs": [],
                "ingredients": [
                    {
                        "sequential": 1,
                        "product": {
                            "name": "Chia Seeds",
                            "DSLD ID": "214893",
                            "UPC": "8 18423 02863 7"
                        },
                        "mass": {
                            "per package": {
                                "fraction string grams": "715621980789171769/6755399441055744"
                            }
                        }
                    }
                ],
                "mass": {
                    "per package": {
                        "fraction string grams": "715621980789171769/6755399441055744",
                        "float string grams": "105.93333333333332"
                    }
                }
            },
            {
                "includes": [],
                "names": [
                    "monounsaturated fat",
                    "fatty acids, total monounsaturated"
                ],
                "region": 51,
                "includes structs": [],
                "ingredients": [
                    {
                        "sequential": 1,
                        "product": {
                            "name": "Chia Seeds",
                            "DSLD ID": "214893",
                            "UPC": "8 18423 02863 7"
                        },
                        "mass": {
                            "per package": {
                                "fraction string grams": "227/24"
                            }
                        }
                    }
                ],
                "mass": {
                    "per package": {
                        "fraction string grams": "227/24",
                        "float string grams": "9.458333333333334"
                    }
                }
            }
        ],
        "ingredients": [
            {
                "sequential": 1,
                "product": {
                    "name": "Chia Seeds",
                    "DSLD ID": "214893",
                    "UPC": "8 18423 02863 7"
                },
                "mass": {
                    "per package": {
                        "fraction string grams": "1589/12"
                    }
                }
            }
        ],
        "mass": {
            "per package": {
                "fraction string grams": "1589/12",
                "float string grams": "132.41666666666666"
            }
        }
    },
    {
        "includes": [],
        "names": [
            "calcium",
            "calcium, ca"
        ],
        "region": 9,
        "includes structs": [],
        "ingredients": [
            {
                "sequential": 1,
                "product": {
                    "name": "Chia Seeds",
                    "DSLD ID": "214893",
                    "UPC": "8 18423 02863 7"
                },
                "mass": {
                    "per package": {
                        "fraction string grams": "80613964204970697/28147497671065600"
                    }
                }
            }
        ],
        "mass": {
            "per package": {
                "fraction string grams": "80613964204970697/28147497671065600",
                "float string grams": "2.8639833333333335"
            }
        }
    },
    {
        "includes": [],
        "names": [
            "cholesterol"
        ],
        "region": 12,
        "includes structs": [],
        "ingredients": [
            {
                "sequential": 1,
                "product": {
                    "name": "Chia Seeds",
                    "DSLD ID": "214893",
                    "UPC": "8 18423 02863 7"
                },
                "mass": {
                    "per package": {
                        "fraction string grams": "0"
                    }
                }
            }
        ],
        "mass": {
            "per package": {
                "fraction string grams": "0",
                "float string grams": "0.0"
            }
        }
    },
    {
        "includes": [],
        "names": [
            "vitamin a",
            "vitamin a, iu"
        ],
        "region": 16,
        "includes structs": [],
        "ingredients": [],
        "mass": {
            "per package": {
                "fraction string grams": "0",
                "float string grams": "0.0"
            }
        }
    },
    {
        "includes": [],
        "names": [
            "vitamin e"
        ],
        "region": 19,
        "includes structs": [],
        "ingredients": [],
        "mass": {
            "per package": {
                "fraction string grams": "0",
                "float string grams": "0.0"
            }
        }
    },
    {
        "includes": [],
        "names": [
            "iodine"
        ],
        "region": 29,
        "includes structs": [],
        "ingredients": [],
        "mass": {
            "per package": {
                "fraction string grams": "0",
                "float string grams": "0.0"
            }
        }
    },
    {
        "includes": [],
        "names": [
            "magnesium"
        ],
        "region": 30,
        "includes structs": [],
        "ingredients": [],
        "mass": {
            "per package": {
                "fraction string grams": "0",
                "float string grams": "0.0"
            }
        }
    },
    {
        "includes": [],
        "names": [
            "zinc"
        ],
        "region": 31,
        "includes structs": [],
        "ingredients": [],
        "mass": {
            "per package": {
                "fraction string grams": "0",
                "float string grams": "0.0"
            }
        }
    },
    {
        "includes": [],
        "names": [
            "selenium"
        ],
        "region": 32,
        "includes structs": [],
        "ingredients": [],
        "mass": {
            "per package": {
                "fraction string grams": "0",
                "float string grams": "0.0"
            }
        }
    },
    {
        "includes": [],
        "names": [
            "copper"
        ],
        "region": 33,
        "includes structs": [],
        "ingredients": [],
        "mass": {
            "per package": {
                "fraction string grams": "0",
                "float string grams": "0.0"
            }
        }
    },
    {
        "includes": [],
        "names": [
            "manganese"
        ],
        "region": 34,
        "includes structs": [],
        "ingredients": [
            {
                "sequential": 1,
                "product": {
                    "name": "Chia Seeds",
                    "DSLD ID": "214893",
                    "UPC": "8 18423 02863 7"
                },
                "mass": {
                    "per package": {
                        "fraction string grams": "?"
                    }
                }
            }
        ],
        "mass": {
            "per package": {
                "fraction string grams": "0",
                "float string grams": "0.0"
            }
        }
    },
    {
        "includes": [],
        "names": [
            "chromium"
        ],
        "region": 35,
        "includes structs": [],
        "ingredients": [],
        "mass": {
            "per package": {
                "fraction string grams": "0",
                "float string grams": "0.0"
            }
        }
    },
    {
        "includes": [],
        "names": [
            "molybdenum"
        ],
        "region": 36,
        "includes structs": [],
        "ingredients": [],
        "mass": {
            "per package": {
                "fraction string grams": "0",
                "float string grams": "0.0"
            }
        }
    },
    {
        "includes": [],
        "names": [
            "choline"
        ],
        "region": 37,
        "includes structs": [],
        "ingredients": [],
        "mass": {
            "per package": {
                "fraction string grams": "0",
                "float string grams": "0.0"
            }
        }
    },
    {
        "includes": [],
        "names": [
            "lutein"
        ],
        "region": 40,
        "includes structs": [],
        "ingredients": [],
        "mass": {
            "per package": {
                "fraction string grams": "0",
                "float string grams": "0.0"
            }
        }
    },
    {
        "includes": [],
        "names": [
            "betaine hydrochloride"
        ],
        "region": 43,
        "includes structs": [],
        "ingredients": [],
        "mass": {
            "per package": {
                "fraction string grams": "0",
                "float string grams": "0.0"
            }
        }
    },
    {
        "includes": [],
        "names": [
            "rutin"
        ],
        "region": 44,
        "includes structs": [],
        "ingredients": [],
        "mass": {
            "per package": {
                "fraction string grams": "0",
                "float string grams": "0.0"
            }
        }
    },
    {
        "includes": [],
        "names": [
            "strontium"
        ],
        "region": 47,
        "includes structs": [],
        "ingredients": [],
        "mass": {
            "per package": {
                "fraction string grams": "0",
                "float string grams": "0.0"
            }
        }
    },
    {
        "includes": [],
        "names": [
            "vanadium"
        ],
        "region": 49,
        "includes structs": [],
        "ingredients": [],
        "mass": {
            "per package": {
                "fraction string grams": "0",
                "float string grams": "0.0"
            }
        }
    },
    {
        "includes": [],
        "names": [
            "phosphorus"
        ],
        "region": 57,
        "includes structs": [],
        "ingredients": [
            {
                "sequential": 1,
                "product": {
                    "name": "Chia Seeds",
                    "DSLD ID": "214893",
                    "UPC": "8 18423 02863 7"
                },
                "mass": {
                    "per package": {
                        "fraction string grams": "4313/1000"
                    }
                }
            }
        ],
        "mass": {
            "per package": {
                "fraction string grams": "4313/1000",
                "float string grams": "4.313"
            }
        }
    },
    {
        "includes": [],
        "names": [
            "potassium",
            "potassium K",
            "potassium, K",
            "K"
        ],
        "region": 58,
        "includes structs": [],
        "ingredients": [
            {
                "sequential": 1,
                "product": {
                    "name": "Chia Seeds",
                    "DSLD ID": "214893",
                    "UPC": "8 18423 02863 7"
                },
                "mass": {
                    "per package": {
                        "fraction string grams": "245356107699144613/337769972052787200"
                    }
                }
            }
        ],
        "mass": {
            "per package": {
                "fraction string grams": "245356107699144613/337769972052787200",
                "float string grams": "0.7263999999999999"
            }
        }
    },
    {
        "includes": [],
        "names": [
            "sodium Na",
            "sodium, Na",
            "sodium",
            "Na"
        ],
        "region": 59,
        "includes structs": [],
        "ingredients": [
            {
                "sequential": 1,
                "product": {
                    "name": "Chia Seeds",
                    "DSLD ID": "214893",
                    "UPC": "8 18423 02863 7"
                },
                "mass": {
                    "per package": {
                        "fraction string grams": "0"
                    }
                }
            }
        ],
        "mass": {
            "per package": {
                "fraction string grams": "0",
                "float string grams": "0.0"
            }
        }
    },
    {
        "includes": [],
        "names": [
            "vitamin d",
            "vitamin d (d2 + d3)",
            "vitamin d2",
            "vitamin d3",
            "vitamin d (d2 + d3), international units"
        ],
        "region": 63,
        "includes structs": [],
        "ingredients": [
            {
                "sequential": 1,
                "product": {
                    "name": "Chia Seeds",
                    "DSLD ID": "214893",
                    "UPC": "8 18423 02863 7"
                },
                "mass": {
                    "per package": {
                        "fraction string grams": "0"
                    }
                }
            }
        ],
        "mass": {
            "per package": {
                "fraction string grams": "0",
                "float string grams": "0.0"
            }
        }
    },
    {
        "includes": [],
        "names": [
            "vitamin c",
            "vitamin c (form: as calcium ascorbate)",
            "vitamin c, total ascorbic acid"
        ],
        "region": 64,
        "includes structs": [],
        "ingredients": [],
        "mass": {
            "per package": {
                "fraction string grams": "0",
                "float string grams": "0.0"
            }
        }
    },
    {
        "includes": [],
        "names": [
            "vitamin k",
            "vitamin k1",
            "vitamin k2"
        ],
        "region": 65,
        "includes structs": [],
        "ingredients": [],
        "mass": {
            "per package": {
                "fraction string grams": "0",
                "float string grams": "0.0"
            }
        }
    },
    {
        "includes": [],
        "names": [
            "thiamin",
            "thiamine",
            "vitamin b1"
        ],
        "region": 66,
        "includes structs": [],
        "ingredients": [],
        "mass": {
            "per package": {
                "fraction string grams": "0",
                "float string grams": "0.0"
            }
        }
    },
    {
        "includes": [],
        "names": [
            "riboflavin",
            "vitamin b2"
        ],
        "region": 67,
        "includes structs": [],
        "ingredients": [],
        "mass": {
            "per package": {
                "fraction string grams": "0",
                "float string grams": "0.0"
            }
        }
    },
    {
        "includes": [],
        "names": [
            "vitamin b3",
            "niacin",
            "nicotinamide",
            "nicotinamide riboside"
        ],
        "region": 68,
        "includes structs": [],
        "ingredients": [],
        "mass": {
            "per package": {
                "fraction string grams": "0",
                "float string grams": "0.0"
            }
        }
    },
    {
        "includes": [],
        "names": [
            "vitamin b5",
            "pantothenic acid"
        ],
        "region": 69,
        "includes structs": [],
        "ingredients": [],
        "mass": {
            "per package": {
                "fraction string grams": "0",
                "float string grams": "0.0"
            }
        }
    },
    {
        "includes": [],
        "names": [
            "vitamin b6",
            "pyridoxine",
            "pyridoxal",
            "pyridoxamine"
        ],
        "region": 70,
        "includes structs": [],
        "ingredients": [],
        "mass": {
            "per package": {
                "fraction string grams": "0",
                "float string grams": "0.0"
            }
        }
    },
    {
        "includes": [],
        "names": [
            "vitamin b7",
            "biotin",
            "vitamin h"
        ],
        "region": 71,
        "includes structs": [],
        "ingredients": [],
        "mass": {
            "per package": {
                "fraction string grams": "0",
                "float string grams": "0.0"
            }
        }
    },
    {
        "includes": [],
        "names": [
            "vitamin b9",
            "folate",
            "folacin"
        ],
        "region": 72,
        "includes structs": [],
        "ingredients": [],
        "mass": {
            "per package": {
                "fraction string grams": "0",
                "float string grams": "0.0"
            }
        }
    },
    {
        "includes": [],
        "names": [
            "vitamin b12",
            "cobalamin"
        ],
        "region": 73,
        "includes structs": [],
        "ingredients": [],
        "mass": {
            "per package": {
                "fraction string grams": "0",
                "float string grams": "0.0"
            }
        }
    },
    {
        "includes": [],
        "names": [
            "calories",
            "energy"
        ],
        "region": 74,
        "includes structs": [],
        "ingredients": [
            {
                "sequential": 1,
                "product": {
                    "name": "Chia Seeds",
                    "DSLD ID": "214893",
                    "UPC": "8 18423 02863 7"
                },
                "mass": {
                    "per package": {
                        "fraction string grams": "?"
                    }
                }
            }
        ],
        "mass": {
            "per package": {
                "fraction string grams": "0",
                "float string grams": "0.0"
            }
        }
    },
    {
        "includes": [],
        "names": [
            "iron",
            "iron, fe"
        ],
        "region": 75,
        "includes structs": [],
        "ingredients": [
            {
                "sequential": 1,
                "product": {
                    "name": "Chia Seeds",
                    "DSLD ID": "214893",
                    "UPC": "8 18423 02863 7"
                },
                "mass": {
                    "per package": {
                        "fraction string grams": "245356107699144613/5404319552844595200"
                    }
                }
            }
        ],
        "mass": {
            "per package": {
                "fraction string grams": "245356107699144613/5404319552844595200",
                "float string grams": "0.045399999999999996"
            }
        }
    }
]