{
  "modules": ["somatic"],
  "steps": {
    "parse_manifest": "utilities",
    "manifest_to_alns": "alignment",
    "alns_to_procd_alns": "alignment",
    "alns_to_som_vars": "somatic"
  },
  "references": [
    "https://storage.googleapis.com/genomics-public-data/resources/broad/hg38/v0/Homo_sapiens_assembly38.fasta",
    "https://storage.googleapis.com/genomics-public-data/resources/broad/hg38/v0/Homo_sapiens_assembly38.dbsnp138.vcf",
    "https://storage.googleapis.com/gatk-best-practices/somatic-hg38/1000g_pon.hg38.vcf.gz",
    "https://storage.googleapis.com/gatk-best-practices/somatic-hg38/af-only-gnomad.hg38.vcf.gz",
    "https://storage.googleapis.com/gatk-best-practices/somatic-hg38/small_exac_common_3.hg38.vcf.gz",
    "hg38_exome.bed"
  ],
  "references_postproc": {
    "Homo_sapiens_assembly38.dbsnp138.vcf": "bgzip"
  },
  "find_and_replace": {
    "manifest_to_alns(\n  MANIFEST": "manifest_to_alns(\n  parse_manifest.out.manifest",
    "alns_to_procd_alns(\n  ALNS": "alns_to_procd_alns(\n  manifest_to_alns.out.alns",
    "alns_to_som_vars(\n  ALNS": "alns_to_som_vars(\n  alns_to_procd_alns.out.procd_bams",
    "MANIFEST)": "parse_manifest.out.manifest)",
    "VCFS,": "'',",
    "JUNCTIONS,": "'',"
  }
}

