{
  "modules": ["immuno"],
  "steps": {
    "parse_manifest": "utilities",
    "manifest_to_mhc_alleles": "immuno"
  },
  "references": [
    "https://gitlab.com/reproducible-analyses-framework-and-tools/nextflow/workflows/hla-types/hla-types-human/hla-types-human-refs/-/raw/main/hla-types-human-refs.py",
    "Homo_sapiens_assembly38.fasta",
    "dummy_file"
  ],
  "references_postproc": {
    "hla-types-human-refs.py": "python3"
  },
  "find_and_replace": {
    "alleles(\n  MANIFEST,": "alleles(\n  parse_manifest.out.manifest,"
  }
}

