{
  "modules": ["germline"],
  "steps": {
    "parse_manifest": "utilities",
    "manifest_to_alns": "alignment",
    "alns_to_procd_alns": "alignment",
    "alns_to_germ_vars": "germline"
  },
  "references": [
    "https://gitlab.com/reproducible-analyses-framework-and-tools/nextflow/workflows/germline-vars/germline-vars-human/germline-vars-human-refs/-/raw/main/germline-vars-human-refs.py",
    "Homo_sapiens_assembly38.fasta",                                                                
    "Homo_sapiens_assembly38.dbsnp138.vcf",                                                         
    "hg38_exome.bed"  
  ],
  "references_postproc": {
    "Homo_sapiens_assembly38.dbsnp138.vcf": "bgzip"
  },
  "find_and_replace": {
    "manifest_to_alns(\n  MANIFEST": "manifest_to_alns(\n  parse_manifest.out.manifest",
    "alns_to_procd_alns(\n  ALNS": "alns_to_procd_alns(\n  manifest_to_alns.out.alns",
    "alns_to_germ_vars(\n  ALNS": "alns_to_germ_vars(\n  alns_to_procd_alns.out.procd_bams",
    "MANIFEST)": "parse_manifest.out.manifest)",
    "VCFS,": "'',",
    "JUNCTIONS,": "'',"
  }
}

