{
  "modules": ["fusion"],
  "steps": {
    "parse_manifest": "utilities",
    "manifest_to_fusions": "fusion"
  },
  "references": [
    "https://gitlab.com/reproducible-analyses-framework-and-tools/nextflow/workflows/gene-fusions/gene-fusions-human/gene-fusions-human-refs/-/raw/main/gene-fusions-human-refs.py",
    "Homo_sapiens_assembly38.fasta",
    "GRCh38_gencode_v37_CTAT_lib_Mar012021.plug-n-play"
  ],
  "fastqs": [
    "ftp://ftp.sra.ebi.ac.uk/vol1/fastq/SRR866/005/SRR8668635/SRR8668635_1.fastq.gz",
    "ftp://ftp.sra.ebi.ac.uk/vol1/fastq/SRR866/005/SRR8668635/SRR8668635_2.fastq.gz"
  ],
  "references_postproc": {
    "gene-fusions-human-refs.py": "python3"
  },
  "find_and_replace": {
    "fusions(\n  MANIFEST,": "fusions(\n  parse_manifest.out.manifest,",
    "MANIFEST)": "parse_manifest.out.manifest)"
  }
}

