{
  "modules": ["clens"],
  "steps": {
    "parse_immuno_manifest": "immuno",
    "manifest_to_clens": "clens"
  },
  "references": [
    "https://gitlab.com/reproducible-analyses-framework-and-tools/nextflow/workflows/clens/clens-human/clens-human-refs/-/raw/main/clens.general_refs.py",
    "https://gitlab.com/reproducible-analyses-framework-and-tools/nextflow/workflows/clens/clens-human/clens-human-refs/-/raw/main/clens.human_refs.py",
    "1000g_pon.hg38.vcf.gz",
    "af-only-gnomad.hg38.vcf.gz",
    "antigen.garnish",
    "dummy_file",
    "gencode.v36.annotation.gtf",
    "gencode.v36.pc_translations.fa",
    "GRCh38.GENCODEv36",
    "hg38.gencode_v36.exome.bed",
    "Homo_sapiens_assembly38.dbsnp138.vcf.gz",
    "Homo_sapiens.assembly38.fa",
    "mhcflurry",
    "somalier.sites.hg38.vcf.gz",
    "small_exac_common_3.hg38.vcf.gz"
  ],
  "references_postproc": {
    "clens.human_refs.py": "python3",
    "clens.general_refs.py": "python3"
  },
  "find_and_replace": {
    "manifest_to_clens(\n  MANIFEST": "manifest_to_clens(\n  parse_immuno_manifest.out.manifest"
  }
}
