[
  {
    "collection": "readers",
    "schema": {
      "email": "",
      "password": "",
      "books": [
        {
          "id": "213213123",
          "dateBought": "",
          "inUse": true,
          "device": {
            "id": "asdasdd",
            "model": "ASUS Zenfone 4 Max"
          }
        }
      ],
      "isDeleted": false,
      "createdAt": ""
    }
  },
  {
    "collection": "books",
    "schema": {
      "authorId": "60b9e2020ec04e9a37d29f43",
      "author": "R.C. Barnedo",
      "title": "How to Protect",
      "autoresponder": {
        "name": "getresponse",
        "list": "shelph_buyers"
      },
      "isDeleted": false,
      "createdAt": ""
    }
  },
  {
    "collection": "authors",
    "schema": {
      "email": "barnedorenz@gmail.com",
      "password": "",
      "name": "Renz Aldwin C. Barnedo",
      "alias": "R.C. Barnedo",
      "isDeleted": false,
      "createdAt": ""
    }
  }
]
