NAME;STATUS;LOSS;REWARD;GEOMEAN;GEOMEANBEST;PPROF;PPROFBEST;ITER;NF
HS43;1;0.000000e+00;-9.000000e+00;0.000000e+00;0.000000e+00;0.000000e+00;0.000000e+00;9;11
DUAL3;1;0.000000e+00;-1.000000e+01;0.000000e+00;0.000000e+00;0.000000e+00;0.000000e+00;10;12
HS72;1;0.000000e+00;-1.800000e+01;0.000000e+00;0.000000e+00;0.000000e+00;0.000000e+00;18;20
TOYSARAH;0;0.000000e+00;-1.617000e+03;0.000000e+00;0.000000e+00;0.000000e+00;0.000000e+00;616;636
CHACONN2;1;0.000000e+00;-9.000000e+00;0.000000e+00;0.000000e+00;0.000000e+00;0.000000e+00;9;11
OSORIO;1;0.000000e+00;-1.200000e+01;0.000000e+00;0.000000e+00;0.000000e+00;0.000000e+00;12;14
HS44NEW;1;0.000000e+00;-1.300000e+01;0.000000e+00;0.000000e+00;0.000000e+00;0.000000e+00;13;15
AUG2DCQP;1;0.000000e+00;-2.100000e+01;0.000000e+00;0.000000e+00;0.000000e+00;0.000000e+00;21;23
HIMMELP3;1;0.000000e+00;-9.000000e+00;0.000000e+00;0.000000e+00;0.000000e+00;0.000000e+00;9;11
CRESC132;0;0.000000e+00;-2.000000e+03;0.000000e+00;0.000000e+00;0.000000e+00;0.000000e+00;1000;2135
HS45;1;0.000000e+00;-9.000000e+00;0.000000e+00;0.000000e+00;0.000000e+00;0.000000e+00;9;12
ANTWERP;1;0.000000e+00;-1.270000e+02;0.000000e+00;0.000000e+00;0.000000e+00;0.000000e+00;127;303
TFI3;1;0.000000e+00;-1.300000e+01;0.000000e+00;0.000000e+00;0.000000e+00;0.000000e+00;13;15
WATER;1;0.000000e+00;-2.600000e+01;0.000000e+00;0.000000e+00;0.000000e+00;0.000000e+00;26;28
OPTCDEG3;1;0.000000e+00;-2.500000e+01;0.000000e+00;0.000000e+00;0.000000e+00;0.000000e+00;25;27
A2NSSSSL;1;0.000000e+00;-3.100000e+01;0.000000e+00;0.000000e+00;0.000000e+00;0.000000e+00;31;112
RDW2D52F;1;0.000000e+00;-5.000000e+00;0.000000e+00;0.000000e+00;0.000000e+00;0.000000e+00;5;7
HS13;0;0.000000e+00;-1.020000e+03;0.000000e+00;0.000000e+00;0.000000e+00;0.000000e+00;20;22
EIGMINC;1;0.000000e+00;-9.000000e+00;0.000000e+00;0.000000e+00;0.000000e+00;0.000000e+00;9;11
A2ENINDL;1;0.000000e+00;-1.200000e+01;0.000000e+00;0.000000e+00;0.000000e+00;0.000000e+00;12;14
HS54;1;0.000000e+00;-1.600000e+01;0.000000e+00;0.000000e+00;0.000000e+00;0.000000e+00;16;18
GRIDNETF;1;0.000000e+00;-1.800000e+01;0.000000e+00;0.000000e+00;0.000000e+00;0.000000e+00;18;20
CSFI2;1;0.000000e+00;-6.100000e+01;0.000000e+00;0.000000e+00;0.000000e+00;0.000000e+00;61;215
GLIDER;1;0.000000e+00;-6.720000e+02;0.000000e+00;0.000000e+00;0.000000e+00;0.000000e+00;672;2708
PALMER8A;1;0.000000e+00;-4.800000e+01;0.000000e+00;0.000000e+00;0.000000e+00;0.000000e+00;48;60
LISWET11;1;0.000000e+00;-2.300000e+01;0.000000e+00;0.000000e+00;0.000000e+00;0.000000e+00;23;25
HS3MOD;0;0.000000e+00;-1.006000e+03;0.000000e+00;0.000000e+00;0.000000e+00;0.000000e+00;5;8
S268;1;0.000000e+00;-1.300000e+01;0.000000e+00;0.000000e+00;0.000000e+00;0.000000e+00;13;15
TFI2;1;0.000000e+00;-1.000000e+01;0.000000e+00;0.000000e+00;0.000000e+00;0.000000e+00;10;12
HS22;1;0.000000e+00;-6.000000e+00;0.000000e+00;0.000000e+00;0.000000e+00;0.000000e+00;6;8
MPC10;1;0.000000e+00;-4.000000e+01;0.000000e+00;0.000000e+00;0.000000e+00;0.000000e+00;40;42
CORE2;0;0.000000e+00;-2.000000e+03;0.000000e+00;0.000000e+00;0.000000e+00;0.000000e+00;1000;1033
DEMBO7;1;0.000000e+00;-2.200000e+01;0.000000e+00;0.000000e+00;0.000000e+00;0.000000e+00;22;24
TRO3X3;1;0.000000e+00;-1.100000e+01;0.000000e+00;0.000000e+00;0.000000e+00;0.000000e+00;11;13
FLETCHER;1;0.000000e+00;-2.900000e+01;0.000000e+00;0.000000e+00;0.000000e+00;0.000000e+00;29;33
ALLINITA;1;0.000000e+00;-2.600000e+01;0.000000e+00;0.000000e+00;0.000000e+00;0.000000e+00;26;279
BRAINPC0;0;0.000000e+00;-2.000000e+03;0.000000e+00;0.000000e+00;0.000000e+00;0.000000e+00;1000;11131
HS35;1;0.000000e+00;-6.000000e+00;0.000000e+00;0.000000e+00;0.000000e+00;0.000000e+00;6;8
PFIT3LS;1;0.000000e+00;-1.890000e+02;0.000000e+00;0.000000e+00;0.000000e+00;0.000000e+00;189;274
HS76I;1;0.000000e+00;-6.000000e+00;0.000000e+00;0.000000e+00;0.000000e+00;0.000000e+00;6;8
HIER163B;1;0.000000e+00;-1.800000e+01;0.000000e+00;0.000000e+00;0.000000e+00;0.000000e+00;18;20
OBSTCLBL;1;0.000000e+00;-1.300000e+01;0.000000e+00;0.000000e+00;0.000000e+00;0.000000e+00;13;15
BRAINPC1;0;0.000000e+00;-2.000000e+03;0.000000e+00;0.000000e+00;0.000000e+00;0.000000e+00;1000;15736
HS111;1;0.000000e+00;-2.100000e+01;0.000000e+00;0.000000e+00;0.000000e+00;0.000000e+00;21;23
HS86;1;0.000000e+00;-1.100000e+01;0.000000e+00;0.000000e+00;0.000000e+00;0.000000e+00;11;13
TRO6X2;0;0.000000e+00;-2.000000e+03;0.000000e+00;0.000000e+00;0.000000e+00;0.000000e+00;1000;1041
MOSARQP2;1;0.000000e+00;-9.000000e+00;0.000000e+00;0.000000e+00;0.000000e+00;0.000000e+00;9;11
LEWISPOL;0;0.000000e+00;-1.019000e+03;0.000000e+00;0.000000e+00;0.000000e+00;0.000000e+00;18;20
TABLE5;1;0.000000e+00;-2.000000e+01;0.000000e+00;0.000000e+00;0.000000e+00;0.000000e+00;20;22
KSIP;1;0.000000e+00;-2.200000e+01;0.000000e+00;0.000000e+00;0.000000e+00;0.000000e+00;22;24
VANDERM3;0;0.000000e+00;-2.000000e+03;0.000000e+00;0.000000e+00;0.000000e+00;0.000000e+00;1000;28424
MINMAXBD;1;0.000000e+00;-6.200000e+01;0.000000e+00;0.000000e+00;0.000000e+00;0.000000e+00;62;64
DEGENQPC;1;0.000000e+00;-1.000000e+01;0.000000e+00;0.000000e+00;0.000000e+00;0.000000e+00;10;12
A0ESINDL;1;0.000000e+00;-1.000000e+01;0.000000e+00;0.000000e+00;0.000000e+00;0.000000e+00;10;12
VANDERM1;0;0.000000e+00;-1.098000e+03;0.000000e+00;0.000000e+00;0.000000e+00;0.000000e+00;97;2069
LISWET3;1;0.000000e+00;-1.800000e+01;0.000000e+00;0.000000e+00;0.000000e+00;0.000000e+00;18;20
DISCS;0;0.000000e+00;-1.079000e+03;0.000000e+00;0.000000e+00;0.000000e+00;0.000000e+00;78;85
PROBPENL;1;0.000000e+00;-1.400000e+01;0.000000e+00;0.000000e+00;0.000000e+00;0.000000e+00;14;16
NUFFIELD;0;0.000000e+00;-2.000000e+03;0.000000e+00;0.000000e+00;0.000000e+00;0.000000e+00;1000;1215
ZECEVIC3;1;0.000000e+00;-1.300000e+01;0.000000e+00;0.000000e+00;0.000000e+00;0.000000e+00;13;15
HS117;1;0.000000e+00;-2.900000e+01;0.000000e+00;0.000000e+00;0.000000e+00;0.000000e+00;29;31
HUESTIS;1;0.000000e+00;-2.720000e+02;0.000000e+00;0.000000e+00;0.000000e+00;0.000000e+00;272;461
TORSIONF;1;0.000000e+00;-1.100000e+01;0.000000e+00;0.000000e+00;0.000000e+00;0.000000e+00;11;13
LAUNCH;0;0.000000e+00;-1.442000e+03;0.000000e+00;0.000000e+00;0.000000e+00;0.000000e+00;408;5078
DEGENLPB;1;0.000000e+00;-3.400000e+01;0.000000e+00;0.000000e+00;0.000000e+00;0.000000e+00;34;41
STNQP1;1;0.000000e+00;-1.200000e+01;0.000000e+00;0.000000e+00;0.000000e+00;0.000000e+00;12;14
TORSIOND;1;0.000000e+00;-1.100000e+01;0.000000e+00;0.000000e+00;0.000000e+00;0.000000e+00;11;13
ZY2;1;0.000000e+00;-7.000000e+00;0.000000e+00;0.000000e+00;0.000000e+00;0.000000e+00;7;9
HS102;1;0.000000e+00;-3.500000e+01;0.000000e+00;0.000000e+00;0.000000e+00;0.000000e+00;35;39
A0NSDSSL;1;0.000000e+00;-2.200000e+01;0.000000e+00;0.000000e+00;0.000000e+00;0.000000e+00;22;24
HS44;1;0.000000e+00;-1.400000e+01;0.000000e+00;0.000000e+00;0.000000e+00;0.000000e+00;14;20
HS30;1;0.000000e+00;-7.000000e+00;0.000000e+00;0.000000e+00;0.000000e+00;0.000000e+00;7;11
STEENBRB;1;0.000000e+00;-7.800000e+01;0.000000e+00;0.000000e+00;0.000000e+00;0.000000e+00;78;88
HS84;1;0.000000e+00;-1.600000e+01;0.000000e+00;0.000000e+00;0.000000e+00;0.000000e+00;16;18
NCVXBQP3;1;0.000000e+00;-7.440000e+02;0.000000e+00;0.000000e+00;0.000000e+00;0.000000e+00;744;746
MPC14;1;0.000000e+00;-3.600000e+01;0.000000e+00;0.000000e+00;0.000000e+00;0.000000e+00;36;38
A5NSSNSM;1;0.000000e+00;-2.500000e+01;0.000000e+00;0.000000e+00;0.000000e+00;0.000000e+00;25;27
A2NSDSDL;1;0.000000e+00;-1.400000e+01;0.000000e+00;0.000000e+00;0.000000e+00;0.000000e+00;14;16
QRTQUAD;1;0.000000e+00;-3.790000e+02;0.000000e+00;0.000000e+00;0.000000e+00;0.000000e+00;379;443
DIXCHLNV;1;0.000000e+00;-9.400000e+01;0.000000e+00;0.000000e+00;0.000000e+00;0.000000e+00;94;98
CHEMRCTB;0;0.000000e+00;-1.041000e+03;0.000000e+00;0.000000e+00;0.000000e+00;0.000000e+00;40;55
HAGER4;1;0.000000e+00;-8.000000e+00;0.000000e+00;0.000000e+00;0.000000e+00;0.000000e+00;8;10
OET6;1;0.000000e+00;-1.080000e+02;0.000000e+00;0.000000e+00;0.000000e+00;0.000000e+00;108;111
ROBOTARM;0;0.000000e+00;-2.000000e+03;0.000000e+00;0.000000e+00;0.000000e+00;0.000000e+00;1000;1331
EXPQUAD;1;0.000000e+00;-2.600000e+01;0.000000e+00;0.000000e+00;0.000000e+00;0.000000e+00;26;71
MDHOLE;1;0.000000e+00;-4.600000e+01;0.000000e+00;0.000000e+00;0.000000e+00;0.000000e+00;46;75
LUKVLI8;0;0.000000e+00;-1.082000e+03;0.000000e+00;0.000000e+00;0.000000e+00;0.000000e+00;82;182
READING4;1;0.000000e+00;-3.080000e+02;0.000000e+00;0.000000e+00;0.000000e+00;0.000000e+00;308;404
LSNNODOC;1;0.000000e+00;-1.000000e+01;0.000000e+00;0.000000e+00;0.000000e+00;0.000000e+00;10;12
BRAINPC4;0;0.000000e+00;-2.000000e+03;0.000000e+00;0.000000e+00;0.000000e+00;0.000000e+00;1000;10480
CHACONN1;1;0.000000e+00;-6.000000e+00;0.000000e+00;0.000000e+00;0.000000e+00;0.000000e+00;6;8
CONCON;1;0.000000e+00;-1.100000e+01;0.000000e+00;0.000000e+00;0.000000e+00;0.000000e+00;11;13
PFIT1LS;1;0.000000e+00;-3.100000e+02;0.000000e+00;0.000000e+00;0.000000e+00;0.000000e+00;310;449
HVYCRASH;1;0.000000e+00;-1.200000e+01;0.000000e+00;0.000000e+00;0.000000e+00;0.000000e+00;12;14
BQPGASIM;1;0.000000e+00;-1.000000e+01;0.000000e+00;0.000000e+00;0.000000e+00;0.000000e+00;10;12
HS38;1;0.000000e+00;-3.900000e+01;0.000000e+00;0.000000e+00;0.000000e+00;0.000000e+00;39;51
ACOPP300;1;0.000000e+00;-4.000000e+01;0.000000e+00;0.000000e+00;0.000000e+00;0.000000e+00;40;356
LUKVLI11;1;0.000000e+00;-2.300000e+01;0.000000e+00;0.000000e+00;0.000000e+00;0.000000e+00;23;25
LUKVLI9;1;0.000000e+00;-2.700000e+01;0.000000e+00;0.000000e+00;0.000000e+00;0.000000e+00;27;29
HIMMELP4;1;0.000000e+00;-1.200000e+01;0.000000e+00;0.000000e+00;0.000000e+00;0.000000e+00;12;14
HIMMELP6;1;0.000000e+00;-2.000000e+01;0.000000e+00;0.000000e+00;0.000000e+00;0.000000e+00;20;22
DEGENQP;1;0.000000e+00;-9.000000e+00;0.000000e+00;0.000000e+00;0.000000e+00;0.000000e+00;9;11
EIGMAXB;1;0.000000e+00;-1.800000e+01;0.000000e+00;0.000000e+00;0.000000e+00;0.000000e+00;16;18
LISWET12;1;0.000000e+00;-5.080000e+02;0.000000e+00;0.000000e+00;0.000000e+00;0.000000e+00;508;510
POLAK1;1;0.000000e+00;-1.000000e+01;0.000000e+00;0.000000e+00;0.000000e+00;0.000000e+00;10;12
BQP1VAR;1;0.000000e+00;-8.000000e+00;0.000000e+00;0.000000e+00;0.000000e+00;0.000000e+00;8;10
PALMER6E;1;0.000000e+00;-3.100000e+01;0.000000e+00;0.000000e+00;0.000000e+00;0.000000e+00;31;38
STEERING;1;0.000000e+00;-1.800000e+01;0.000000e+00;0.000000e+00;0.000000e+00;0.000000e+00;18;21
SEMICON1;1;0.000000e+00;-9.080000e+02;0.000000e+00;0.000000e+00;0.000000e+00;0.000000e+00;908;1358
HADAMARD;0;0.000000e+00;-2.000000e+03;0.000000e+00;0.000000e+00;0.000000e+00;0.000000e+00;1000;1003
EIGMAXA;1;0.000000e+00;-1.100000e+01;0.000000e+00;0.000000e+00;0.000000e+00;0.000000e+00;11;79
HS103;1;0.000000e+00;-4.900000e+01;0.000000e+00;0.000000e+00;0.000000e+00;0.000000e+00;49;187
HS62;1;0.000000e+00;-8.000000e+00;0.000000e+00;0.000000e+00;0.000000e+00;0.000000e+00;8;11
OBSTCLAL;1;0.000000e+00;-1.500000e+01;0.000000e+00;0.000000e+00;0.000000e+00;0.000000e+00;15;17
CHARDIS0;1;0.000000e+00;-1.100000e+01;0.000000e+00;0.000000e+00;0.000000e+00;0.000000e+00;11;13
SSEBLIN;1;0.000000e+00;-6.300000e+01;0.000000e+00;0.000000e+00;0.000000e+00;0.000000e+00;63;65
BIGGSC4;1;0.000000e+00;-1.700000e+01;0.000000e+00;0.000000e+00;0.000000e+00;0.000000e+00;17;19
PALMER1A;1;0.000000e+00;-6.500000e+01;0.000000e+00;0.000000e+00;0.000000e+00;0.000000e+00;65;78
MAXLIKA;1;0.000000e+00;-2.600000e+01;0.000000e+00;0.000000e+00;0.000000e+00;0.000000e+00;26;34
EXPLIN2;1;0.000000e+00;-1.800000e+01;0.000000e+00;0.000000e+00;0.000000e+00;0.000000e+00;18;20
MRIBASIS;1;0.000000e+00;-2.400000e+01;0.000000e+00;0.000000e+00;0.000000e+00;0.000000e+00;24;76
MAKELA3;1;0.000000e+00;-2.000000e+01;0.000000e+00;0.000000e+00;0.000000e+00;0.000000e+00;20;22
READING9;1;0.000000e+00;-8.900000e+01;0.000000e+00;0.000000e+00;0.000000e+00;0.000000e+00;89;91
CB3;1;0.000000e+00;-9.000000e+00;0.000000e+00;0.000000e+00;0.000000e+00;0.000000e+00;9;11
STEENBRD;1;0.000000e+00;-1.560000e+02;0.000000e+00;0.000000e+00;0.000000e+00;0.000000e+00;153;207
A2ENDNDL;1;0.000000e+00;-1.200000e+01;0.000000e+00;0.000000e+00;0.000000e+00;0.000000e+00;12;14
HATFLDB;1;0.000000e+00;-9.000000e+00;0.000000e+00;0.000000e+00;0.000000e+00;0.000000e+00;9;11
PRIMALC1;1;0.000000e+00;-1.300000e+01;0.000000e+00;0.000000e+00;0.000000e+00;0.000000e+00;13;15
ORBIT2;1;0.000000e+00;-7.100000e+01;0.000000e+00;0.000000e+00;0.000000e+00;0.000000e+00;71;186
UBH1;1;0.000000e+00;-6.000000e+00;0.000000e+00;0.000000e+00;0.000000e+00;0.000000e+00;6;8
LISWET4;1;0.000000e+00;-1.700000e+01;0.000000e+00;0.000000e+00;0.000000e+00;0.000000e+00;17;19
BTS4;1;0.000000e+00;-1.600000e+01;0.000000e+00;0.000000e+00;0.000000e+00;0.000000e+00;16;18
BDEXP;1;0.000000e+00;-1.200000e+01;0.000000e+00;0.000000e+00;0.000000e+00;0.000000e+00;12;14
PORTFL6;1;0.000000e+00;-7.000000e+00;0.000000e+00;0.000000e+00;0.000000e+00;0.000000e+00;7;9
SOSQP1;1;0.000000e+00;-7.000000e+00;0.000000e+00;0.000000e+00;0.000000e+00;0.000000e+00;7;9
NET2;1;0.000000e+00;-5.600000e+01;0.000000e+00;0.000000e+00;0.000000e+00;0.000000e+00;56;58
SNAKE;0;0.000000e+00;-1.081000e+03;0.000000e+00;0.000000e+00;0.000000e+00;0.000000e+00;60;298
LUKVLI18;1;0.000000e+00;-2.700000e+01;0.000000e+00;0.000000e+00;0.000000e+00;0.000000e+00;27;29
AIRPORT;1;0.000000e+00;-2.300000e+01;0.000000e+00;0.000000e+00;0.000000e+00;0.000000e+00;23;26
DEGTRID;1;0.000000e+00;-1.100000e+01;0.000000e+00;0.000000e+00;0.000000e+00;0.000000e+00;11;13
OET5;1;0.000000e+00;-4.100000e+01;0.000000e+00;0.000000e+00;0.000000e+00;0.000000e+00;41;71
A0NSDSDS;1;0.000000e+00;-2.500000e+01;0.000000e+00;0.000000e+00;0.000000e+00;0.000000e+00;25;27
AUG2DQP;1;0.000000e+00;-2.100000e+01;0.000000e+00;0.000000e+00;0.000000e+00;0.000000e+00;21;23
CONT6-QQ;0;0.000000e+00;-1.056000e+03;0.000000e+00;0.000000e+00;0.000000e+00;0.000000e+00;55;58
TARGUS;1;0.000000e+00;-1.200000e+01;0.000000e+00;0.000000e+00;0.000000e+00;0.000000e+00;12;14
LUKVLI6;1;0.000000e+00;-2.000000e+01;0.000000e+00;0.000000e+00;0.000000e+00;0.000000e+00;20;112
PALMER5E;0;0.000000e+00;-2.000000e+03;0.000000e+00;0.000000e+00;0.000000e+00;0.000000e+00;1000;1467
PALMER2B;1;0.000000e+00;-2.100000e+01;0.000000e+00;0.000000e+00;0.000000e+00;0.000000e+00;21;26
TENBARS4;1;0.000000e+00;-4.400000e+01;0.000000e+00;0.000000e+00;0.000000e+00;0.000000e+00;44;48
ACOPR118;1;0.000000e+00;-1.510000e+02;0.000000e+00;0.000000e+00;0.000000e+00;0.000000e+00;151;1490
PRODPL0;1;0.000000e+00;-1.900000e+01;0.000000e+00;0.000000e+00;0.000000e+00;0.000000e+00;19;25
GRIDNETC;1;0.000000e+00;-1.900000e+01;0.000000e+00;0.000000e+00;0.000000e+00;0.000000e+00;19;21
FEEDLOC;1;0.000000e+00;-1.800000e+01;0.000000e+00;0.000000e+00;0.000000e+00;0.000000e+00;18;23
CSFI1;1;0.000000e+00;-2.800000e+01;0.000000e+00;0.000000e+00;0.000000e+00;0.000000e+00;28;33
GPP;1;0.000000e+00;-1.700000e+01;0.000000e+00;0.000000e+00;0.000000e+00;0.000000e+00;17;19
MAKELA2;1;0.000000e+00;-9.000000e+00;0.000000e+00;0.000000e+00;0.000000e+00;0.000000e+00;9;11
AVION2;1;0.000000e+00;-4.500000e+02;0.000000e+00;0.000000e+00;0.000000e+00;0.000000e+00;450;568
BATCH;1;0.000000e+00;-4.800000e+01;0.000000e+00;0.000000e+00;0.000000e+00;0.000000e+00;48;90
YAO;1;0.000000e+00;-1.030000e+02;0.000000e+00;0.000000e+00;0.000000e+00;0.000000e+00;103;105
MPC11;1;0.000000e+00;-5.500000e+01;0.000000e+00;0.000000e+00;0.000000e+00;0.000000e+00;55;94
DALLASS;1;0.000000e+00;-2.800000e+01;0.000000e+00;0.000000e+00;0.000000e+00;0.000000e+00;28;30
A4X12;1;0.000000e+00;-1.260000e+02;0.000000e+00;0.000000e+00;0.000000e+00;0.000000e+00;126;592
MPC5;1;0.000000e+00;-3.500000e+01;0.000000e+00;0.000000e+00;0.000000e+00;0.000000e+00;35;37
YATP2SQ;0;0.000000e+00;-1.001000e+03;0.000000e+00;0.000000e+00;0.000000e+00;0.000000e+00;8;21
ROTDISC;1;0.000000e+00;-3.800000e+01;0.000000e+00;0.000000e+00;0.000000e+00;0.000000e+00;38;88
CAMSHAPE;1;0.000000e+00;-4.500000e+01;0.000000e+00;0.000000e+00;0.000000e+00;0.000000e+00;45;47
CHARDIS1;1;0.000000e+00;-1.600000e+01;0.000000e+00;0.000000e+00;0.000000e+00;0.000000e+00;16;18
SPECAN;1;0.000000e+00;-1.400000e+01;0.000000e+00;0.000000e+00;0.000000e+00;0.000000e+00;14;17
POWELL20;0;0.000000e+00;-2.000000e+03;0.000000e+00;0.000000e+00;0.000000e+00;0.000000e+00;1000;1002
HIER133B;1;0.000000e+00;-1.100000e+01;0.000000e+00;0.000000e+00;0.000000e+00;0.000000e+00;11;13
METHANOL;1;0.000000e+00;-2.100000e+01;0.000000e+00;0.000000e+00;0.000000e+00;0.000000e+00;21;33
HS97;1;0.000000e+00;-2.200000e+01;0.000000e+00;0.000000e+00;0.000000e+00;0.000000e+00;22;24
A0ENINDL;1;0.000000e+00;-1.000000e+01;0.000000e+00;0.000000e+00;0.000000e+00;0.000000e+00;10;12
A0NNDNIL;1;0.000000e+00;-1.640000e+02;0.000000e+00;0.000000e+00;0.000000e+00;0.000000e+00;164;166
TORSIONA;1;0.000000e+00;-1.300000e+01;0.000000e+00;0.000000e+00;0.000000e+00;0.000000e+00;13;15
PALMER6A;1;0.000000e+00;-5.970000e+02;0.000000e+00;0.000000e+00;0.000000e+00;0.000000e+00;597;870
CAMEL6;1;0.000000e+00;-1.300000e+01;0.000000e+00;0.000000e+00;0.000000e+00;0.000000e+00;13;15
DITTERT;1;0.000000e+00;-2.700000e+01;0.000000e+00;0.000000e+00;0.000000e+00;0.000000e+00;27;30
GRIDGENA;1;0.000000e+00;-9.000000e+00;0.000000e+00;0.000000e+00;0.000000e+00;0.000000e+00;9;11
ELATTAR;0;0.000000e+00;-2.000000e+03;0.000000e+00;0.000000e+00;0.000000e+00;0.000000e+00;1000;4221
CAR2;1;0.000000e+00;-4.100000e+01;0.000000e+00;0.000000e+00;0.000000e+00;0.000000e+00;41;53
HIER163C;1;0.000000e+00;-1.800000e+01;0.000000e+00;0.000000e+00;0.000000e+00;0.000000e+00;18;20
LOADBAL;1;0.000000e+00;-1.100000e+01;0.000000e+00;0.000000e+00;0.000000e+00;0.000000e+00;11;14
GRIDNETG;1;0.000000e+00;-1.300000e+01;0.000000e+00;0.000000e+00;0.000000e+00;0.000000e+00;13;15
HIER133A;1;0.000000e+00;-1.100000e+01;0.000000e+00;0.000000e+00;0.000000e+00;0.000000e+00;11;13
ZIGZAG;1;0.000000e+00;-7.300000e+01;0.000000e+00;0.000000e+00;0.000000e+00;0.000000e+00;73;87
OPTCNTRL;1;0.000000e+00;-1.500000e+01;0.000000e+00;0.000000e+00;0.000000e+00;0.000000e+00;15;18
READING1;1;0.000000e+00;-1.900000e+01;0.000000e+00;0.000000e+00;0.000000e+00;0.000000e+00;19;21
HS81;1;0.000000e+00;-9.000000e+00;0.000000e+00;0.000000e+00;0.000000e+00;0.000000e+00;9;11
CORKSCRW;1;0.000000e+00;-1.910000e+02;0.000000e+00;0.000000e+00;0.000000e+00;0.000000e+00;191;195
LUKVLI12;1;0.000000e+00;-1.920000e+02;0.000000e+00;0.000000e+00;0.000000e+00;0.000000e+00;192;1237
BLOCKQP1;1;0.000000e+00;-7.700000e+01;0.000000e+00;0.000000e+00;0.000000e+00;0.000000e+00;77;80
POLAK3;1;0.000000e+00;-3.000000e+01;0.000000e+00;0.000000e+00;0.000000e+00;0.000000e+00;30;34
HS98;1;0.000000e+00;-2.200000e+01;0.000000e+00;0.000000e+00;0.000000e+00;0.000000e+00;22;24
GMNCASE3;1;0.000000e+00;-8.000000e+00;0.000000e+00;0.000000e+00;0.000000e+00;0.000000e+00;8;10
GRIDNETA;1;0.000000e+00;-1.500000e+01;0.000000e+00;0.000000e+00;0.000000e+00;0.000000e+00;15;17
JNLBRNG2;1;0.000000e+00;-1.200000e+01;0.000000e+00;0.000000e+00;0.000000e+00;0.000000e+00;12;14
HS112;1;0.000000e+00;-1.400000e+01;0.000000e+00;0.000000e+00;0.000000e+00;0.000000e+00;14;16
TAME;1;0.000000e+00;-6.000000e+00;0.000000e+00;0.000000e+00;0.000000e+00;0.000000e+00;6;8
EXPFITA;1;0.000000e+00;-2.300000e+01;0.000000e+00;0.000000e+00;0.000000e+00;0.000000e+00;23;27
MINSURFO;1;0.000000e+00;-5.300000e+01;0.000000e+00;0.000000e+00;0.000000e+00;0.000000e+00;53;175
GIGOMEZ2;1;0.000000e+00;-9.000000e+00;0.000000e+00;0.000000e+00;0.000000e+00;0.000000e+00;9;11
ORTHREGF;1;0.000000e+00;-4.100000e+01;0.000000e+00;0.000000e+00;0.000000e+00;0.000000e+00;41;61
BLOCKQP3;0;0.000000e+00;-2.000000e+03;0.000000e+00;0.000000e+00;0.000000e+00;0.000000e+00;1000;1002
TRO11X3;0;0.000000e+00;-1.073000e+03;0.000000e+00;0.000000e+00;0.000000e+00;0.000000e+00;72;78
SIPOW4;1;0.000000e+00;-1.100000e+01;0.000000e+00;0.000000e+00;0.000000e+00;0.000000e+00;11;13
A5NSDSIL;1;0.000000e+00;-1.090000e+02;0.000000e+00;0.000000e+00;0.000000e+00;0.000000e+00;109;146
HS118;1;0.000000e+00;-1.000000e+01;0.000000e+00;0.000000e+00;0.000000e+00;0.000000e+00;10;12
SINEALI;1;0.000000e+00;-6.900000e+01;0.000000e+00;0.000000e+00;0.000000e+00;0.000000e+00;69;93
RK23;1;0.000000e+00;-9.000000e+00;0.000000e+00;0.000000e+00;0.000000e+00;0.000000e+00;9;13
MPC16;1;0.000000e+00;-3.800000e+01;0.000000e+00;0.000000e+00;0.000000e+00;0.000000e+00;38;82
POLAK5;1;0.000000e+00;-3.000000e+01;0.000000e+00;0.000000e+00;0.000000e+00;0.000000e+00;30;32
LISWET7;1;0.000000e+00;-1.400000e+01;0.000000e+00;0.000000e+00;0.000000e+00;0.000000e+00;14;16
HS92;1;0.000000e+00;-1.800000e+01;0.000000e+00;0.000000e+00;0.000000e+00;0.000000e+00;18;37
HUES-MOD;1;0.000000e+00;-7.800000e+01;0.000000e+00;0.000000e+00;0.000000e+00;0.000000e+00;78;80
S277-280;1;0.000000e+00;-9.000000e+00;0.000000e+00;0.000000e+00;0.000000e+00;0.000000e+00;9;11
TORSION6;1;0.000000e+00;-1.100000e+01;0.000000e+00;0.000000e+00;0.000000e+00;0.000000e+00;11;13
LUKVLI13;1;0.000000e+00;-2.300000e+01;0.000000e+00;0.000000e+00;0.000000e+00;0.000000e+00;23;25
POLAK6;1;0.000000e+00;-2.300000e+01;0.000000e+00;0.000000e+00;0.000000e+00;0.000000e+00;23;28
GRIDNETI;1;0.000000e+00;-1.800000e+01;0.000000e+00;0.000000e+00;0.000000e+00;0.000000e+00;18;20
CORE1;1;0.000000e+00;-3.350000e+02;0.000000e+00;0.000000e+00;0.000000e+00;0.000000e+00;335;494
MIFFLIN2;1;0.000000e+00;-1.700000e+01;0.000000e+00;0.000000e+00;0.000000e+00;0.000000e+00;17;28
A2NSDSIL;1;0.000000e+00;-1.460000e+02;0.000000e+00;0.000000e+00;0.000000e+00;0.000000e+00;146;148
POWELLBC;0;0.000000e+00;-1.017000e+03;0.000000e+00;0.000000e+00;0.000000e+00;0.000000e+00;17;19
DUALC8;1;0.000000e+00;-1.600000e+01;0.000000e+00;0.000000e+00;0.000000e+00;0.000000e+00;16;18
PINENE;1;0.000000e+00;-2.700000e+01;0.000000e+00;0.000000e+00;0.000000e+00;0.000000e+00;27;40
HS113;1;0.000000e+00;-1.000000e+01;0.000000e+00;0.000000e+00;0.000000e+00;0.000000e+00;10;12
LEUVEN7;1;0.000000e+00;-2.300000e+01;0.000000e+00;0.000000e+00;0.000000e+00;0.000000e+00;23;25
PALMER5B;1;0.000000e+00;-5.300000e+01;0.000000e+00;0.000000e+00;0.000000e+00;0.000000e+00;53;81
ZAMB2;1;0.000000e+00;-3.200000e+01;0.000000e+00;0.000000e+00;0.000000e+00;0.000000e+00;32;34
OPTPRLOC;1;0.000000e+00;-2.000000e+01;0.000000e+00;0.000000e+00;0.000000e+00;0.000000e+00;20;22
NET3;1;0.000000e+00;-1.700000e+02;0.000000e+00;0.000000e+00;0.000000e+00;0.000000e+00;170;572
PALMER1B;1;0.000000e+00;-2.000000e+01;0.000000e+00;0.000000e+00;0.000000e+00;0.000000e+00;20;22
HS3;0;0.000000e+00;-1.005000e+03;0.000000e+00;0.000000e+00;0.000000e+00;0.000000e+00;4;7
A0NNDNSL;1;0.000000e+00;-1.700000e+01;0.000000e+00;0.000000e+00;0.000000e+00;0.000000e+00;17;19
HS99;0;0.000000e+00;-2.000000e+03;0.000000e+00;0.000000e+00;0.000000e+00;0.000000e+00;1000;17785
NGONE;1;0.000000e+00;-3.900000e+01;0.000000e+00;0.000000e+00;0.000000e+00;0.000000e+00;39;41
LAKES;1;0.000000e+00;-1.140000e+02;0.000000e+00;0.000000e+00;0.000000e+00;0.000000e+00;114;120
A2ESSNDL;1;0.000000e+00;-1.300000e+01;0.000000e+00;0.000000e+00;0.000000e+00;0.000000e+00;13;15
QPNBOEI2;0;0.000000e+00;-1.122000e+03;0.000000e+00;0.000000e+00;0.000000e+00;0.000000e+00;122;124
EIGENA;0;0.000000e+00;-1.020000e+03;0.000000e+00;0.000000e+00;0.000000e+00;0.000000e+00;19;28
PALMER3E;1;0.000000e+00;-2.400000e+01;0.000000e+00;0.000000e+00;0.000000e+00;0.000000e+00;24;29
TRO21X5;0;0.000000e+00;-2.000000e+03;0.000000e+00;0.000000e+00;0.000000e+00;0.000000e+00;1000;1075
PRIMALC8;1;0.000000e+00;-1.700000e+01;0.000000e+00;0.000000e+00;0.000000e+00;0.000000e+00;17;19
SPIRAL;0;0.000000e+00;-2.000000e+03;0.000000e+00;0.000000e+00;0.000000e+00;0.000000e+00;1000;1323
GROUPING;1;0.000000e+00;-7.000000e+00;0.000000e+00;0.000000e+00;0.000000e+00;0.000000e+00;7;50
HATFLDA;1;0.000000e+00;-9.000000e+00;0.000000e+00;0.000000e+00;0.000000e+00;0.000000e+00;9;11
PRIMALC2;1;0.000000e+00;-1.200000e+01;0.000000e+00;0.000000e+00;0.000000e+00;0.000000e+00;12;14
HS60;1;0.000000e+00;-7.000000e+00;0.000000e+00;0.000000e+00;0.000000e+00;0.000000e+00;7;9
TENBARS2;1;0.000000e+00;-8.400000e+01;0.000000e+00;0.000000e+00;0.000000e+00;0.000000e+00;84;109
RES;0;0.000000e+00;-1.008000e+03;0.000000e+00;0.000000e+00;0.000000e+00;0.000000e+00;8;10
TABLE1;1;0.000000e+00;-1.600000e+01;0.000000e+00;0.000000e+00;0.000000e+00;0.000000e+00;16;18
PFIT3;0;0.000000e+00;-2.000000e+03;0.000000e+00;0.000000e+00;0.000000e+00;0.000000e+00;1000;9038
TWIRIMD1;1;0.000000e+00;-4.700000e+01;0.000000e+00;0.000000e+00;0.000000e+00;0.000000e+00;47;49
PALMER3;0;0.000000e+00;-1.160000e+03;0.000000e+00;0.000000e+00;0.000000e+00;0.000000e+00;136;192
HS74;1;0.000000e+00;-1.500000e+01;0.000000e+00;0.000000e+00;0.000000e+00;0.000000e+00;15;17
DRUGDIS;1;0.000000e+00;-4.100000e+01;0.000000e+00;0.000000e+00;0.000000e+00;0.000000e+00;41;86
GOFFIN;1;0.000000e+00;-9.000000e+00;0.000000e+00;0.000000e+00;0.000000e+00;0.000000e+00;9;11
QR3D;1;0.000000e+00;-1.400000e+01;0.000000e+00;0.000000e+00;0.000000e+00;0.000000e+00;14;38
QPNBLEND;1;0.000000e+00;-1.500000e+01;0.000000e+00;0.000000e+00;0.000000e+00;0.000000e+00;15;17
SIPOW1;1;0.000000e+00;-3.100000e+01;0.000000e+00;0.000000e+00;0.000000e+00;0.000000e+00;31;36
MPC15;1;0.000000e+00;-4.100000e+01;0.000000e+00;0.000000e+00;0.000000e+00;0.000000e+00;41;64
A5NSDSSL;1;0.000000e+00;-2.500000e+01;0.000000e+00;0.000000e+00;0.000000e+00;0.000000e+00;25;117
BRAINPC7;0;0.000000e+00;-2.000000e+03;0.000000e+00;0.000000e+00;0.000000e+00;0.000000e+00;1000;9172
PT;1;0.000000e+00;-2.000000e+01;0.000000e+00;0.000000e+00;0.000000e+00;0.000000e+00;20;22
SUPERSIM;1;0.000000e+00;-7.000000e+00;0.000000e+00;0.000000e+00;0.000000e+00;0.000000e+00;7;9
HS64;1;0.000000e+00;-1.800000e+01;0.000000e+00;0.000000e+00;0.000000e+00;0.000000e+00;18;20
HS37;1;0.000000e+00;-1.200000e+01;0.000000e+00;0.000000e+00;0.000000e+00;0.000000e+00;12;14
HAIFAS;1;0.000000e+00;-1.400000e+01;0.000000e+00;0.000000e+00;0.000000e+00;0.000000e+00;14;16
READING3;1;0.000000e+00;-1.600000e+01;0.000000e+00;0.000000e+00;0.000000e+00;0.000000e+00;16;18
PORTFL4;1;0.000000e+00;-7.000000e+00;0.000000e+00;0.000000e+00;0.000000e+00;0.000000e+00;7;9
WEEDS;1;0.000000e+00;-3.000000e+01;0.000000e+00;0.000000e+00;0.000000e+00;0.000000e+00;30;45
HS109;1;0.000000e+00;-4.700000e+01;0.000000e+00;0.000000e+00;0.000000e+00;0.000000e+00;47;144
HS107;1;0.000000e+00;-1.000000e+01;0.000000e+00;0.000000e+00;0.000000e+00;0.000000e+00;10;12
HS14;1;0.000000e+00;-7.000000e+00;0.000000e+00;0.000000e+00;0.000000e+00;0.000000e+00;7;9
PFIT4LS;1;0.000000e+00;-2.350000e+02;0.000000e+00;0.000000e+00;0.000000e+00;0.000000e+00;235;330
PRIMALC5;1;0.000000e+00;-1.000000e+01;0.000000e+00;0.000000e+00;0.000000e+00;0.000000e+00;10;12
HS35I;1;0.000000e+00;-7.000000e+00;0.000000e+00;0.000000e+00;0.000000e+00;0.000000e+00;7;9
QPBAND;1;0.000000e+00;-1.700000e+01;0.000000e+00;0.000000e+00;0.000000e+00;0.000000e+00;17;19
OSLBQP;1;0.000000e+00;-1.000000e+01;0.000000e+00;0.000000e+00;0.000000e+00;0.000000e+00;10;12
HS55;1;0.000000e+00;-1.000000e+01;0.000000e+00;0.000000e+00;0.000000e+00;0.000000e+00;10;12
WALL20;1;0.000000e+00;-3.800000e+01;0.000000e+00;0.000000e+00;0.000000e+00;0.000000e+00;38;338
A2ESDNDL;1;0.000000e+00;-1.200000e+01;0.000000e+00;0.000000e+00;0.000000e+00;0.000000e+00;12;14
BLOCKQP5;0;0.000000e+00;-2.000000e+03;0.000000e+00;0.000000e+00;0.000000e+00;0.000000e+00;1000;1002
HS32;1;0.000000e+00;-9.000000e+00;0.000000e+00;0.000000e+00;0.000000e+00;0.000000e+00;9;11
CLNLBEAM;0;0.000000e+00;-2.000000e+03;0.000000e+00;0.000000e+00;0.000000e+00;0.000000e+00;1000;1102
LISWET1;1;0.000000e+00;-3.100000e+01;0.000000e+00;0.000000e+00;0.000000e+00;0.000000e+00;31;33
S365MOD;0;0.000000e+00;-1.153000e+03;0.000000e+00;0.000000e+00;0.000000e+00;0.000000e+00;152;2482
LUKVLI10;1;0.000000e+00;-2.400000e+01;0.000000e+00;0.000000e+00;0.000000e+00;0.000000e+00;24;26
PALMER8E;1;0.000000e+00;-1.900000e+01;0.000000e+00;0.000000e+00;0.000000e+00;0.000000e+00;19;25
HYDROELL;1;0.000000e+00;-2.320000e+02;0.000000e+00;0.000000e+00;0.000000e+00;0.000000e+00;232;234
ACOPP14;1;0.000000e+00;-1.400000e+01;0.000000e+00;0.000000e+00;0.000000e+00;0.000000e+00;14;16
DEGDIAG;1;0.000000e+00;-1.100000e+01;0.000000e+00;0.000000e+00;0.000000e+00;0.000000e+00;11;13
QUDLIN;1;0.000000e+00;-2.000000e+01;0.000000e+00;0.000000e+00;0.000000e+00;0.000000e+00;20;22
PENTAGON;1;0.000000e+00;-1.700000e+01;0.000000e+00;0.000000e+00;0.000000e+00;0.000000e+00;17;20
CHANDHEQ;1;0.000000e+00;-1.000000e+01;0.000000e+00;0.000000e+00;0.000000e+00;0.000000e+00;10;12
DECONVC;1;0.000000e+00;-5.700000e+01;0.000000e+00;0.000000e+00;0.000000e+00;0.000000e+00;57;76
WALL50;1;0.000000e+00;-4.100000e+01;0.000000e+00;0.000000e+00;0.000000e+00;0.000000e+00;41;73
EG3;0;0.000000e+00;-1.065000e+03;0.000000e+00;0.000000e+00;0.000000e+00;0.000000e+00;64;257
GMNCASE1;1;0.000000e+00;-9.000000e+00;0.000000e+00;0.000000e+00;0.000000e+00;0.000000e+00;9;11
BRIDGEND;1;0.000000e+00;-7.200000e+01;0.000000e+00;0.000000e+00;0.000000e+00;0.000000e+00;72;125
CHEMRCTA;0;0.000000e+00;-1.051000e+03;0.000000e+00;0.000000e+00;0.000000e+00;0.000000e+00;50;109
HS69;1;0.000000e+00;-1.200000e+01;0.000000e+00;0.000000e+00;0.000000e+00;0.000000e+00;12;14
MAKELA1;1;0.000000e+00;-1.800000e+01;0.000000e+00;0.000000e+00;0.000000e+00;0.000000e+00;18;20
STEENBRE;1;0.000000e+00;-1.770000e+02;0.000000e+00;0.000000e+00;0.000000e+00;0.000000e+00;173;379
LEUVEN3;0;0.000000e+00;-1.354000e+03;0.000000e+00;0.000000e+00;0.000000e+00;0.000000e+00;354;356
A5ENDNDL;1;0.000000e+00;-1.100000e+01;0.000000e+00;0.000000e+00;0.000000e+00;0.000000e+00;11;13
JANNSON4;1;0.000000e+00;-1.300000e+01;0.000000e+00;0.000000e+00;0.000000e+00;0.000000e+00;13;15
HS57;0;0.000000e+00;-1.046000e+03;0.000000e+00;0.000000e+00;0.000000e+00;0.000000e+00;17;99
PRIMAL2;1;0.000000e+00;-1.200000e+01;0.000000e+00;0.000000e+00;0.000000e+00;0.000000e+00;12;14
HS100;1;0.000000e+00;-1.000000e+01;0.000000e+00;0.000000e+00;0.000000e+00;0.000000e+00;10;19
HS11;1;0.000000e+00;-8.000000e+00;0.000000e+00;0.000000e+00;0.000000e+00;0.000000e+00;8;10
LISWET5;1;0.000000e+00;-2.000000e+01;0.000000e+00;0.000000e+00;0.000000e+00;0.000000e+00;20;22
ALLINQP;1;0.000000e+00;-2.300000e+01;0.000000e+00;0.000000e+00;0.000000e+00;0.000000e+00;23;25
QC;1;0.000000e+00;-1.600000e+01;0.000000e+00;0.000000e+00;0.000000e+00;0.000000e+00;16;19
A5NNDNSL;1;0.000000e+00;-3.000000e+01;0.000000e+00;0.000000e+00;0.000000e+00;0.000000e+00;30;32
BIGGSB1;1;0.000000e+00;-1.300000e+01;0.000000e+00;0.000000e+00;0.000000e+00;0.000000e+00;13;15
PALMER4B;1;0.000000e+00;-1.900000e+01;0.000000e+00;0.000000e+00;0.000000e+00;0.000000e+00;19;25
TABLE7;1;0.000000e+00;-1.800000e+01;0.000000e+00;0.000000e+00;0.000000e+00;0.000000e+00;18;20
GMNCASE4;1;0.000000e+00;-2.000000e+01;0.000000e+00;0.000000e+00;0.000000e+00;0.000000e+00;20;22
POLAK2;1;0.000000e+00;-8.000000e+00;0.000000e+00;0.000000e+00;0.000000e+00;0.000000e+00;8;10
MPC1;1;0.000000e+00;-3.420000e+02;0.000000e+00;0.000000e+00;0.000000e+00;0.000000e+00;342;344
STCQP1;1;0.000000e+00;-9.000000e+00;0.000000e+00;0.000000e+00;0.000000e+00;0.000000e+00;9;11
HART6;1;0.000000e+00;-1.100000e+01;0.000000e+00;0.000000e+00;0.000000e+00;0.000000e+00;11;14
HUBFIT;1;0.000000e+00;-6.000000e+00;0.000000e+00;0.000000e+00;0.000000e+00;0.000000e+00;6;8
TRAINF;1;0.000000e+00;-5.300000e+01;0.000000e+00;0.000000e+00;0.000000e+00;0.000000e+00;53;55
HS104;1;0.000000e+00;-8.000000e+00;0.000000e+00;0.000000e+00;0.000000e+00;0.000000e+00;8;10
STCQP2;1;0.000000e+00;-1.000000e+01;0.000000e+00;0.000000e+00;0.000000e+00;0.000000e+00;10;12
HS89;1;0.000000e+00;-1.900000e+01;0.000000e+00;0.000000e+00;0.000000e+00;0.000000e+00;19;31
CHENHARK;1;0.000000e+00;-1.400000e+01;0.000000e+00;0.000000e+00;0.000000e+00;0.000000e+00;14;16
ZAMB2-10;1;0.000000e+00;-2.300000e+01;0.000000e+00;0.000000e+00;0.000000e+00;0.000000e+00;23;25
HATFLDH;1;0.000000e+00;-1.200000e+01;0.000000e+00;0.000000e+00;0.000000e+00;0.000000e+00;12;14
PSPDOC;1;0.000000e+00;-9.000000e+00;0.000000e+00;0.000000e+00;0.000000e+00;0.000000e+00;9;17
ROCKET;1;0.000000e+00;-6.750000e+02;0.000000e+00;0.000000e+00;0.000000e+00;0.000000e+00;675;3605
LIN;1;0.000000e+00;-2.100000e+01;0.000000e+00;0.000000e+00;0.000000e+00;0.000000e+00;21;23
PORTSNQP;1;0.000000e+00;-4.500000e+01;0.000000e+00;0.000000e+00;0.000000e+00;0.000000e+00;45;47
BLOWEYA;1;0.000000e+00;-7.000000e+00;0.000000e+00;0.000000e+00;0.000000e+00;0.000000e+00;7;9
A2NNSNSL;1;0.000000e+00;-2.100000e+01;0.000000e+00;0.000000e+00;0.000000e+00;0.000000e+00;21;23
FBRAIN2LS;1;0.000000e+00;-1.400000e+01;0.000000e+00;0.000000e+00;0.000000e+00;0.000000e+00;14;18
HIMMELP1;1;0.000000e+00;-1.400000e+01;0.000000e+00;0.000000e+00;0.000000e+00;0.000000e+00;14;21
JNLBRNGB;1;0.000000e+00;-1.200000e+01;0.000000e+00;0.000000e+00;0.000000e+00;0.000000e+00;12;14
HS25;1;0.000000e+00;-3.300000e+01;0.000000e+00;0.000000e+00;0.000000e+00;0.000000e+00;33;37
ACOPP118;1;0.000000e+00;-1.700000e+01;0.000000e+00;0.000000e+00;0.000000e+00;0.000000e+00;17;19
SAWPATH;0;0.000000e+00;-2.000000e+03;0.000000e+00;0.000000e+00;0.000000e+00;0.000000e+00;1000;1829
WALL10;1;0.000000e+00;-3.000000e+01;0.000000e+00;0.000000e+00;0.000000e+00;0.000000e+00;30;189
ACOPR57;0;0.000000e+00;-2.000000e+03;0.000000e+00;0.000000e+00;0.000000e+00;0.000000e+00;1000;12872
HS63;1;0.000000e+00;-8.000000e+00;0.000000e+00;0.000000e+00;0.000000e+00;0.000000e+00;8;10
POLAK4;1;0.000000e+00;-9.000000e+00;0.000000e+00;0.000000e+00;0.000000e+00;0.000000e+00;9;11
TORSION3;1;0.000000e+00;-1.200000e+01;0.000000e+00;0.000000e+00;0.000000e+00;0.000000e+00;12;14
LISWET10;1;0.000000e+00;-1.190000e+02;0.000000e+00;0.000000e+00;0.000000e+00;0.000000e+00;119;349
ZAMB2-11;1;0.000000e+00;-1.800000e+01;0.000000e+00;0.000000e+00;0.000000e+00;0.000000e+00;18;20
TWIRIBG1;1;0.000000e+00;-5.800000e+01;0.000000e+00;0.000000e+00;0.000000e+00;0.000000e+00;58;60
BLOWEYB;1;0.000000e+00;-7.000000e+00;0.000000e+00;0.000000e+00;0.000000e+00;0.000000e+00;7;9
ORTHREGE;1;0.000000e+00;-1.190000e+02;0.000000e+00;0.000000e+00;0.000000e+00;0.000000e+00;119;294
TFI1;1;0.000000e+00;-1.400000e+01;0.000000e+00;0.000000e+00;0.000000e+00;0.000000e+00;14;18
CANTILVR;1;0.000000e+00;-1.200000e+01;0.000000e+00;0.000000e+00;0.000000e+00;0.000000e+00;12;14
LOGROS;1;0.000000e+00;-5.500000e+01;0.000000e+00;0.000000e+00;0.000000e+00;0.000000e+00;55;76
SWOPF;1;0.000000e+00;-1.900000e+01;0.000000e+00;0.000000e+00;0.000000e+00;0.000000e+00;19;31
HIMMELBJ;1;0.000000e+00;-3.700000e+01;0.000000e+00;0.000000e+00;0.000000e+00;0.000000e+00;37;90
WALL100;1;0.000000e+00;-1.700000e+01;0.000000e+00;0.000000e+00;0.000000e+00;0.000000e+00;17;19
HS18;1;0.000000e+00;-1.200000e+01;0.000000e+00;0.000000e+00;0.000000e+00;0.000000e+00;12;14
DUAL1;1;0.000000e+00;-1.100000e+01;0.000000e+00;0.000000e+00;0.000000e+00;0.000000e+00;11;13
GASOIL;1;0.000000e+00;-2.800000e+01;0.000000e+00;0.000000e+00;0.000000e+00;0.000000e+00;28;107
HS93;1;0.000000e+00;-9.000000e+00;0.000000e+00;0.000000e+00;0.000000e+00;0.000000e+00;9;11
HS100MOD;1;0.000000e+00;-8.000000e+00;0.000000e+00;0.000000e+00;0.000000e+00;0.000000e+00;8;15
PALMER4;0;0.000000e+00;-1.161000e+03;0.000000e+00;0.000000e+00;0.000000e+00;0.000000e+00;137;199
SOSQP2;1;0.000000e+00;-1.100000e+01;0.000000e+00;0.000000e+00;0.000000e+00;0.000000e+00;11;13
ALJAZZAF;1;0.000000e+00;-3.200000e+01;0.000000e+00;0.000000e+00;0.000000e+00;0.000000e+00;32;91
HS23;1;0.000000e+00;-9.000000e+00;0.000000e+00;0.000000e+00;0.000000e+00;0.000000e+00;9;11
MAKELA4;1;0.000000e+00;-7.000000e+00;0.000000e+00;0.000000e+00;0.000000e+00;0.000000e+00;7;9
FBRAINLS;1;0.000000e+00;-1.100000e+01;0.000000e+00;0.000000e+00;0.000000e+00;0.000000e+00;11;13
NONSCOMP;1;0.000000e+00;-1.700000e+01;0.000000e+00;0.000000e+00;0.000000e+00;0.000000e+00;17;23
HS35MOD;1;0.000000e+00;-8.000000e+00;0.000000e+00;0.000000e+00;0.000000e+00;0.000000e+00;8;10
CVXBQP1;1;0.000000e+00;-1.100000e+01;0.000000e+00;0.000000e+00;0.000000e+00;0.000000e+00;11;13
C-RELOAD;1;0.000000e+00;-6.600000e+01;0.000000e+00;0.000000e+00;0.000000e+00;0.000000e+00;66;68
QPCBOEI2;1;0.000000e+00;-1.510000e+02;0.000000e+00;0.000000e+00;0.000000e+00;0.000000e+00;151;153
BIGBANK;1;0.000000e+00;-2.200000e+01;0.000000e+00;0.000000e+00;0.000000e+00;0.000000e+00;22;24
TABLE3;1;0.000000e+00;-2.000000e+01;0.000000e+00;0.000000e+00;0.000000e+00;0.000000e+00;20;22
A0NSDSIL;1;0.000000e+00;-1.380000e+02;0.000000e+00;0.000000e+00;0.000000e+00;0.000000e+00;138;140
UBH5;1;0.000000e+00;-7.000000e+00;0.000000e+00;0.000000e+00;0.000000e+00;0.000000e+00;7;9
GILBERT;1;0.000000e+00;-3.800000e+01;0.000000e+00;0.000000e+00;0.000000e+00;0.000000e+00;38;40
READING8;1;0.000000e+00;-1.920000e+02;0.000000e+00;0.000000e+00;0.000000e+00;0.000000e+00;192;235
HS59;1;0.000000e+00;-1.500000e+01;0.000000e+00;0.000000e+00;0.000000e+00;0.000000e+00;15;17
TORSION4;1;0.000000e+00;-1.100000e+01;0.000000e+00;0.000000e+00;0.000000e+00;0.000000e+00;11;13
TORSIONB;1;0.000000e+00;-1.200000e+01;0.000000e+00;0.000000e+00;0.000000e+00;0.000000e+00;12;14
CRESC50;0;0.000000e+00;-2.000000e+03;0.000000e+00;0.000000e+00;0.000000e+00;0.000000e+00;1000;2315
TWOBARS;1;0.000000e+00;-8.000000e+00;0.000000e+00;0.000000e+00;0.000000e+00;0.000000e+00;8;10
CRESC4;0;0.000000e+00;-2.000000e+03;0.000000e+00;0.000000e+00;0.000000e+00;0.000000e+00;1000;2768
DEGTRID2;1;0.000000e+00;-1.100000e+01;0.000000e+00;0.000000e+00;0.000000e+00;0.000000e+00;11;13
BRAINPC5;0;0.000000e+00;-1.792000e+03;0.000000e+00;0.000000e+00;0.000000e+00;0.000000e+00;791;7941
BLEACHNG;1;0.000000e+00;-1.400000e+01;0.000000e+00;0.000000e+00;0.000000e+00;0.000000e+00;14;92
CONT5-QP;0;0.000000e+00;-1.356000e+03;0.000000e+00;0.000000e+00;0.000000e+00;0.000000e+00;355;585
QR3DLS;1;0.000000e+00;-2.030000e+02;0.000000e+00;0.000000e+00;0.000000e+00;0.000000e+00;203;320
SIMPLLPA;1;0.000000e+00;-7.000000e+00;0.000000e+00;0.000000e+00;0.000000e+00;0.000000e+00;7;9
NET4;0;0.000000e+00;-1.725000e+03;0.000000e+00;0.000000e+00;0.000000e+00;0.000000e+00;689;702
ERRINBAR;1;0.000000e+00;-3.200000e+01;0.000000e+00;0.000000e+00;0.000000e+00;0.000000e+00;32;34
MCONCON;1;0.000000e+00;-1.100000e+01;0.000000e+00;0.000000e+00;0.000000e+00;0.000000e+00;11;13
HS108;1;0.000000e+00;-4.200000e+01;0.000000e+00;0.000000e+00;0.000000e+00;0.000000e+00;42;45
SREADIN3;1;0.000000e+00;-1.800000e+01;0.000000e+00;0.000000e+00;0.000000e+00;0.000000e+00;18;20
QR3DBD;1;0.000000e+00;-1.400000e+01;0.000000e+00;0.000000e+00;0.000000e+00;0.000000e+00;14;38
HS4;1;0.000000e+00;-8.000000e+00;0.000000e+00;0.000000e+00;0.000000e+00;0.000000e+00;8;11
NINE12;1;0.000000e+00;-1.500000e+01;0.000000e+00;0.000000e+00;0.000000e+00;0.000000e+00;15;17
RDW2D51F;1;0.000000e+00;-6.000000e+00;0.000000e+00;0.000000e+00;0.000000e+00;0.000000e+00;6;8
CATMIX;1;0.000000e+00;-1.100000e+01;0.000000e+00;0.000000e+00;0.000000e+00;0.000000e+00;11;13
HS96;1;0.000000e+00;-1.800000e+01;0.000000e+00;0.000000e+00;0.000000e+00;0.000000e+00;18;20
A5ESINDL;1;0.000000e+00;-1.100000e+01;0.000000e+00;0.000000e+00;0.000000e+00;0.000000e+00;11;13
HS5;1;0.000000e+00;-1.000000e+01;0.000000e+00;0.000000e+00;0.000000e+00;0.000000e+00;10;12
HIER163E;1;0.000000e+00;-1.600000e+01;0.000000e+00;0.000000e+00;0.000000e+00;0.000000e+00;16;18
DNIEPER;1;0.000000e+00;-4.000000e+01;0.000000e+00;0.000000e+00;0.000000e+00;0.000000e+00;40;42
HYDROELS;1;0.000000e+00;-1.200000e+02;0.000000e+00;0.000000e+00;0.000000e+00;0.000000e+00;120;122
CRESC100;0;0.000000e+00;-2.000000e+03;0.000000e+00;0.000000e+00;0.000000e+00;0.000000e+00;1000;2626
CBS;1;0.000000e+00;-1.900000e+01;0.000000e+00;0.000000e+00;0.000000e+00;0.000000e+00;19;21
HS87;0;0.000000e+00;-2.000000e+03;0.000000e+00;0.000000e+00;0.000000e+00;0.000000e+00;1000;1491
QPNBAND;1;0.000000e+00;-1.500000e+01;0.000000e+00;0.000000e+00;0.000000e+00;0.000000e+00;15;17
PALMER2A;1;0.000000e+00;-8.100000e+01;0.000000e+00;0.000000e+00;0.000000e+00;0.000000e+00;81;112
HS85;1;0.000000e+00;-1.500000e+01;0.000000e+00;0.000000e+00;0.000000e+00;0.000000e+00;15;17
GIGOMEZ1;1;0.000000e+00;-1.600000e+01;0.000000e+00;0.000000e+00;0.000000e+00;0.000000e+00;16;18
DALLASL;1;0.000000e+00;-3.300000e+01;0.000000e+00;0.000000e+00;0.000000e+00;0.000000e+00;33;40
DISC2;1;0.000000e+00;-2.800000e+01;0.000000e+00;0.000000e+00;0.000000e+00;0.000000e+00;28;35
PALMER7E;1;0.000000e+00;-6.040000e+02;0.000000e+00;0.000000e+00;0.000000e+00;0.000000e+00;604;997
MARINE;1;0.000000e+00;-6.200000e+01;0.000000e+00;0.000000e+00;0.000000e+00;0.000000e+00;62;64
A0NSDSDL;1;0.000000e+00;-1.200000e+01;0.000000e+00;0.000000e+00;0.000000e+00;0.000000e+00;12;14
BRAINPC9;0;0.000000e+00;-1.678000e+03;0.000000e+00;0.000000e+00;0.000000e+00;0.000000e+00;677;6245
SCOND1LS;0;0.000000e+00;-1.726000e+03;0.000000e+00;0.000000e+00;0.000000e+00;0.000000e+00;692;1317
HS21;1;0.000000e+00;-7.000000e+00;0.000000e+00;0.000000e+00;0.000000e+00;0.000000e+00;7;9
EXPLIN;1;0.000000e+00;-5.800000e+01;0.000000e+00;0.000000e+00;0.000000e+00;0.000000e+00;58;66
A0ESDNDL;1;0.000000e+00;-1.000000e+01;0.000000e+00;0.000000e+00;0.000000e+00;0.000000e+00;10;12
BRAINPC2;0;0.000000e+00;-1.482000e+03;0.000000e+00;0.000000e+00;0.000000e+00;0.000000e+00;481;4193
HS88;1;0.000000e+00;-1.800000e+01;0.000000e+00;0.000000e+00;0.000000e+00;0.000000e+00;18;21
HALDMADS;1;0.000000e+00;-1.900000e+01;0.000000e+00;0.000000e+00;0.000000e+00;0.000000e+00;19;23
CVXQP3;1;0.000000e+00;-9.430000e+02;0.000000e+00;0.000000e+00;0.000000e+00;0.000000e+00;943;945
HS75;1;0.000000e+00;-1.860000e+02;0.000000e+00;0.000000e+00;0.000000e+00;0.000000e+00;186;1386
OET3;1;0.000000e+00;-1.400000e+01;0.000000e+00;0.000000e+00;0.000000e+00;0.000000e+00;14;16
HS34;1;0.000000e+00;-9.000000e+00;0.000000e+00;0.000000e+00;0.000000e+00;0.000000e+00;9;11
MPC12;1;0.000000e+00;-4.400000e+01;0.000000e+00;0.000000e+00;0.000000e+00;0.000000e+00;44;119
HS68;1;0.000000e+00;-4.600000e+01;0.000000e+00;0.000000e+00;0.000000e+00;0.000000e+00;46;52
MADSEN;1;0.000000e+00;-1.000000e+01;0.000000e+00;0.000000e+00;0.000000e+00;0.000000e+00;10;12
PORTFL2;1;0.000000e+00;-7.000000e+00;0.000000e+00;0.000000e+00;0.000000e+00;0.000000e+00;7;9
EIGENACO;1;0.000000e+00;-1.000000e+00;0.000000e+00;0.000000e+00;0.000000e+00;0.000000e+00;3;5
TRAINH;1;0.000000e+00;-6.200000e+01;0.000000e+00;0.000000e+00;0.000000e+00;0.000000e+00;62;67
ALLINIT;1;0.000000e+00;-1.400000e+01;0.000000e+00;0.000000e+00;0.000000e+00;0.000000e+00;14;22
HS90;1;0.000000e+00;-1.800000e+01;0.000000e+00;0.000000e+00;0.000000e+00;0.000000e+00;18;20
A0NNSNSL;1;0.000000e+00;-2.300000e+01;0.000000e+00;0.000000e+00;0.000000e+00;0.000000e+00;23;25
PFIT2LS;1;0.000000e+00;-7.900000e+01;0.000000e+00;0.000000e+00;0.000000e+00;0.000000e+00;79;109
JNLBRNG1;1;0.000000e+00;-1.300000e+01;0.000000e+00;0.000000e+00;0.000000e+00;0.000000e+00;13;15
TWO5IN6;1;0.000000e+00;-1.200000e+01;0.000000e+00;0.000000e+00;0.000000e+00;0.000000e+00;12;14
ACOPR30;0;0.000000e+00;-2.000000e+03;0.000000e+00;0.000000e+00;0.000000e+00;0.000000e+00;1000;11199
READING5;0;0.000000e+00;-1.211000e+03;0.000000e+00;0.000000e+00;0.000000e+00;0.000000e+00;210;281
HS1;1;0.000000e+00;-2.600000e+01;0.000000e+00;0.000000e+00;0.000000e+00;0.000000e+00;26;34
A5NNDNDL;1;0.000000e+00;-1.500000e+01;0.000000e+00;0.000000e+00;0.000000e+00;0.000000e+00;15;17
HIER133E;1;0.000000e+00;-1.500000e+01;0.000000e+00;0.000000e+00;0.000000e+00;0.000000e+00;15;17
KISSING;1;0.000000e+00;-2.980000e+02;0.000000e+00;0.000000e+00;0.000000e+00;0.000000e+00;298;322
PRIMAL3;1;0.000000e+00;-1.100000e+01;0.000000e+00;0.000000e+00;0.000000e+00;0.000000e+00;11;13
MPC8;1;0.000000e+00;-3.800000e+01;0.000000e+00;0.000000e+00;0.000000e+00;0.000000e+00;38;44
CHEBYQAD;1;0.000000e+00;-2.530000e+02;0.000000e+00;0.000000e+00;0.000000e+00;0.000000e+00;253;326
SYNTHES3;1;0.000000e+00;-2.300000e+01;0.000000e+00;0.000000e+00;0.000000e+00;0.000000e+00;23;25
MINMAXRB;1;0.000000e+00;-8.000000e+00;0.000000e+00;0.000000e+00;0.000000e+00;0.000000e+00;8;12
A0ESSNDL;1;0.000000e+00;-1.100000e+01;0.000000e+00;0.000000e+00;0.000000e+00;0.000000e+00;11;13
RDW2D52U;1;0.000000e+00;-1.000000e+00;0.000000e+00;0.000000e+00;0.000000e+00;0.000000e+00;1;3
GOULDQP2;1;0.000000e+00;-5.000000e+00;0.000000e+00;0.000000e+00;0.000000e+00;0.000000e+00;5;7
SIPOW3;1;0.000000e+00;-1.200000e+01;0.000000e+00;0.000000e+00;0.000000e+00;0.000000e+00;12;15
OBSTCLBM;1;0.000000e+00;-1.100000e+01;0.000000e+00;0.000000e+00;0.000000e+00;0.000000e+00;11;13
A5ESSNDL;1;0.000000e+00;-1.800000e+01;0.000000e+00;0.000000e+00;0.000000e+00;0.000000e+00;18;35
QPCBLEND;1;0.000000e+00;-1.800000e+01;0.000000e+00;0.000000e+00;0.000000e+00;0.000000e+00;18;20
OET2;1;0.000000e+00;-3.800000e+01;0.000000e+00;0.000000e+00;0.000000e+00;0.000000e+00;38;119
HIMMELP2;1;0.000000e+00;-2.700000e+01;0.000000e+00;0.000000e+00;0.000000e+00;0.000000e+00;27;29
MATRIX2;1;0.000000e+00;-1.300000e+01;0.000000e+00;0.000000e+00;0.000000e+00;0.000000e+00;13;15
JNLBRNGA;1;0.000000e+00;-1.100000e+01;0.000000e+00;0.000000e+00;0.000000e+00;0.000000e+00;11;13
PORTSQP;1;0.000000e+00;-2.300000e+01;0.000000e+00;0.000000e+00;0.000000e+00;0.000000e+00;23;25
EIGMAXC;1;0.000000e+00;-9.000000e+00;0.000000e+00;0.000000e+00;0.000000e+00;0.000000e+00;9;13
ACOPP30;1;0.000000e+00;-2.300000e+01;0.000000e+00;0.000000e+00;0.000000e+00;0.000000e+00;23;43
MISTAKE;1;0.000000e+00;-1.100000e+01;0.000000e+00;0.000000e+00;0.000000e+00;0.000000e+00;11;13
EG1;1;0.000000e+00;-1.000000e+01;0.000000e+00;0.000000e+00;0.000000e+00;0.000000e+00;10;21
BLOCKQP4;1;0.000000e+00;-3.000000e+01;0.000000e+00;0.000000e+00;0.000000e+00;0.000000e+00;30;32
HS116;1;0.000000e+00;-1.340000e+02;0.000000e+00;0.000000e+00;0.000000e+00;0.000000e+00;134;423
PALMER1;0;0.000000e+00;-1.693000e+03;0.000000e+00;0.000000e+00;0.000000e+00;0.000000e+00;675;956
HS41;1;0.000000e+00;-1.100000e+01;0.000000e+00;0.000000e+00;0.000000e+00;0.000000e+00;11;13
LUKVLI3;1;0.000000e+00;-1.700000e+01;0.000000e+00;0.000000e+00;0.000000e+00;0.000000e+00;17;19
A2ENSNDL;1;0.000000e+00;-1.300000e+01;0.000000e+00;0.000000e+00;0.000000e+00;0.000000e+00;13;15
MPC7;1;0.000000e+00;-3.600000e+01;0.000000e+00;0.000000e+00;0.000000e+00;0.000000e+00;36;38
HS66;1;0.000000e+00;-7.000000e+00;0.000000e+00;0.000000e+00;0.000000e+00;0.000000e+00;7;14
SIMBQP;1;0.000000e+00;-1.000000e+01;0.000000e+00;0.000000e+00;0.000000e+00;0.000000e+00;10;12
LEUVEN4;0;0.000000e+00;-1.595000e+03;0.000000e+00;0.000000e+00;0.000000e+00;0.000000e+00;595;597
HIER133C;1;0.000000e+00;-1.100000e+01;0.000000e+00;0.000000e+00;0.000000e+00;0.000000e+00;11;13
FERRISDC;1;0.000000e+00;-4.600000e+01;0.000000e+00;0.000000e+00;0.000000e+00;0.000000e+00;46;88
HS2;1;0.000000e+00;-1.100000e+01;0.000000e+00;0.000000e+00;0.000000e+00;0.000000e+00;11;13
JJTABEL3;1;0.000000e+00;-7.200000e+01;0.000000e+00;0.000000e+00;0.000000e+00;0.000000e+00;72;245
ACOPP57;1;0.000000e+00;-1.200000e+01;0.000000e+00;0.000000e+00;0.000000e+00;0.000000e+00;12;14
HIE1372D;1;0.000000e+00;-1.400000e+01;0.000000e+00;0.000000e+00;0.000000e+00;0.000000e+00;14;16
DUAL2;1;0.000000e+00;-9.000000e+00;0.000000e+00;0.000000e+00;0.000000e+00;0.000000e+00;9;11
HS119;1;0.000000e+00;-1.200000e+01;0.000000e+00;0.000000e+00;0.000000e+00;0.000000e+00;12;14
GENROSEB;1;0.000000e+00;-1.400000e+01;0.000000e+00;0.000000e+00;0.000000e+00;0.000000e+00;14;20
LSQFIT;1;0.000000e+00;-6.000000e+00;0.000000e+00;0.000000e+00;0.000000e+00;0.000000e+00;6;8
PALMER7A;0;0.000000e+00;-2.000000e+03;0.000000e+00;0.000000e+00;0.000000e+00;0.000000e+00;1000;1437
KOEBHELB;1;0.000000e+00;-9.100000e+01;0.000000e+00;0.000000e+00;0.000000e+00;0.000000e+00;91;169
EIGMINA;1;0.000000e+00;-1.000000e+01;0.000000e+00;0.000000e+00;0.000000e+00;0.000000e+00;10;12
OPTCDEG2;1;0.000000e+00;-2.800000e+01;0.000000e+00;0.000000e+00;0.000000e+00;0.000000e+00;28;30
KIWCRESC;1;0.000000e+00;-1.800000e+01;0.000000e+00;0.000000e+00;0.000000e+00;0.000000e+00;18;25
FCCU;1;0.000000e+00;-8.000000e+00;0.000000e+00;0.000000e+00;0.000000e+00;0.000000e+00;8;10
A5NNSNSL;1;0.000000e+00;-1.700000e+01;0.000000e+00;0.000000e+00;0.000000e+00;0.000000e+00;17;19
HS71;1;0.000000e+00;-8.000000e+00;0.000000e+00;0.000000e+00;0.000000e+00;0.000000e+00;8;10
GMNCASE2;1;0.000000e+00;-9.000000e+00;0.000000e+00;0.000000e+00;0.000000e+00;0.000000e+00;9;11
LOTSCHD;1;0.000000e+00;-1.300000e+01;0.000000e+00;0.000000e+00;0.000000e+00;0.000000e+00;13;15
HIER163D;1;0.000000e+00;-1.600000e+01;0.000000e+00;0.000000e+00;0.000000e+00;0.000000e+00;16;18
HS268;1;0.000000e+00;-1.300000e+01;0.000000e+00;0.000000e+00;0.000000e+00;0.000000e+00;13;15
BQPGAUSS;1;0.000000e+00;-1.600000e+01;0.000000e+00;0.000000e+00;0.000000e+00;0.000000e+00;16;18
NINE5D;1;0.000000e+00;-1.200000e+01;0.000000e+00;0.000000e+00;0.000000e+00;0.000000e+00;12;14
CVXQP1;1;0.000000e+00;-3.400000e+01;0.000000e+00;0.000000e+00;0.000000e+00;0.000000e+00;34;130
PALMER2E;1;0.000000e+00;-2.700000e+01;0.000000e+00;0.000000e+00;0.000000e+00;0.000000e+00;27;35
HS73;1;0.000000e+00;-8.000000e+00;0.000000e+00;0.000000e+00;0.000000e+00;0.000000e+00;8;10
HS20;1;0.000000e+00;-8.000000e+00;0.000000e+00;0.000000e+00;0.000000e+00;0.000000e+00;8;10
A2NNDNDL;1;0.000000e+00;-2.100000e+01;0.000000e+00;0.000000e+00;0.000000e+00;0.000000e+00;21;23
PALMER2;0;0.000000e+00;-1.855000e+03;0.000000e+00;0.000000e+00;0.000000e+00;0.000000e+00;834;1209
ROBOT;1;0.000000e+00;-2.400000e+01;0.000000e+00;0.000000e+00;0.000000e+00;0.000000e+00;24;26
A5ESDNDL;1;0.000000e+00;-1.100000e+01;0.000000e+00;0.000000e+00;0.000000e+00;0.000000e+00;11;13
ZAMB2-8;1;0.000000e+00;-1.500000e+01;0.000000e+00;0.000000e+00;0.000000e+00;0.000000e+00;15;17
LOBSTERZ;1;0.000000e+00;-2.300000e+01;0.000000e+00;0.000000e+00;0.000000e+00;0.000000e+00;23;27
DRUGDISE;0;0.000000e+00;-1.712000e+03;0.000000e+00;0.000000e+00;0.000000e+00;0.000000e+00;711;1590
DECONVB;0;0.000000e+00;-1.070000e+03;0.000000e+00;0.000000e+00;0.000000e+00;0.000000e+00;41;47
TABLE8;1;0.000000e+00;-1.000000e+01;0.000000e+00;0.000000e+00;0.000000e+00;0.000000e+00;10;12
NET1;1;0.000000e+00;-5.000000e+01;0.000000e+00;0.000000e+00;0.000000e+00;0.000000e+00;50;68
HET-Z;1;0.000000e+00;-1.000000e+01;0.000000e+00;0.000000e+00;0.000000e+00;0.000000e+00;10;13
READING6;1;0.000000e+00;-1.500000e+01;0.000000e+00;0.000000e+00;0.000000e+00;0.000000e+00;15;17
LISWET8;1;0.000000e+00;-7.500000e+01;0.000000e+00;0.000000e+00;0.000000e+00;0.000000e+00;75;160
LUKVLI1;0;0.000000e+00;-2.000000e+03;0.000000e+00;0.000000e+00;0.000000e+00;0.000000e+00;1000;1108
S368;1;0.000000e+00;-1.100000e+01;0.000000e+00;0.000000e+00;0.000000e+00;0.000000e+00;11;13
A2ESINDL;1;0.000000e+00;-1.200000e+01;0.000000e+00;0.000000e+00;0.000000e+00;0.000000e+00;12;14
NASH;0;0.000000e+00;-1.020000e+03;0.000000e+00;0.000000e+00;0.000000e+00;0.000000e+00;19;21
LISWET9;1;0.000000e+00;-4.550000e+02;0.000000e+00;0.000000e+00;0.000000e+00;0.000000e+00;455;457
PALMER4A;1;0.000000e+00;-5.900000e+01;0.000000e+00;0.000000e+00;0.000000e+00;0.000000e+00;59;76
GOULDQP3;1;0.000000e+00;-6.000000e+00;0.000000e+00;0.000000e+00;0.000000e+00;0.000000e+00;6;8
HARKERP2;1;0.000000e+00;-2.400000e+01;0.000000e+00;0.000000e+00;0.000000e+00;0.000000e+00;24;26
TORSIONE;1;0.000000e+00;-1.200000e+01;0.000000e+00;0.000000e+00;0.000000e+00;0.000000e+00;12;14
BLOWEYC;1;0.000000e+00;-7.000000e+00;0.000000e+00;0.000000e+00;0.000000e+00;0.000000e+00;7;9
LINSPANH;1;0.000000e+00;-1.300000e+01;0.000000e+00;0.000000e+00;0.000000e+00;0.000000e+00;13;15
PALMER3B;1;0.000000e+00;-1.400000e+01;0.000000e+00;0.000000e+00;0.000000e+00;0.000000e+00;14;16
ZECEVIC2;1;0.000000e+00;-7.000000e+00;0.000000e+00;0.000000e+00;0.000000e+00;0.000000e+00;7;9
ZECEVIC4;1;0.000000e+00;-1.100000e+01;0.000000e+00;0.000000e+00;0.000000e+00;0.000000e+00;11;13
OBSTCLBU;1;0.000000e+00;-1.300000e+01;0.000000e+00;0.000000e+00;0.000000e+00;0.000000e+00;13;15
HS70;1;0.000000e+00;-2.200000e+01;0.000000e+00;0.000000e+00;0.000000e+00;0.000000e+00;22;24
KISSING2;1;0.000000e+00;-1.920000e+02;0.000000e+00;0.000000e+00;0.000000e+00;0.000000e+00;192;196
HS95;1;0.000000e+00;-1.700000e+01;0.000000e+00;0.000000e+00;0.000000e+00;0.000000e+00;17;19
PALMER4E;1;0.000000e+00;-3.000000e+01;0.000000e+00;0.000000e+00;0.000000e+00;0.000000e+00;30;37
NCVXBQP2;1;0.000000e+00;-4.500000e+02;0.000000e+00;0.000000e+00;0.000000e+00;0.000000e+00;450;502
DEMYMALO;1;0.000000e+00;-1.900000e+01;0.000000e+00;0.000000e+00;0.000000e+00;0.000000e+00;19;21
DEGENLPA;1;0.000000e+00;-8.800000e+01;0.000000e+00;0.000000e+00;0.000000e+00;0.000000e+00;88;2019
LISWET2;1;0.000000e+00;-1.200000e+01;0.000000e+00;0.000000e+00;0.000000e+00;0.000000e+00;12;14
ROSEPETAL;0;0.000000e+00;-1.022000e+03;0.000000e+00;0.000000e+00;0.000000e+00;0.000000e+00;22;24
SEMICON2;1;0.000000e+00;-1.290000e+02;0.000000e+00;0.000000e+00;0.000000e+00;0.000000e+00;129;181
HAIFAL;1;0.000000e+00;-7.200000e+01;0.000000e+00;0.000000e+00;0.000000e+00;0.000000e+00;72;142
HIER133D;1;0.000000e+00;-1.200000e+01;0.000000e+00;0.000000e+00;0.000000e+00;0.000000e+00;12;14
SIMPLLPB;1;0.000000e+00;-7.000000e+00;0.000000e+00;0.000000e+00;0.000000e+00;0.000000e+00;7;9
ACOPR14;1;0.000000e+00;-1.620000e+02;0.000000e+00;0.000000e+00;0.000000e+00;0.000000e+00;162;1423
BRAINPC3;0;0.000000e+00;-1.817000e+03;0.000000e+00;0.000000e+00;0.000000e+00;0.000000e+00;816;7847
TABLE6;1;0.000000e+00;-1.700000e+01;0.000000e+00;0.000000e+00;0.000000e+00;0.000000e+00;17;19
NINENEW;1;0.000000e+00;-2.100000e+01;0.000000e+00;0.000000e+00;0.000000e+00;0.000000e+00;21;23
READING7;1;0.000000e+00;-1.560000e+02;0.000000e+00;0.000000e+00;0.000000e+00;0.000000e+00;156;167
COSHFUN;1;0.000000e+00;-4.060000e+02;0.000000e+00;0.000000e+00;0.000000e+00;0.000000e+00;406;2942
A2NSDSSL;1;0.000000e+00;-3.200000e+01;0.000000e+00;0.000000e+00;0.000000e+00;0.000000e+00;32;41
YFIT;1;0.000000e+00;-5.100000e+01;0.000000e+00;0.000000e+00;0.000000e+00;0.000000e+00;51;77
NCVXBQP1;1;0.000000e+00;-1.480000e+02;0.000000e+00;0.000000e+00;0.000000e+00;0.000000e+00;148;234
GIGOMEZ3;1;0.000000e+00;-8.000000e+00;0.000000e+00;0.000000e+00;0.000000e+00;0.000000e+00;8;10
HADAMALS;1;0.000000e+00;-1.850000e+02;0.000000e+00;0.000000e+00;0.000000e+00;0.000000e+00;185;187
BLOCKQP2;1;0.000000e+00;-2.000000e+01;0.000000e+00;0.000000e+00;0.000000e+00;0.000000e+00;20;23
HIE1327D;1;0.000000e+00;-1.500000e+01;0.000000e+00;0.000000e+00;0.000000e+00;0.000000e+00;15;17
ROSENMMX;1;0.000000e+00;-1.000000e+01;0.000000e+00;0.000000e+00;0.000000e+00;0.000000e+00;10;12
PRODPL1;1;0.000000e+00;-2.200000e+01;0.000000e+00;0.000000e+00;0.000000e+00;0.000000e+00;22;24
PRIMAL4;1;0.000000e+00;-9.000000e+00;0.000000e+00;0.000000e+00;0.000000e+00;0.000000e+00;9;11
HS15;1;0.000000e+00;-2.200000e+01;0.000000e+00;0.000000e+00;0.000000e+00;0.000000e+00;22;24
LEUVEN1;1;0.000000e+00;-3.500000e+01;0.000000e+00;0.000000e+00;0.000000e+00;0.000000e+00;35;37
A5NSSSSL;1;0.000000e+00;-3.000000e+01;0.000000e+00;0.000000e+00;0.000000e+00;0.000000e+00;30;33
AVGASA;1;0.000000e+00;-8.000000e+00;0.000000e+00;0.000000e+00;0.000000e+00;0.000000e+00;8;10
LEUVEN2;1;0.000000e+00;-1.110000e+02;0.000000e+00;0.000000e+00;0.000000e+00;0.000000e+00;111;237
DEGTRIDL;1;0.000000e+00;-9.000000e+00;0.000000e+00;0.000000e+00;0.000000e+00;0.000000e+00;9;11
HATFLDC;1;0.000000e+00;-9.000000e+00;0.000000e+00;0.000000e+00;0.000000e+00;0.000000e+00;9;11
LUKVLI5;1;0.000000e+00;-4.600000e+01;0.000000e+00;0.000000e+00;0.000000e+00;0.000000e+00;46;51
STNQP2;1;0.000000e+00;-1.400000e+01;0.000000e+00;0.000000e+00;0.000000e+00;0.000000e+00;14;16
PALMER1E;1;0.000000e+00;-5.200000e+01;0.000000e+00;0.000000e+00;0.000000e+00;0.000000e+00;52;74
HS83;1;0.000000e+00;-1.200000e+01;0.000000e+00;0.000000e+00;0.000000e+00;0.000000e+00;12;14
TRIMLOSS;1;0.000000e+00;-2.400000e+01;0.000000e+00;0.000000e+00;0.000000e+00;0.000000e+00;24;28
PENTDI;1;0.000000e+00;-1.000000e+01;0.000000e+00;0.000000e+00;0.000000e+00;0.000000e+00;10;12
HS33;1;0.000000e+00;-1.400000e+01;0.000000e+00;0.000000e+00;0.000000e+00;0.000000e+00;14;16
HIMMELBI;1;0.000000e+00;-2.300000e+01;0.000000e+00;0.000000e+00;0.000000e+00;0.000000e+00;23;25
MPC4;1;0.000000e+00;-3.600000e+01;0.000000e+00;0.000000e+00;0.000000e+00;0.000000e+00;36;38
HS80;1;0.000000e+00;-6.000000e+00;0.000000e+00;0.000000e+00;0.000000e+00;0.000000e+00;6;8
A5ENSNDL;1;0.000000e+00;-1.800000e+01;0.000000e+00;0.000000e+00;0.000000e+00;0.000000e+00;18;43
BQPGABIM;1;0.000000e+00;-1.000000e+01;0.000000e+00;0.000000e+00;0.000000e+00;0.000000e+00;10;12
HS10;1;0.000000e+00;-1.000000e+01;0.000000e+00;0.000000e+00;0.000000e+00;0.000000e+00;10;12
SVANBERG;1;0.000000e+00;-1.700000e+01;0.000000e+00;0.000000e+00;0.000000e+00;0.000000e+00;17;19
TRO41X9;0;0.000000e+00;-1.397000e+03;0.000000e+00;0.000000e+00;0.000000e+00;0.000000e+00;396;641
PFIT2;1;0.000000e+00;-9.260000e+02;0.000000e+00;0.000000e+00;0.000000e+00;0.000000e+00;925;8666
ZAMB2-9;1;0.000000e+00;-1.800000e+01;0.000000e+00;0.000000e+00;0.000000e+00;0.000000e+00;18;20
POLYGON;1;0.000000e+00;-1.010000e+02;0.000000e+00;0.000000e+00;0.000000e+00;0.000000e+00;101;306
BURKEHAN;0;0.000000e+00;-1.023000e+03;0.000000e+00;0.000000e+00;0.000000e+00;0.000000e+00;22;24
TWIRISM1;1;0.000000e+00;-5.800000e+01;0.000000e+00;0.000000e+00;0.000000e+00;0.000000e+00;58;60
SPANHYD;0;0.000000e+00;-1.022000e+03;0.000000e+00;0.000000e+00;0.000000e+00;0.000000e+00;22;24
HELSBY;1;0.000000e+00;-4.900000e+01;0.000000e+00;0.000000e+00;0.000000e+00;0.000000e+00;49;81
HOLMES;1;0.000000e+00;-1.300000e+01;0.000000e+00;0.000000e+00;0.000000e+00;0.000000e+00;13;15
HS114;1;0.000000e+00;-1.400000e+01;0.000000e+00;0.000000e+00;0.000000e+00;0.000000e+00;14;16
TORSION1;1;0.000000e+00;-1.300000e+01;0.000000e+00;0.000000e+00;0.000000e+00;0.000000e+00;13;15
ALLINITC;1;0.000000e+00;-2.500000e+01;0.000000e+00;0.000000e+00;0.000000e+00;0.000000e+00;25;231
STEENBRG;1;0.000000e+00;-1.300000e+02;0.000000e+00;0.000000e+00;0.000000e+00;0.000000e+00;127;268
AVGASB;1;0.000000e+00;-9.000000e+00;0.000000e+00;0.000000e+00;0.000000e+00;0.000000e+00;9;11
MPC2;1;0.000000e+00;-4.100000e+01;0.000000e+00;0.000000e+00;0.000000e+00;0.000000e+00;41;46
S365;0;0.000000e+00;-2.000000e+03;0.000000e+00;0.000000e+00;0.000000e+00;0.000000e+00;1000;7376
BRAINPC6;0;0.000000e+00;-1.826000e+03;0.000000e+00;0.000000e+00;0.000000e+00;0.000000e+00;825;8144
PALMER3A;1;0.000000e+00;-8.200000e+01;0.000000e+00;0.000000e+00;0.000000e+00;0.000000e+00;82;114
TRO5X5;1;0.000000e+00;-1.200000e+01;0.000000e+00;0.000000e+00;0.000000e+00;0.000000e+00;12;14
HAIFAM;1;0.000000e+00;-2.700000e+01;0.000000e+00;0.000000e+00;0.000000e+00;0.000000e+00;27;48
VANDERM2;0;0.000000e+00;-1.098000e+03;0.000000e+00;0.000000e+00;0.000000e+00;0.000000e+00;97;2069
RDW2D51U;1;0.000000e+00;-1.000000e+00;0.000000e+00;0.000000e+00;0.000000e+00;0.000000e+00;2;4
HS106;0;0.000000e+00;-2.000000e+03;0.000000e+00;0.000000e+00;0.000000e+00;0.000000e+00;1000;10579
HS105;1;0.000000e+00;-1.500000e+01;0.000000e+00;0.000000e+00;0.000000e+00;0.000000e+00;15;18
SYNTHES1;1;0.000000e+00;-9.000000e+00;0.000000e+00;0.000000e+00;0.000000e+00;0.000000e+00;9;11
OET1;1;0.000000e+00;-1.800000e+01;0.000000e+00;0.000000e+00;0.000000e+00;0.000000e+00;18;20
HS99EXP;0;0.000000e+00;-1.048000e+03;0.000000e+00;0.000000e+00;0.000000e+00;0.000000e+00;48;50
STEENBRC;1;0.000000e+00;-1.970000e+02;0.000000e+00;0.000000e+00;0.000000e+00;0.000000e+00;194;346
YATP1SQ;1;0.000000e+00;-1.000000e+00;0.000000e+00;0.000000e+00;0.000000e+00;0.000000e+00;3;5
HS110;1;0.000000e+00;-9.000000e+00;0.000000e+00;0.000000e+00;0.000000e+00;0.000000e+00;9;11
EIGMINB;1;0.000000e+00;-1.800000e+01;0.000000e+00;0.000000e+00;0.000000e+00;0.000000e+00;17;19
A0NSSSSL;1;0.000000e+00;-4.800000e+01;0.000000e+00;0.000000e+00;0.000000e+00;0.000000e+00;48;202
HONG;1;0.000000e+00;-8.000000e+00;0.000000e+00;0.000000e+00;0.000000e+00;0.000000e+00;8;10
DIPIGRI;1;0.000000e+00;-1.000000e+01;0.000000e+00;0.000000e+00;0.000000e+00;0.000000e+00;10;19
TENBARS3;1;0.000000e+00;-5.900000e+01;0.000000e+00;0.000000e+00;0.000000e+00;0.000000e+00;59;66
AUG3DQP;1;0.000000e+00;-1.500000e+01;0.000000e+00;0.000000e+00;0.000000e+00;0.000000e+00;15;17
SIPOW2;1;0.000000e+00;-2.800000e+01;0.000000e+00;0.000000e+00;0.000000e+00;0.000000e+00;28;32
MOSARQP1;1;0.000000e+00;-1.000000e+01;0.000000e+00;0.000000e+00;0.000000e+00;0.000000e+00;10;12
LUKVLI16;1;0.000000e+00;-4.600000e+01;0.000000e+00;0.000000e+00;0.000000e+00;0.000000e+00;46;48
3PK;1;0.000000e+00;-1.100000e+01;0.000000e+00;0.000000e+00;0.000000e+00;0.000000e+00;11;13
BRAINPC8;0;0.000000e+00;-1.927000e+03;0.000000e+00;0.000000e+00;0.000000e+00;0.000000e+00;926;9242
LEUVEN5;0;0.000000e+00;-1.359000e+03;0.000000e+00;0.000000e+00;0.000000e+00;0.000000e+00;359;361
QPCBOEI1;1;0.000000e+00;-3.640000e+02;0.000000e+00;0.000000e+00;0.000000e+00;0.000000e+00;364;366
BT13;1;0.000000e+00;-2.300000e+01;0.000000e+00;0.000000e+00;0.000000e+00;0.000000e+00;23;25
TRY-B;1;0.000000e+00;-1.100000e+01;0.000000e+00;0.000000e+00;0.000000e+00;0.000000e+00;11;13
MPC3;1;0.000000e+00;-6.300000e+01;0.000000e+00;0.000000e+00;0.000000e+00;0.000000e+00;63;65
WACHBIEG;1;0.000000e+00;-1.900000e+01;0.000000e+00;0.000000e+00;0.000000e+00;0.000000e+00;19;65
MPC6;1;0.000000e+00;-4.000000e+01;0.000000e+00;0.000000e+00;0.000000e+00;0.000000e+00;40;67
SIM2BQP;1;0.000000e+00;-9.000000e+00;0.000000e+00;0.000000e+00;0.000000e+00;0.000000e+00;9;11
SINROSNB;1;0.000000e+00;-7.500000e+01;0.000000e+00;0.000000e+00;0.000000e+00;0.000000e+00;75;77
SIPOW2M;1;0.000000e+00;-3.100000e+01;0.000000e+00;0.000000e+00;0.000000e+00;0.000000e+00;31;38
MINPERM;1;0.000000e+00;-7.000000e+00;0.000000e+00;0.000000e+00;0.000000e+00;0.000000e+00;7;11
LEAKNET;1;0.000000e+00;-2.000000e+01;0.000000e+00;0.000000e+00;0.000000e+00;0.000000e+00;20;22
HIMMELBK;1;0.000000e+00;-1.900000e+01;0.000000e+00;0.000000e+00;0.000000e+00;0.000000e+00;19;21
EXTRASIM;1;0.000000e+00;-6.000000e+00;0.000000e+00;0.000000e+00;0.000000e+00;0.000000e+00;6;8
PFIT4;0;0.000000e+00;-2.000000e+03;0.000000e+00;0.000000e+00;0.000000e+00;0.000000e+00;1000;8155
HS29;1;0.000000e+00;-1.200000e+01;0.000000e+00;0.000000e+00;0.000000e+00;0.000000e+00;12;14
HIER13;1;0.000000e+00;-1.300000e+01;0.000000e+00;0.000000e+00;0.000000e+00;0.000000e+00;13;15
LUKVLI14;1;0.000000e+00;-2.700000e+01;0.000000e+00;0.000000e+00;0.000000e+00;0.000000e+00;27;29
SAROMM;1;0.000000e+00;-4.200000e+01;0.000000e+00;0.000000e+00;0.000000e+00;0.000000e+00;42;59
LISWET6;1;0.000000e+00;-1.900000e+01;0.000000e+00;0.000000e+00;0.000000e+00;0.000000e+00;19;21
HYDROELM;1;0.000000e+00;-1.980000e+02;0.000000e+00;0.000000e+00;0.000000e+00;0.000000e+00;198;200
LIPPERT1;0;0.000000e+00;-1.055000e+03;0.000000e+00;0.000000e+00;0.000000e+00;0.000000e+00;54;64
CB2;1;0.000000e+00;-9.000000e+00;0.000000e+00;0.000000e+00;0.000000e+00;0.000000e+00;9;11
HS24;1;0.000000e+00;-1.000000e+01;0.000000e+00;0.000000e+00;0.000000e+00;0.000000e+00;10;12
SIPOW1M;1;0.000000e+00;-3.100000e+01;0.000000e+00;0.000000e+00;0.000000e+00;0.000000e+00;31;33
LINVERSE;1;0.000000e+00;-1.170000e+02;0.000000e+00;0.000000e+00;0.000000e+00;0.000000e+00;117;294
DUALC5;1;0.000000e+00;-1.200000e+01;0.000000e+00;0.000000e+00;0.000000e+00;0.000000e+00;12;14
AUG3DCQP;1;0.000000e+00;-1.400000e+01;0.000000e+00;0.000000e+00;0.000000e+00;0.000000e+00;14;16
LOOTSMA;1;0.000000e+00;-2.400000e+01;0.000000e+00;0.000000e+00;0.000000e+00;0.000000e+00;24;26
MPC9;1;0.000000e+00;-4.100000e+01;0.000000e+00;0.000000e+00;0.000000e+00;0.000000e+00;41;43
TRUSPYR1;1;0.000000e+00;-5.100000e+01;0.000000e+00;0.000000e+00;0.000000e+00;0.000000e+00;51;233
QPCSTAIR;1;0.000000e+00;-1.230000e+02;0.000000e+00;0.000000e+00;0.000000e+00;0.000000e+00;123;125
SMBANK;1;0.000000e+00;-1.600000e+01;0.000000e+00;0.000000e+00;0.000000e+00;0.000000e+00;16;18
MCCORMCK;1;0.000000e+00;-1.000000e+01;0.000000e+00;0.000000e+00;0.000000e+00;0.000000e+00;10;24
A0ENDNDL;1;0.000000e+00;-1.000000e+01;0.000000e+00;0.000000e+00;0.000000e+00;0.000000e+00;10;12
HIER163A;1;0.000000e+00;-1.800000e+01;0.000000e+00;0.000000e+00;0.000000e+00;0.000000e+00;18;20
HS67;1;0.000000e+00;-1.100000e+01;0.000000e+00;0.000000e+00;0.000000e+00;0.000000e+00;11;13
EXPFITB;1;0.000000e+00;-4.100000e+01;0.000000e+00;0.000000e+00;0.000000e+00;0.000000e+00;41;49
JANNSON3;1;0.000000e+00;-1.200000e+01;0.000000e+00;0.000000e+00;0.000000e+00;0.000000e+00;12;14
HS65;1;0.000000e+00;-1.100000e+01;0.000000e+00;0.000000e+00;0.000000e+00;0.000000e+00;11;13
OET4;1;0.000000e+00;-2.200000e+01;0.000000e+00;0.000000e+00;0.000000e+00;0.000000e+00;22;51
HS21MOD;1;0.000000e+00;-1.000000e+01;0.000000e+00;0.000000e+00;0.000000e+00;0.000000e+00;10;12
LUKVLI4;0;0.000000e+00;-1.037000e+03;0.000000e+00;0.000000e+00;0.000000e+00;0.000000e+00;37;43
MPC13;1;0.000000e+00;-4.200000e+01;0.000000e+00;0.000000e+00;0.000000e+00;0.000000e+00;42;121
GRIDNETD;1;0.000000e+00;-1.600000e+01;0.000000e+00;0.000000e+00;0.000000e+00;0.000000e+00;16;18
QCNEW;0;0.000000e+00;-1.024000e+03;0.000000e+00;0.000000e+00;0.000000e+00;0.000000e+00;24;37
HS101;1;0.000000e+00;-8.500000e+01;0.000000e+00;0.000000e+00;0.000000e+00;0.000000e+00;85;371
HS16;1;0.000000e+00;-9.000000e+00;0.000000e+00;0.000000e+00;0.000000e+00;0.000000e+00;9;11
DUALC1;1;0.000000e+00;-1.600000e+01;0.000000e+00;0.000000e+00;0.000000e+00;0.000000e+00;16;18
HS19;1;0.000000e+00;-1.500000e+01;0.000000e+00;0.000000e+00;0.000000e+00;0.000000e+00;15;17
TENBARS1;1;0.000000e+00;-7.000000e+01;0.000000e+00;0.000000e+00;0.000000e+00;0.000000e+00;70;79
STEENBRF;1;0.000000e+00;-7.600000e+01;0.000000e+00;0.000000e+00;0.000000e+00;0.000000e+00;76;84
YORKNET;0;0.000000e+00;-2.000000e+03;0.000000e+00;0.000000e+00;0.000000e+00;0.000000e+00;1000;13439
CONGIGMZ;1;0.000000e+00;-2.000000e+01;0.000000e+00;0.000000e+00;0.000000e+00;0.000000e+00;20;24
LUKVLI7;1;0.000000e+00;-1.700000e+01;0.000000e+00;0.000000e+00;0.000000e+00;0.000000e+00;17;19
GOULDQP1;1;0.000000e+00;-1.500000e+01;0.000000e+00;0.000000e+00;0.000000e+00;0.000000e+00;15;17
DUALC2;1;0.000000e+00;-1.300000e+01;0.000000e+00;0.000000e+00;0.000000e+00;0.000000e+00;13;15
HIMMELP5;1;0.000000e+00;-1.800000e+01;0.000000e+00;0.000000e+00;0.000000e+00;0.000000e+00;18;20
READING2;1;0.000000e+00;-1.400000e+01;0.000000e+00;0.000000e+00;0.000000e+00;0.000000e+00;14;16
CVXQP2;1;0.000000e+00;-1.500000e+01;0.000000e+00;0.000000e+00;0.000000e+00;0.000000e+00;15;17
ROSEPETAL2;1;0.000000e+00;-3.600000e+01;0.000000e+00;0.000000e+00;0.000000e+00;0.000000e+00;36;40
LUKVLI15;1;0.000000e+00;-1.810000e+02;0.000000e+00;0.000000e+00;0.000000e+00;0.000000e+00;181;185
PALMER5A;0;0.000000e+00;-2.000000e+03;0.000000e+00;0.000000e+00;0.000000e+00;0.000000e+00;1000;2145
A5ENINDL;1;0.000000e+00;-1.100000e+01;0.000000e+00;0.000000e+00;0.000000e+00;0.000000e+00;11;13
OBSTCLAE;1;0.000000e+00;-1.500000e+01;0.000000e+00;0.000000e+00;0.000000e+00;0.000000e+00;15;17
TRUSPYR2;1;0.000000e+00;-1.300000e+01;0.000000e+00;0.000000e+00;0.000000e+00;0.000000e+00;13;15
BRITGAS;1;0.000000e+00;-4.500000e+01;0.000000e+00;0.000000e+00;0.000000e+00;0.000000e+00;45;68
SSEBNLN;0;0.000000e+00;-1.725000e+03;0.000000e+00;0.000000e+00;0.000000e+00;0.000000e+00;724;11002
HS31;1;0.000000e+00;-9.000000e+00;0.000000e+00;0.000000e+00;0.000000e+00;0.000000e+00;9;12
PORTFL3;1;0.000000e+00;-8.000000e+00;0.000000e+00;0.000000e+00;0.000000e+00;0.000000e+00;8;10
QPNBOEI1;0;0.000000e+00;-1.136000e+03;0.000000e+00;0.000000e+00;0.000000e+00;0.000000e+00;136;138
QPNSTAIR;1;0.000000e+00;-1.770000e+02;0.000000e+00;0.000000e+00;0.000000e+00;0.000000e+00;177;181
SANTA;0;0.000000e+00;-1.017000e+03;0.000000e+00;0.000000e+00;0.000000e+00;0.000000e+00;16;30
HS53;1;0.000000e+00;-7.000000e+00;0.000000e+00;0.000000e+00;0.000000e+00;0.000000e+00;7;9
ACOPR300;0;0.000000e+00;-2.000000e+03;0.000000e+00;0.000000e+00;0.000000e+00;0.000000e+00;1000;10991
A5NNDNIL;0;0.000000e+00;-2.000000e+03;0.000000e+00;0.000000e+00;0.000000e+00;0.000000e+00;1000;1002
A5NSDSDM;1;0.000000e+00;-2.500000e+01;0.000000e+00;0.000000e+00;0.000000e+00;0.000000e+00;25;27
A2NNDNIL;0;0.000000e+00;-1.123000e+03;0.000000e+00;0.000000e+00;0.000000e+00;0.000000e+00;122;124
TORSION5;1;0.000000e+00;-1.200000e+01;0.000000e+00;0.000000e+00;0.000000e+00;0.000000e+00;12;14
HS36;1;0.000000e+00;-9.000000e+00;0.000000e+00;0.000000e+00;0.000000e+00;0.000000e+00;9;11
A2NNDNSL;1;0.000000e+00;-3.700000e+01;0.000000e+00;0.000000e+00;0.000000e+00;0.000000e+00;37;39
NOBNDTOR;1;0.000000e+00;-1.400000e+01;0.000000e+00;0.000000e+00;0.000000e+00;0.000000e+00;14;16
HS17;1;0.000000e+00;-1.300000e+01;0.000000e+00;0.000000e+00;0.000000e+00;0.000000e+00;13;15
ALSOTAME;1;0.000000e+00;-8.000000e+00;0.000000e+00;0.000000e+00;0.000000e+00;0.000000e+00;8;10
TORSION2;1;0.000000e+00;-1.200000e+01;0.000000e+00;0.000000e+00;0.000000e+00;0.000000e+00;12;14
EXPFITC;0;0.000000e+00;-1.048000e+03;0.000000e+00;0.000000e+00;0.000000e+00;0.000000e+00;17;69
TORSIONC;1;0.000000e+00;-1.200000e+01;0.000000e+00;0.000000e+00;0.000000e+00;0.000000e+00;12;14
MIFFLIN1;1;0.000000e+00;-6.000000e+00;0.000000e+00;0.000000e+00;0.000000e+00;0.000000e+00;6;8
HIER16;1;0.000000e+00;-1.100000e+01;0.000000e+00;0.000000e+00;0.000000e+00;0.000000e+00;11;13
HS12;1;0.000000e+00;-1.000000e+01;0.000000e+00;0.000000e+00;0.000000e+00;0.000000e+00;10;12
HS91;1;0.000000e+00;-1.500000e+01;0.000000e+00;0.000000e+00;0.000000e+00;0.000000e+00;15;17
AGG;1;0.000000e+00;-4.370000e+02;0.000000e+00;0.000000e+00;0.000000e+00;0.000000e+00;437;439
A0ENSNDL;1;0.000000e+00;-1.100000e+01;0.000000e+00;0.000000e+00;0.000000e+00;0.000000e+00;11;13
DALLASM;1;0.000000e+00;-2.600000e+01;0.000000e+00;0.000000e+00;0.000000e+00;0.000000e+00;26;28
LUKVLI17;1;0.000000e+00;-2.000000e+01;0.000000e+00;0.000000e+00;0.000000e+00;0.000000e+00;20;27
MANNE;1;0.000000e+00;-5.750000e+02;0.000000e+00;0.000000e+00;0.000000e+00;0.000000e+00;575;1280
RDW2D52B;1;0.000000e+00;-7.000000e+00;0.000000e+00;0.000000e+00;0.000000e+00;0.000000e+00;7;9
DALE;1;0.000000e+00;-1.100000e+01;0.000000e+00;0.000000e+00;0.000000e+00;0.000000e+00;11;13
HANGING;1;0.000000e+00;-2.300000e+01;0.000000e+00;0.000000e+00;0.000000e+00;0.000000e+00;23;25
PRIMAL1;1;0.000000e+00;-1.200000e+01;0.000000e+00;0.000000e+00;0.000000e+00;0.000000e+00;12;14
TABLE4;1;0.000000e+00;-2.000000e+01;0.000000e+00;0.000000e+00;0.000000e+00;0.000000e+00;20;22
A5NSDSDL;1;0.000000e+00;-1.400000e+01;0.000000e+00;0.000000e+00;0.000000e+00;0.000000e+00;14;16
MODEL;0;0.000000e+00;-1.044000e+03;0.000000e+00;0.000000e+00;0.000000e+00;0.000000e+00;44;46
LHAIFAM;0;0.000000e+00;-1.054000e+03;0.000000e+00;0.000000e+00;0.000000e+00;0.000000e+00;54;91
PFIT1;1;0.000000e+00;-5.900000e+01;0.000000e+00;0.000000e+00;0.000000e+00;0.000000e+00;59;335
STEENBRA;1;0.000000e+00;-2.900000e+01;0.000000e+00;0.000000e+00;0.000000e+00;0.000000e+00;29;31
STANCMIN;1;0.000000e+00;-9.000000e+00;0.000000e+00;0.000000e+00;0.000000e+00;0.000000e+00;9;11
LEUVEN6;0;0.000000e+00;-1.577000e+03;0.000000e+00;0.000000e+00;0.000000e+00;0.000000e+00;577;579
A0NNDNDL;1;0.000000e+00;-1.700000e+01;0.000000e+00;0.000000e+00;0.000000e+00;0.000000e+00;17;19
MADSSCHJ;1;0.000000e+00;-2.300000e+01;0.000000e+00;0.000000e+00;0.000000e+00;0.000000e+00;23;27
DUAL4;1;0.000000e+00;-9.000000e+00;0.000000e+00;0.000000e+00;0.000000e+00;0.000000e+00;9;11
SANTALS;1;0.000000e+00;-3.000000e+01;0.000000e+00;0.000000e+00;0.000000e+00;0.000000e+00;30;41
HS76;1;0.000000e+00;-7.000000e+00;0.000000e+00;0.000000e+00;0.000000e+00;0.000000e+00;7;9
OET7;1;0.000000e+00;-4.080000e+02;0.000000e+00;0.000000e+00;0.000000e+00;0.000000e+00;408;850
SYNTHES2;1;0.000000e+00;-1.800000e+01;0.000000e+00;0.000000e+00;0.000000e+00;0.000000e+00;18;20
WOMFLET;1;0.000000e+00;-1.500000e+01;0.000000e+00;0.000000e+00;0.000000e+00;0.000000e+00;15;17
SSNLBEAM;1;0.000000e+00;-5.570000e+02;0.000000e+00;0.000000e+00;0.000000e+00;0.000000e+00;557;565
TRO4X4;1;0.000000e+00;-1.100000e+01;0.000000e+00;0.000000e+00;0.000000e+00;0.000000e+00;11;13
PORTFL1;1;0.000000e+00;-7.000000e+00;0.000000e+00;0.000000e+00;0.000000e+00;0.000000e+00;7;9
ODFITS;1;0.000000e+00;-9.000000e+00;0.000000e+00;0.000000e+00;0.000000e+00;0.000000e+00;9;13
