{
  "$schema": "https://docs.renovatebot.com/renovate-schema.json",
  "dependencyDashboard": true,
  "extends": ["config:base"],
  "enabled": true,
  "endpoint": "https://gitlab.com/api/v4/",
  "onboarding": false,
  "platform": "gitlab",
  "rangeStrategy": "update-lockfile",
  "reviewers": ["renestalder"],
  "skipInstalls": true,
  "stabilityDays": 3,
  "prCreation": "not-pending",
  "requiredStatusChecks": null,
  "updatePinnedDependencies": false,
  "lockFileMaintenance": { "enabled": true },
  "packageRules": [
    {
      "matchUpdateTypes": ["patch", "digest"],
      "automerge": true
    },
    {
      "matchUpdateTypes": ["pin"],
      "automerge": false,
      "labels": ["check regression"]
    },
    {
      "matchPackagePatterns": ["^getkirby/cms"],
      "matchBaseBranches": ["master", "main", "production"],
      "groupName": "getkirby/cms <4.0.0 (major/minor)",
      "matchUpdateTypes": ["major", "minor"],
      "automerge": false,
      "labels": ["check regression"],
      "matchCurrentVersion": "< 4.0.0"
    },
    {
      "matchPackagePatterns": ["^getkirby/cms"],
      "matchBaseBranches": ["master", "main", "production"],
      "groupName": "getkirby/cms <4.0.0 (patches)",
      "matchUpdateTypes": ["patch"],
      "automerge": true,
      "matchCurrentVersion": "< 4.0.0"
    },
    {
      "matchPackagePatterns": ["^getkirby/cms"],
      "matchBaseBranches": ["master", "main", "production"],
      "groupName": "getkirby/cms >=4.0.0 (minor/patch)",
      "matchUpdateTypes": ["minor", "patch"],
      "automerge": true,
      "matchCurrentVersion": ">= 4.0.0"
    },
    {
      "matchPackagePatterns": ["concurrently"],
      "groupName": "concurrently save automerges",
      "automerge": true,
      "matchCurrentVersion": "< 9.0.0"
    },
    {
      "matchPackagePatterns": ["prettier"],
      "groupName": "prettier save automerges",
      "automerge": true,
      "matchCurrentVersion": "< 4.0.0"
    }
  ]
}
