﻿BDFPF BK. / CHAMP BE SQUAT UNEQUIPPED 2011
SQUAT UNEQUIPPED
                                                 W.Class                                                                    1é     2é       3é       4        points
1                                            1   - 63 KG Wuyts        Helen           V    Gilberts Gym   20   JR   61,2    110    120      125               105,78
1                                            1   - 80 KG Dechamps     Nadege      V   Castors             15   T1   73,8    100    110      115      -120     83,96
1                                            1   60 KG Jachart        Jeremy      M   Castors             19   T3   58,6    100    110      115      -120     95,80
2                                            2   60 KG Bruneel        Angelo      M   Isogym              18   T3   59,9    100    105      110      -115,5   89,56
1                                            1   67,5 KG Mignolet     Geoffrey    M   Castors             17   T2   66,2    155    162,5    170,5    175      125,58
2                                            2   67,5 KG De Vissher   Geovanni    M   Power Lebbeke       17   T2   67,4    140    150      160               116,29
3                                            1   67,5 KG Cuylle       Angelo      M   Isogym              18   T3   65,0    105    112,5    115               86,41
1                                            1   75 KG Hallewaert     Bart        M   Isogym              42   M1   74,5    160    170      180               120,24
2                                            1   75 KG Van Gucht      Maikel      M   Power lebbeke       15   T1   68,9    -120   -130     130      140      92,66
1                                            1   82,5 KG Sudarminto   Indra       M   Planet Fitness      20   JR   75,7    200    212,5    -220              140,19
2                                            1   82,5 KG Peeters      Alan            M    Gilberts Gym   17   T2   77,8    130    145      152,5             98,53
1                                            1   90 KG Verbeke        Beny        M   Isogym              46   M2   89,2    160    180,5    190      200,5    111,82
2                                            1   90 KG Jans           Ben             M    Patton Team    14   T1   89,6    -140   150      -165              88,04
3                                            1   90 KG Goethals       Dries       M   KBBC                26   SR   85,3    120    -140     -140              72,66
1                                            1   110 KG Vermote       Gianni      M   Isogym              39   SR   109,8   175    -202,5   210               112,71
2                                            2   110 KG Peeters       Geeraard        M    Patton Team    25   SR   106,4   165    175      -182,5            94,75
1                                            1   125 KG Dechamps      Jerome      M   Castors             23   JR   118,4   210    220      -240              116,25
1                                            1   145 KG Dechamps      Sebastien   M   Castors             18   T3   126,0   210    220      240      -245     124,75
BR
BEST LIFTER
DRUGTEST
25 September 2011, Florennes
