Division,WeightClassKg,Place,Name,Team,BodyweightKg,Best3SquatKg,Best3BenchKg,Best3DeadliftKg,TotalKg,Equipment,Event,Sex
Girls,44.23,1,Natali Dominguez,Mertzon Irion County,43.05,122.47,72.57,120.2,315.25,Single-ply,SBD,F
Girls,44.23,2,Jaylin Haughie,Center Point,43.14,113.4,65.77,111.13,290.3,Single-ply,SBD,F
Girls,44.23,3,Jessica Garcia,Yorktown,43.59,104.33,47.63,99.79,251.74,Single-ply,SBD,F
Girls,44.23,4,Angela Foss,Crawford,42.27,90.72,49.9,97.52,238.14,Single-ply,SBD,F
Girls,44.23,5,Taylor Barnes,Valley View,42.41,90.72,40.82,92.99,224.53,Single-ply,SBD,F
Girls,44.23,6,Brittany Payne,Shelbyville,43.23,90.72,38.56,95.25,224.53,Single-ply,SBD,F
Girls,44.23,7,Brayleigh McGill,Panhandle,43.95,72.57,38.56,113.4,224.53,Single-ply,SBD,F
Girls,44.23,8,Sadey Paniagua,Crawford,42.09,88.45,38.56,90.72,217.72,Single-ply,SBD,F
Girls,44.23,9,Diana Valencia,Shelbyville,40.19,83.91,38.56,90.72,213.19,Single-ply,SBD,F
Girls,44.23,10,Kelsey Hyatt,Deweyville,44,52.16,29.48,49.9,131.54,Single-ply,SBD,F
Girls,47.85,1,Natalie Walker,Blue Ridge,46.81,136.08,65.77,122.47,324.32,Single-ply,SBD,F
Girls,47.85,2,Mariah Alaniz,Freer,47.13,133.81,58.97,122.47,315.25,Single-ply,SBD,F
Girls,47.85,3,Keeley Jurca,Celeste,45.5,113.4,74.84,115.67,303.91,Single-ply,SBD,F
Girls,47.85,4,Cheyenne Jones,Cumby,46.81,117.93,65.77,117.93,301.64,Single-ply,SBD,F
Girls,47.85,5,Kealey Witt,Crawford,46.72,117.93,65.77,113.4,297.1,Single-ply,SBD,F
Girls,47.85,6,Serena Ayala,Tahoka,47.17,113.4,56.7,124.74,294.84,Single-ply,SBD,F
Girls,47.85,7,Alexis Longoria,Yorktown,47.54,131.54,49.9,111.13,292.57,Single-ply,SBD,F
Girls,47.85,8,Emilee Jones,Simms Bowie,46.81,97.52,47.63,113.4,258.55,Single-ply,SBD,F
Girls,47.85,9,Raelee Borrego,Ozona,46.04,92.99,58.97,104.33,256.28,Single-ply,SBD,F
Girls,47.85,10,Blysse Boling,Alvord,47.72,92.99,40.82,97.52,231.33,Single-ply,SBD,F
Girls,47.85,11,Kaelyn Aldridge,Ganado,46.4,83.91,40.82,83.91,208.65,Single-ply,SBD,F
Girls,51.94,1,Jaelan Linville,Mount Enterprise,51.35,122.47,95.25,120.2,337.93,Single-ply,SBD,F
Girls,51.94,2,Kelby Tidwell,Post,51.35,129.27,61.23,122.47,312.98,Single-ply,SBD,F
Girls,51.94,3,Madalyn Hartmann,Normangee,51.21,120.2,68.04,117.93,306.17,Single-ply,SBD,F
Girls,51.94,4,Edna Herschberger,Pettus,50.62,102.06,65.77,133.81,301.64,Single-ply,SBD,F
Girls,51.94,5,Adriana Carlos,Center Point,50.67,127.01,54.43,120.2,301.64,Single-ply,SBD,F
Girls,51.94,6,Kaylee Mueller,Seagraves,50.12,115.67,56.7,127.01,299.37,Single-ply,SBD,F
Girls,51.94,7,Savannah Johnson,San Saba,50.26,111.13,52.16,117.93,281.23,Single-ply,SBD,F
Girls,51.94,8,Brianna Bryant,Perrin-Whitt,51.89,104.33,52.16,115.67,272.16,Single-ply,SBD,F
Girls,51.94,9,Kelli Tucker,Perrin-Whitt,51.39,95.25,45.36,115.67,256.28,Single-ply,SBD,F
Girls,51.94,DQ,Kassidy Matus,Riesel,51.71,,,,,Single-ply,SBD,F
Girls,56.02,1,Marissa Olvera,Center Point,55.2,142.88,77.11,131.54,351.53,Single-ply,SBD,F
Girls,56.02,2,Amy Jo Wick,Weimar,54.43,131.54,54.43,129.27,315.25,Single-ply,SBD,F
Girls,56.02,3,Madi Newman,Gladewater Union Grove,55.7,122.47,79.38,113.4,315.25,Single-ply,SBD,F
Girls,56.02,4,Sophia Langford,Tom Bean,53.66,120.2,61.23,129.27,310.71,Single-ply,SBD,F
Girls,56.02,5,Sela Aguilar,Gladewater Union Grove,55.02,120.2,77.11,108.86,306.17,Single-ply,SBD,F
Girls,56.02,6,Kadence Esparza,Seagraves,55.11,115.67,61.23,120.2,297.1,Single-ply,SBD,F
Girls,56.02,7,Karisa Minjarez,Seagraves,55.43,122.47,54.43,120.2,297.1,Single-ply,SBD,F
Girls,56.02,8,Brionna Townsend,Petrolia,56.02,104.33,68.04,122.47,294.84,Single-ply,SBD,F
Girls,56.02,9,Aryana Gober,Meridian,55.34,108.86,52.16,113.4,274.42,Single-ply,SBD,F
Girls,56.02,10,Kaitlyn Surratt,Louise,53.61,83.91,52.16,102.06,238.14,Single-ply,SBD,F
Girls,56.02,11,Shelby Carouthers,Hull-Daisetta,54.79,77.11,47.63,90.72,215.46,Single-ply,SBD,F
Girls,56.02,DQ,Jami Jakubik,Snook,54.98,,,,,Single-ply,SBD,F
Girls,60.1,1,Alexis Mojica,Ganado,58.92,158.76,70.31,167.83,396.89,Single-ply,SBD,F
Girls,60.1,2,Sarah Gautreaux,Thrall,57.52,158.76,97.52,138.35,394.63,Single-ply,SBD,F
Girls,60.1,3,Sealeigh Ramsey,Electra,59.24,147.42,56.7,145.15,349.27,Single-ply,SBD,F
Girls,60.1,4,Marisol DeLuna,Eldorado,56.47,131.54,61.23,145.15,337.93,Single-ply,SBD,F
Girls,60.1,5,Karissa Bueno,Seagraves,59.24,142.88,56.7,138.35,337.93,Single-ply,SBD,F
Girls,60.1,6,Haley Pollard,Chico,57.74,122.47,70.31,136.08,328.85,Single-ply,SBD,F
Girls,60.1,7,Lauren Newton,Thorndale,59.42,129.27,54.43,122.47,306.17,Single-ply,SBD,F
Girls,60.1,8,Brenda Macklin,Center Point,59.51,136.08,54.43,108.86,299.37,Single-ply,SBD,F
Girls,60.1,9,Autum Champagne,Hull-Daisetta,58.83,117.93,45.36,129.27,292.57,Single-ply,SBD,F
Girls,60.1,10,Aimsley Blank,Yorktown,58.6,88.45,45.36,102.06,235.87,Single-ply,SBD,F
Girls,60.1,DQ,Dioseny Mejia,Gilmer Union Hill,57.74,,,,,Single-ply,SBD,F
Girls,67.36,1,Kayci Molina,Runge,66.04,149.69,70.31,149.69,369.68,Single-ply,SBD,F
Girls,67.36,2,Alivia Waters,Chilton,65.41,142.88,61.23,158.76,362.87,Single-ply,SBD,F
Girls,67.36,3,Hannah Jamar,Hawley,62.73,136.08,83.91,129.27,349.27,Single-ply,SBD,F
Girls,67.36,4,Kaylie Hudson,Axtell,64.95,142.88,58.97,136.08,337.93,Single-ply,SBD,F
Girls,67.36,5,Araseli Villanueva,Junction,65.95,136.08,58.97,127.01,322.05,Single-ply,SBD,F
Girls,67.36,6,Elidia Gonzales,Center Point,66.09,142.88,45.36,133.81,322.05,Single-ply,SBD,F
Girls,67.36,7,Sami Deford,Petrolia,63,115.67,65.77,129.27,310.71,Single-ply,SBD,F
Girls,67.36,8,Taylor Colbert,Gilmer Union Hill,64.27,108.86,56.7,108.86,274.42,Single-ply,SBD,F
Girls,67.36,DQ,Baylee Young,Olney,61.01,113.4,,,,Single-ply,SBD,F
Girls,67.36,DQ,Ashley Hagood,Cumby,64.91,,,,,Single-ply,SBD,F
Girls,75.07,1,Samantha Hagood,Cumby,71.53,149.69,72.57,165.56,387.82,Single-ply,SBD,F
Girls,75.07,2,Allyson Rangel,Freer,74.71,149.69,79.38,151.95,381.02,Single-ply,SBD,F
Girls,75.07,3,Madison Taylor #2,Shelbyville,73.71,147.42,77.11,147.42,371.95,Single-ply,SBD,F
Girls,75.07,4,Kendall Straube,Three Rivers,69.81,145.15,72.57,149.69,367.41,Single-ply,SBD,F
Girls,75.07,5,Alaina Hatfield,Electra,73.16,113.4,72.57,136.08,322.05,Single-ply,SBD,F
Girls,75.07,6,Allana Sublett,Ganado,73.62,142.88,49.9,127.01,319.78,Single-ply,SBD,F
Girls,75.07,7,Jackie Covarrubiaz,Eldorado,71.17,129.27,54.43,129.27,312.98,Single-ply,SBD,F
Girls,75.07,8,Lexi Roberts,Collinsville,70.85,113.4,63.5,102.06,278.96,Single-ply,SBD,F
Girls,75.07,9,Isabel Lilie,Louise,70.17,106.59,47.63,106.59,260.82,Single-ply,SBD,F
Girls,75.07,NS,Natalie Antis,Riesel,,,,,,Single-ply,SBD,F
Girls,75.07,DQ,Emily Hafernik,Thrall,71.8,,,,,Single-ply,SBD,F
Girls,75.07,DQ,Ariuana Wilson,Laird Hill Leveretts Chapel,73.89,,,,,Single-ply,SBD,F
Girls,75.07,DQ,K'Lynn O'Shields,Hawley,69.81,158.76,74.84,,,Single-ply,SBD,F
Girls,82.33,1,Monica Villalobos,Center Point,78.74,167.83,83.91,142.88,394.63,Single-ply,SBD,F
Girls,82.33,2,Ashley Porter,Thrall,78.79,158.76,74.84,156.49,390.09,Single-ply,SBD,F
Girls,82.33,3,La'Anna Golden,Olney,79.11,154.22,72.57,154.22,381.02,Single-ply,SBD,F
Girls,82.33,4,Paige Seely,Cumby,76.52,138.35,92.99,133.81,365.14,Single-ply,SBD,F
Girls,82.33,5,Clariza Moreno,Freer,79.15,147.42,70.31,147.42,365.14,Single-ply,SBD,F
Girls,82.33,6,Cyra Mireles,Ropesville Ropes,80.6,149.69,68.04,133.81,351.53,Single-ply,SBD,F
Girls,82.33,7,Monica Sanchez,Eldorado,79.83,120.2,63.5,158.76,342.46,Single-ply,SBD,F
Girls,82.33,8,Madi Luera,Ganado,76.38,124.74,45.36,122.47,292.57,Single-ply,SBD,F
Girls,82.33,9,Deanna Duensing,Electra,77.11,106.59,49.9,108.86,265.35,Single-ply,SBD,F
Girls,82.33,DQ,Katie Melton,Gladewater Union Grove,80.06,,,,,Single-ply,SBD,F
Girls,82.33,DQ,Clara Coker,Rosebud-Lott,78.34,,,,,Single-ply,SBD,F
Girls,90.04,1,Desere Cooper,Joaquin,85.55,192.78,81.65,183.7,458.13,Single-ply,SBD,F
Girls,90.04,2,Cristin Martin,Electra,89.77,185.97,74.84,183.7,444.52,Single-ply,SBD,F
Girls,90.04,3,Larissa Milleer,Kenedy,82.46,151.95,77.11,154.22,383.29,Single-ply,SBD,F
Girls,90.04,4,Olivia Trevino,Collinsville,89.22,154.22,72.57,136.08,362.87,Single-ply,SBD,F
Girls,90.04,5,Brianna Leal,Freer,83.23,142.88,81.65,131.54,356.07,Single-ply,SBD,F
Girls,90.04,6,Kaitlyn Tambunga,Ozona,87.23,149.69,63.5,136.08,349.27,Single-ply,SBD,F
Girls,90.04,7,Elsa Galvan,Anson,85.82,151.95,49.9,133.81,335.66,Single-ply,SBD,F
Girls,90.04,8,Kamryn Winget,Crawford,82.37,124.74,68.04,133.81,326.59,Single-ply,SBD,F
Girls,90.04,9,Jessica Lewis #2,Riesel,88.54,122.47,52.16,127.01,301.64,Single-ply,SBD,F
Girls,90.04,DQ,Ta'Avyonne Felder,Wortham,89.99,,,,,Single-ply,SBD,F
Girls,100.02,1,Sirena Minjarez,Seagraves,97.34,231.33,120.2,176.9,528.44,Single-ply,SBD,F
Girls,100.02,2,Argentina Garcia,La Villa,96.8,219.99,113.4,154.22,487.61,Single-ply,SBD,F
Girls,100.02,3,Estafana Whitmer,Meridian,96.34,161.03,83.91,131.54,376.48,Single-ply,SBD,F
Girls,100.02,4,Darnisha Williams,Electra,98.2,149.69,83.91,138.35,371.95,Single-ply,SBD,F
Girls,100.02,5,Alicia Sanchez,Meadow,95.48,154.22,70.31,142.88,367.41,Single-ply,SBD,F
Girls,100.02,6,Mallorie Brown,Saratoga West Hardin,96.52,165.56,54.43,136.08,356.07,Single-ply,SBD,F
Girls,100.02,7,Amber Karnes,Cayuga,91.4,149.69,77.11,122.47,349.27,Single-ply,SBD,F
Girls,100.02,8,Brianna Hill,Hamilton,97.75,127.01,58.97,142.88,328.85,Single-ply,SBD,F
Girls,100.02,9,Kaitlyn Long,Collinsville,91.58,124.74,74.84,127.01,326.59,Single-ply,SBD,F
Girls,100.02,10,Jada Moore,Shelbyville,98.29,147.42,61.23,113.4,322.05,Single-ply,SBD,F
Girls,100.02,11,Shelby Crumpler,Deweyville,93.94,120.2,54.43,124.74,299.37,Single-ply,SBD,F
Girls,100.02,DQ,Amberodia Aleman,Kenedy,93.67,,,,,Single-ply,SBD,F
Girls,117.71,1,Katie Casey,Shelbyville,103.78,226.8,81.65,192.78,501.22,Single-ply,SBD,F
Girls,117.71,2,Nikki Rangel,Rocksprings,102.38,195.04,83.91,167.83,446.79,Single-ply,SBD,F
Girls,117.71,3,Jodi Linscomb,Freer,108.54,179.17,72.57,154.22,405.97,Single-ply,SBD,F
Girls,117.71,4,Mykenzie Stroud,Holland,106.55,172.37,104.33,124.74,401.43,Single-ply,SBD,F
Girls,117.71,5,Charley Gardner,Anson,114.85,161.03,83.91,138.35,383.29,Single-ply,SBD,F
Girls,117.71,6,Alicia Arambula,Junction,106.59,145.15,74.84,158.76,378.75,Single-ply,SBD,F
Girls,117.71,7,Mya Rose,Hawkins,113.76,133.81,81.65,145.15,360.61,Single-ply,SBD,F
Girls,117.71,8,Allison Ricketts,Alvord,103.24,140.61,81.65,136.08,358.34,Single-ply,SBD,F
Girls,117.71,9,Morgan Moore,Valley View,108.09,154.22,68.04,124.74,347,Single-ply,SBD,F
Girls,117.71,10,Lorraine Herd,Hamilton,106.5,129.27,58.97,124.74,312.98,Single-ply,SBD,F
Girls,117.71+,1,Daisia Bell,Snook,142.61,204.12,127.01,165.56,496.68,Single-ply,SBD,F
Girls,117.71+,2,Katrina Partain,Dawson,130.54,172.37,115.67,138.35,426.38,Single-ply,SBD,F
Girls,117.71+,3,Shalandra Walker,San Augustine,119.98,161.03,90.72,156.49,408.23,Single-ply,SBD,F
Girls,117.71+,4,Shania Zapata,Benavides,120.2,158.76,68.04,133.81,360.61,Single-ply,SBD,F
Girls,117.71+,5,Bailey Yale,Sherman Texoma Christian School,140.7,108.86,68.04,142.88,319.78,Single-ply,SBD,F
Girls,117.71+,6,Yulissa Bass,Saratoga West Hardin,121.52,86.18,52.16,108.86,247.21,Single-ply,SBD,F
Girls,117.71+,7,Heather Hicks,Memphis,140.21,92.99,61.23,61.23,215.46,Single-ply,SBD,F
Girls,117.71+,DQ,Jazz-Lynn Lewis,Refugio,122.2,113.4,61.23,,,Single-ply,SBD,F
Girls,117.71+,DQ,Fiorley Garcia,Hico,132.45,,,,,Single-ply,SBD,F
