Name,Sex,Event,Equipment,Division,BodyweightKg,WeightClassKg,Squat1Kg,Squat2Kg,Squat3Kg,Best3SquatKg,Bench1Kg,Bench2Kg,Bench3Kg,Best3BenchKg,Deadlift1Kg,Deadlift2Kg,Deadlift3Kg,Best3DeadliftKg,Deadlift4Kg,TotalKg,Place
Donavan Spencer,M,SBD,Raw,Teen 14-15,52.62,56,,,102.06,102.06,52.16,56.7,61.23,61.23,61.23,102.06,,102.06,,265.35,1
Zena Cliff,F,SBD,Raw,Teen 14-15,59.42,60,,,61.23,61.23,34.02,36.29,,36.29,61.23,74.84,97.52,97.52,,195.04,1
Mike Turner,M,SBD,Raw,Juniors 20-24,59.42,60,102.06,,,102.06,,,88.45,88.45,133.81,138.35,147.42,147.42,,337.93,1
Kevin Moore,M,SBD,Raw,Teen 16-17,59.42,60,,79.38,,79.38,,,,,142.88,151.95,,151.95,,,DQ
Brendon Bauer,M,SBD,Raw,Teen 16-17,59.87,60,83.91,,90.72,90.72,74.84,79.38,,79.38,129.27,131.54,,131.54,,301.64,2
Kenneth Woolard,M,SBD,Raw,Teen 16-17,59.87,60,97.52,102.06,,102.06,70.31,,74.84,74.84,136.08,140.61,,140.61,,317.51,1
Shirone Ford,M,SBD,Raw,Teen 14-15,65.32,67.5,,,,,52.16,56.7,,56.7,83.91,113.4,,113.4,,,DQ
Joey Ianetta,M,SBD,Raw,Teen 14-15,60.33,67.5,,102.06,,102.06,61.23,65.77,70.31,70.31,117.93,127.01,136.08,136.08,,308.44,2
Torrian Gordon,M,SBD,Raw,Teen 14-15,67.13,67.5,102.06,,120.2,120.2,99.79,106.59,115.67,115.67,113.4,124.74,142.88,142.88,,378.75,1
Cole Trevillian,M,SBD,Raw,Teen 16-17,65.32,67.5,,,,,,,,,,,120.2,120.2,,,DQ
Ryan Stewart #6,M,SBD,Raw,Teen 16-17,62.6,67.5,79.38,83.91,90.72,90.72,65.77,70.31,,70.31,129.27,133.81,,133.81,,294.84,3
Brandon Mercer,M,SBD,Raw,Teen 16-17,66.22,67.5,124.74,129.27,133.81,133.81,,,,,183.7,188.24,,188.24,,,DQ
Kevin Tipton,M,SBD,Raw,Teen 16-17,65.77,67.5,97.52,108.86,113.4,113.4,83.91,90.72,,90.72,147.42,151.95,156.49,156.49,,360.61,1
Frankie Ensley,M,SBD,Raw,Teen 18-19,67.13,67.5,88.45,90.72,95.25,95.25,47.63,49.9,52.16,52.16,129.27,131.54,136.08,136.08,,283.5,3
Jeremy Semones,M,SBD,Raw,Teen 18-19,67.13,67.5,115.67,122.47,,122.47,,,,,174.63,,,174.63,,,DQ
Jacob Manuel,M,SBD,Raw,Teen 18-19,66.68,67.5,136.08,142.88,,142.88,104.33,,108.86,108.86,192.78,204.12,213.19,213.19,,464.93,1
Carol Anne Abbott,F,SBD,Raw,Teen 18-19,70.31,75,,,,,,,,,,,,,,,NS
Amanda Etheridge,F,SBD,Raw,Teen 18-19,68.95,75,70.31,74.84,,74.84,43.09,47.63,49.9,49.9,122.47,129.27,136.08,136.08,,260.82,1
Rashad Mercer,M,SBD,Raw,Teen 16-17,74.84,75,102.06,106.59,120.2,120.2,90.72,102.06,,102.06,,,,,,,DQ
Dan Ianetta,M,SBD,Raw,Teen 16-17,74.84,75,,,,,,,92.99,92.99,127.01,129.27,,129.27,,,DQ
John Santuro,M,SBD,Raw,Teen 16-17,70.31,75,108.86,115.67,,115.67,61.23,63.5,70.31,70.31,151.95,165.56,,165.56,,351.53,5
Kelvin Moore,M,SBD,Raw,Teen 16-17,71.21,75,102.06,106.59,120.2,120.2,104.33,111.13,,111.13,102.06,113.4,136.08,136.08,,367.41,4
Ricky Hodges,M,SBD,Raw,Teen 16-17,68.04,75,111.13,115.67,120.2,120.2,79.38,,,79.38,179.17,185.97,,185.97,,385.55,3
Ed Molesky,M,SBD,Raw,Teen 16-17,74.84,75,124.74,129.27,,129.27,79.38,83.91,88.45,88.45,179.17,185.97,195.04,195.04,,412.77,2
Shea Kirkwood,M,SBD,Raw,Teen 16-17,74.84,75,142.88,156.49,165.56,165.56,83.91,88.45,,88.45,210.92,217.72,226.8,226.8,,480.81,1
Donavan Hill,M,SBD,Raw,Teen 18-19,72.12,75,102.06,108.86,120.2,120.2,108.86,122.47,,122.47,102.06,124.74,147.42,147.42,,390.09,3
Chris Larson #2,M,SBD,Raw,Teen 18-19,73.03,75,129.27,133.81,,133.81,88.45,92.99,,92.99,174.63,183.7,,183.7,,410.5,2
David Jones #2,M,SBD,Raw,Teen 18-19,74.84,75,156.49,165.56,172.37,172.37,111.13,,,111.13,183.7,188.24,192.78,192.78,,476.27,1
Brittany Sykes,F,SBD,Raw,Teen 12-13,76.66,82.5,,,,,,38.56,,38.56,61.23,77.11,,77.11,,,DQ
Greg Nuckols,M,SBD,Raw,Teen 14-15,81.19,82.5,174.63,183.7,,183.7,124.74,131.54,136.08,136.08,206.38,215.46,226.8,226.8,,546.58,1
Tyrone Hall,M,SBD,Raw,Teen 16-17,79.38,82.5,,,,,115.67,117.93,120.2,120.2,,,,,,,DQ
Jerome Wilson,M,SBD,Raw,Teen 16-17,78.02,82.5,,115.67,,115.67,,,,,102.06,124.74,,124.74,,,DQ
Tyler Gray #5,M,SBD,Raw,Teen 16-17,81.19,82.5,,,,,102.06,,,102.06,142.88,,,142.88,,,DQ
Ryan Horton #2,M,SBD,Raw,Teen 16-17,79.38,82.5,111.13,124.74,129.27,129.27,92.99,99.79,,99.79,174.63,179.17,,179.17,,408.23,1
Domonique Simmons,M,SBD,Raw,Teen 18-19,78.02,82.5,161.03,179.17,,179.17,95.25,97.52,102.06,102.06,170.1,179.17,,179.17,,460.4,1
Brynson Barnes,M,SBD,Raw,Teen 14-15,85.73,90,102.06,,,102.06,90.72,95.25,102.06,102.06,115.67,142.88,,142.88,,347,1
Carlos Basnight,M,SBD,Raw,Teen 16-17,82.55,90,,,102.06,102.06,54.43,61.23,,61.23,,,,,,,DQ
Don Magrini,M,SBD,Raw,Teen 16-17,89.81,90,113.4,,,113.4,90.72,97.52,102.06,102.06,,,,,,,DQ
TJ Adams,M,SBD,Raw,Teen 16-17,89.36,90,,,,,81.65,88.45,,88.45,142.88,158.76,174.63,174.63,,,DQ
Andre Moore,M,SBD,Raw,Teen 16-17,89.81,90,,104.33,,104.33,,92.99,99.79,99.79,102.06,115.67,142.88,142.88,,347,2
Jamie Wheeler,M,SBD,Raw,Teen 16-17,88.45,90,124.74,133.81,,133.81,97.52,99.79,102.06,102.06,145.15,158.76,,158.76,,394.63,1
Jeremy Sutton,M,SBD,Raw,Teen 18-19,89.81,90,61.23,70.31,,70.31,,68.04,,68.04,90.72,115.67,,115.67,,254.01,3
Eric Appleton,M,SBD,Raw,Teen 18-19,84.82,90,102.06,113.4,129.27,129.27,102.06,111.13,,111.13,102.06,142.88,158.76,158.76,,399.16,2
Brandon McElroy,M,SBD,Raw,Teen 18-19,88.45,90,136.08,,,136.08,83.91,88.45,95.25,95.25,210.92,219.99,226.8,226.8,231.33,458.13,1
Danielle Spencer,F,SBD,Raw,Teen 14-15,93.89,90+,,,,,,40.82,,40.82,61.23,83.91,102.06,102.06,,,DQ
Khairy Williams,M,SBD,Raw,Teen 14-15,97.52,100,90.72,95.25,102.06,102.06,95.25,111.13,117.93,117.93,102.06,115.67,120.2,120.2,,340.19,4
James Basnight,M,SBD,Raw,Teen 14-15,93.89,100,102.06,124.74,136.08,136.08,61.23,68.04,,68.04,102.06,142.88,,142.88,,347,3
Ryan Nicastro,M,SBD,Raw,Teen 14-15,93.89,100,86.18,97.52,108.86,108.86,68.04,77.11,83.91,83.91,136.08,142.88,158.76,158.76,,351.53,2
Cullen OBrian,M,SBD,Raw,Teen 14-15,97.52,100,102.06,122.47,136.08,136.08,81.65,,,81.65,102.06,142.88,161.03,161.03,,378.75,1
Justin Thompson,M,SBD,Raw,Teen 16-17,91.63,100,102.06,106.59,,106.59,,65.77,70.31,70.31,136.08,145.15,151.95,151.95,,328.85,2
DeShawn Bright,M,SBD,Raw,Teen 16-17,93.89,100,120.2,,,120.2,92.99,,,92.99,156.49,,,156.49,,369.68,1
Bailey White #2,M,SBD,Raw,Teen 16-17,102.06,110,,,102.06,102.06,90.72,99.79,,99.79,,102.06,,102.06,,303.91,3
Delton Brown,M,SBD,Raw,Teen 16-17,108.86,110,,,102.06,102.06,147.42,,,147.42,102.06,136.08,183.7,183.7,,433.18,2
Danny Harris,M,SBD,Raw,Teen 16-17,104.33,110,142.88,156.49,170.1,170.1,115.67,124.74,,124.74,174.63,179.17,183.7,183.7,,478.54,1
Cordero Riddick,M,SBD,Raw,Teen 18-19,102.06,110,102.06,142.88,,142.88,108.86,117.93,,117.93,102.06,142.88,183.7,183.7,,444.52,2
Ben Hopkins,M,SBD,Raw,Teen 18-19,103.42,110,174.63,190.51,204.12,204.12,165.56,174.63,183.7,183.7,204.12,,226.8,226.8,,614.62,1
Denvel Sutton,M,SBD,Raw,Teen 14-15,115.67,125,142.88,174.63,,174.63,86.18,95.25,108.86,108.86,102.06,145.15,170.1,170.1,,453.59,1
Demarco McNeil,M,SBD,Raw,Teen 16-17,115.67,125,,,,,,115.67,,115.67,102.06,142.88,147.42,147.42,,,DQ
Darius Boyce,M,SBD,Raw,Teen 16-17,115.67,125,102.06,,,102.06,120.2,124.74,,124.74,115.67,142.88,145.15,145.15,,371.95,5
Chester Urbanske-Donnelly,M,SBD,Raw,Teen 16-17,113.4,125,,,102.06,102.06,113.4,127.01,,127.01,102.06,142.88,,142.88,,371.95,4
Cort Johnson,M,SBD,Raw,Teen 16-17,115.67,125,142.88,156.49,,156.49,102.06,,,102.06,170.1,190.51,197.31,197.31,,455.86,3
Cameron Gorham,M,SBD,Raw,Teen 16-17,111.13,125,113.4,142.88,181.44,181.44,,161.03,,161.03,138.35,158.76,185.97,185.97,,528.44,2
Kwaime Garrett,M,SBD,Raw,Teen 16-17,116.57,125,,190.51,199.58,199.58,111.13,115.67,,115.67,210.92,219.99,226.8,226.8,231.33,542.04,1
William Gurganus,M,SBD,Raw,Teen 18-19,121.11,125,142.88,158.76,181.44,181.44,88.45,102.06,111.13,111.13,181.44,204.12,226.8,226.8,,519.36,1
Shytazz Baines,M,SBD,Raw,Teen 16-17,131.54,140,,102.06,,102.06,113.4,129.27,138.35,138.35,102.06,145.15,149.69,149.69,,390.09,1
William Richardson,M,SBD,Raw,Teen 18-19,132,140,111.13,,,111.13,79.38,,,79.38,197.31,,,197.31,,387.82,2
Michael McConville,M,SBD,Raw,Teen 18-19,127.01,140,174.63,188.24,199.58,199.58,124.74,136.08,,136.08,233.6,260.82,,260.82,,596.47,1
Kwansah Ackah,M,B,Raw,Open,72.57,75,,,,,161.03,179.17,183.7,183.7,,,,,,183.7,G
Donald Owens,M,B,Raw,Open,117.93,125,,,,,192.78,208.65,,208.65,,,,,,208.65,G
