Place,Name,Division,Sex,BirthDate,Age,Equipment,BodyweightKg,WeightClassKg,Squat1Kg,Squat2Kg,Squat3Kg,Best3SquatKg,Bench1Kg,Bench2Kg,Bench3Kg,Best3BenchKg,Deadlift1Kg,Deadlift2Kg,Deadlift3Kg,Best3DeadliftKg,TotalKg,Event
1,Emily Bullock,F_OR_ABPU,F,1987-11-05,34,Raw,47.8,48,85,90,95,95,45,-47.5,47.5,47.5,115,122.5,-130,122.5,265,SBD
1,Bringsty Edwards,F_OR_ABPU,F,1990-02-27,,Raw,90,90,125,135,145,145,70,75,80,80,145,160,170,170,395,SBD
1,Paige Harris,F_JCR_ABPU,F,1998-12-02,23,Wraps,59.3,60,90,100,-110,100,50,55,-60,55,100,105,-110,105,260,SBD
1,Megan Davies,F_JCR_ABPU,F,2001-12-22,20,Wraps,71.9,75,75,80,85,85,35,37.5,-42.5,37.5,95,100,-110,100,222.5,SBD
1,Amanda Gisby,F_MCR_1_ABPU,F,1981-12-14,40,Wraps,62.9,67.5,140,150,157.5,157.5,55,60,65,65,150,160,165,165,387.5,SBD
1,Angie Stevens,F_MCR_2_ABPU,F,1975-12-08,,Wraps,63.7,67.5,90,-95,95,95,50,55,-60,55,110,120,-130,120,270,SBD
1,Shan Passmore,F_MCR_3_BPU,F,1970-11-05,51,Wraps,66.6,67.5,125,135,145,145,65,70,-75,70,145,155,165,165,380,SBD
1,Julie Green #1,F_MCR_3_ABPU,F,1968-02-12,54,Wraps,105.9,110,-120,-125,125,125,55,60,70,70,120,130,140,140,335,SBD
1,Zowie Trevena,F_OCR_ABPU,F,1982-02-23,39,Wraps,61.9,67.5,122.5,-130,-130,122.5,-55,55,60,60,122.5,130,135,135,317.5,SBD
2,Jodie-Lee Price,F_OCR_ABPU,F,1990-08-09,31,Wraps,67.3,67.5,95,-105,107.5,107.5,57.5,60,-62.5,60,115,125,132.5,132.5,300,SBD
3,Hope Vaughan Hughes,F_OCR_ABPU,F,1995-08-05,26,Wraps,65.4,67.5,90,100,-110,100,47.5,50,-52.5,50,115,122.5,130,130,280,SBD
1,Natalie O'Shea,F_OCR_BPU,F,1986-10-09,35,Wraps,75,75,170,185,202.5,202.5,102.5,112.5,-115,112.5,190,205,,205,520,SBD
1,Lana Thomas Hey,F_OCR_BPU,F,1984-07-11,37,Wraps,87.9,90,152.5,162.5,172.5,172.5,97.5,105,107.5,107.5,180,190,,190,470,SBD
1,Victoria Eades,F_OCR_ABPU,F,1991-05-29,30,Wraps,89.6,90,167.5,-185,-185,167.5,70,75,-80,75,150,160,,160,402.5,SBD
1,Sarah Wells #3,F_OCR_BPU,F,1983-07-03,38,Wraps,109,110,125,137.5,150,150,67.5,75,80,80,155,170,180,180,410,SBD
1,Abbie Matthews,F_OR_ABPU,F,1991-01-06,31,Raw,143.1,110+,135,145,155,155,75,80,87.5,87.5,125,137.5,-150,137.5,380,SBD
1,Lissy Trevena,F_TCR_2_ABPU,F,2004-10-03,17,Wraps,55.8,56,65,75,90,90,30,35,40,40,80,90,100,100,230,SBD
DQ,Jodie Davies,F_OEM_ABPU,F,1996-01-18,26,Multi-ply,49.5,52,-165,-165,-175,,,,,,,,,,,SBD
1,Marie-Anne Thomas,F_OR_BPU,F,1985-11-05,36,Raw,77.6,82.5,,,,,,,,,145,,,145,145,D
1,Holly Harrison,F_OR_ABPU,F,1995-12-29,26,Raw,83,90,,,,,,,,,130,-135,-135,130,130,D
1,Adam Gasson,M_MR_1_ABPU,M,1980-09-16,41,Raw,89.2,90,180,195,210,210,135,-145,-145,135,240,260,-270,260,605,SBD
2,Neil Keddy,M_MR_1_ABPU,M,1977-11-03,44,Raw,87.5,90,150,160,-170,160,110,120,-130,120,-180,180,,180,460,SBD
1,Dean Davies,M_MR_1_ABPU,M,1981-08-01,40,Raw,124.5,125,-140,140,150,150,90,95,-100,95,190,200,205,205,450,SBD
1,Jordan Lee Thomas,M_JCR_ABPU,M,2001-09-17,20,Wraps,80.9,82.5,205,215,225,225,125,132.5,-140,132.5,200,220,-240,220,577.5,SBD
1,Thomas Carpenter Rich,M_JCR_BPU,M,2000-11-25,21,Wraps,98.2,100,215,230,245,245,125,135,145,145,-265,285,-307.5,285,675,SBD
1,Tyler White #1,M_JCR_ABPU,M,1999-01-03,23,Wraps,101.9,110,230,250,260,260,130,140,-150,140,250,260,-270,260,660,SBD
1,John Charles Samuel,M_JCR_ABPU,M,1998-08-07,23,Wraps,164.4,140+,-170,190,-210,190,-110,-120,120,120,200,-230,,200,510,SBD
1,Jason Pearson #2,M_MCR_1_ABPU,M,1980-08-28,41,Wraps,59.7,60,120,-130,-130,120,70,75,-80,75,125,130,135,135,330,SBD
1,Gavin Cronin,M_MCR_1_BPU,M,1981-10-16,40,Wraps,82.1,82.5,150,160,175,175,110,117.5,-125,117.5,165,170,-180,170,462.5,SBD
1,Keith Evans #1,M_MCR_1_BPU,M,1978-03-04,43,Wraps,100,100,240,250,-260,250,185,-190,-190,185,220,230,-250,230,665,SBD
1,Michael Fidarb,M_MCR_3_ABPU,M,1970-06-29,,Wraps,121.4,125,160,180,,180,110,120,130,130,220,240,265,265,575,SBD
1,Dan Hookway,M_OCR_BPU,M,1989-07-13,32,Wraps,82.5,82.5,240,260,272.5,272.5,145,152.5,157.5,157.5,240,260,272.5,272.5,702.5,SBD
1,Richard Crisp,M_OR_ABPU,M,1994-12-23,27,Raw,82.5,82.5,190,205,215,215,120,135,-150,135,220,-240,-240,220,570,SBD
1,Ivan Gredi,M_OCR_ABPU,M,1994-08-24,27,Wraps,82,82.5,150,175,-185,175,-100,100,-115,100,180,-205,-205,180,455,SBD
2,Marit Dekker,M_OCR_ABPU,M,1985-12-19,36,Wraps,82,82.5,90,97.5,102.5,102.5,65,70,-77.5,70,130,140,145,145,317.5,SBD
1,Dewi Evans,M_OCR_ABPU,M,1985-04-20,36,Wraps,88.6,90,180,200,220,220,120,130,-135,130,200,220,-230,220,570,SBD
DQ,David Todd #1,M_OCR_BPU,M,1983-03-24,38,Wraps,90,90,265,285,-305,285,155,-165,,155,-265,,,,,SBD
1,Kyle Rossiter,M_OCR_BPU,M,1991-09-04,30,Wraps,94.3,100,240,255,270,270,150,155,160,160,250,265,280,280,710,SBD
1,Benjamin Jenkins,M_OCR_ABPU,M,1995-09-29,26,Wraps,98.7,100,245,260,265,265,135,145,-152.5,145,250,270,-280,270,680,SBD
1,Doug Arnold #1,M_OCR_ABPU,M,1987-01-07,35,Wraps,107.2,110,277.5,305,-310,305,140,150,-155,150,290,305,-325,305,760,SBD
1,Conor Neilly,M_OCR_BPU,M,1992-01-04,30,Wraps,105.7,110,240,265,275,275,145,155,-162.5,155,270,285,-295,285,715,SBD
2,Sam Dawkins,M_OCR_BPU,M,1994-09-15,27,Wraps,101.7,110,240,255,-272.5,255,150,165,-172.5,165,240,265,272.5,272.5,692.5,SBD
2,Chris Brown #2,M_OCR_ABPU,M,1983-08-09,38,Wraps,107.4,110,240,-260,-260,240,160,-170,-170,160,240,260,-290,260,660,SBD
3,Owen Lawrence,M_OCR_ABPU,M,1988-05-14,33,Wraps,109.7,110,210,225,240,240,135,142.5,-150,142.5,230,240,250,250,632.5,SBD
DQ,Josh Black #3,M_OCR_ABPU,M,1989-12-05,32,Wraps,122.9,125,-310,,,,-165,,,,-255,,,,,SBD
1,Matt Diamond,M_OCR_BPU,M,1989-09-23,32,Wraps,177.6,140+,310,320,330,330,160,170,-180,170,-280,280,-300,280,780,SBD
1,Gregory Pearson,M_TCR_1_ABPU,M,2007-11-06,14,Wraps,59.7,60,167.5,177.5,182.5,182.5,100,105,-110,105,180,190,195,195,482.5,SBD
1,Adrian Phillips,M_MES_4_ABPU,M,1964-01-31,58,Single-ply,104,110,205,220,-227.5,220,140,145,-150,145,220,230,235,235,600,SBD
1,Luke Litchfield,M_OEM_BPU,M,1986-04-25,35,Multi-ply,99.9,100,300,320,330,330,225,245,,245,180,205,225,225,800,SBD
1,Richard Green #2,M_MR_4_ABPU,M,1966-07-19,55,Raw,116.7,125,,,,,,,,,220,230,237.5,237.5,237.5,D
1,Shane Roberts,M_OR_ABPU,M,1988-02-23,33,Raw,158.2,140+,,,,,,,,,200,215,230,230,230,D
