Division,WeightClassKg,Place,Name,Team,BodyweightKg,Best3SquatKg,Best3BenchKg,Best3DeadliftKg,TotalKg,Equipment,Event,Sex
Boys,51.71,1,Edward Hernandez,Eldorado,50.35,127.01,58.97,113.4,299.37,Single-ply,SBD,M
Boys,51.71,2,Pj Horton,Forsan,51.26,122.47,58.97,113.4,294.84,Single-ply,SBD,M
Boys,51.71,3,Kobe Roberson,Big Lake Reagan County,49.44,92.99,45.36,81.65,219.99,Single-ply,SBD,M
Boys,51.71,4,Connor Steele,Forsan,44,61.23,34.02,70.31,165.56,Single-ply,SBD,M
Boys,55.79,1,Mario Manquero,Garden City,54.43,102.06,61.23,117.93,281.23,Single-ply,SBD,M
Boys,55.79,2,Bailey Espinoza,Eldorado,55.34,90.72,58.97,106.59,256.28,Single-ply,SBD,M
Boys,55.79,3,Damian Cate,Coahoma,53.98,95.25,49.9,102.06,247.21,Single-ply,SBD,M
Boys,59.87,1,Austin Martinez,Mertzon Irion County,57.15,163.29,92.99,158.76,415.04,Single-ply,SBD,M
Boys,59.87,2,Luis Marquez,Big Lake Reagan County,58.06,111.13,74.84,120.2,306.17,Single-ply,SBD,M
Boys,59.87,3,Christian Jimenez,McCamey,58.97,74.84,31.75,68.04,174.63,Single-ply,SBD,M
Boys,67.13,1,Tim Davila,Forsan,63.96,163.29,79.38,172.37,415.04,Single-ply,SBD,M
Boys,67.13,2,Jeremy Curtis,Mertzon Irion County,67.13,165.56,79.38,170.1,415.04,Single-ply,SBD,M
Boys,67.13,3,Juan Marquez,Big Lake Reagan County,62.6,129.27,70.31,145.15,344.73,Single-ply,SBD,M
Boys,67.13,4,Mark Martinez,Mertzon Irion County,64.86,120.2,68.04,136.08,324.32,Single-ply,SBD,M
Boys,67.13,5,Colton Belew,Garden City,62.14,136.08,72.57,111.13,319.78,Single-ply,SBD,M
Boys,67.13,6,Polo Morin,Forsan,64.86,113.4,58.97,142.88,315.25,Single-ply,SBD,M
Boys,67.13,7,Dustin Wright,Forsan,65.32,108.86,61.23,142.88,312.98,Single-ply,SBD,M
Boys,67.13,8,Austin Grantham,Forsan,65.77,106.59,72.57,129.27,308.44,Single-ply,SBD,M
Boys,67.13,9,Phillip Tinner,McCamey,63.96,115.67,52.16,115.67,283.5,Single-ply,SBD,M
Boys,67.13,10,Julian Uranga,Coahoma,60.33,88.45,58.97,124.74,272.16,Single-ply,SBD,M
Boys,67.13,11,Jacob Ludwig,Colorado City Colorado,60.78,97.52,49.9,124.74,272.16,Single-ply,SBD,M
Boys,67.13,DQ,Daniel Perez,McCamey,65.77,142.88,,,,Single-ply,SBD,M
Boys,74.84,1,Jorge Castillo,Rankin,74.39,190.51,136.08,199.58,526.17,Single-ply,SBD,M
Boys,74.84,2,Justin Coker,Coahoma,70.76,181.44,122.47,204.12,508.02,Single-ply,SBD,M
Boys,74.84,3,Zane Herrin,Forsan,74.84,176.9,79.38,201.85,458.13,Single-ply,SBD,M
Boys,74.84,4,Fernando Saucedo,Big Lake Reagan County,73.94,165.56,90.72,165.56,421.84,Single-ply,SBD,M
Boys,74.84,5,Jj Casarez,McCamey,73.48,142.88,97.52,149.69,390.09,Single-ply,SBD,M
Boys,74.84,6,Shawn Walker,Garden City,72.57,129.27,72.57,136.08,337.93,Single-ply,SBD,M
Boys,74.84,7,Jose Martinez,Eldorado,70.76,113.4,77.11,129.27,319.78,Single-ply,SBD,M
Boys,74.84,8,Philip Rader,Mertzon Irion County,73.03,113.4,63.5,136.08,312.98,Single-ply,SBD,M
Boys,74.84,9,Nathan Jackson #3,Colorado City Colorado,73.03,124.74,111.13,,235.87,Single-ply,SB,M
Boys,74.84,DQ,Mark Henderson,Colorado City Colorado,68.04,142.88,,,,Single-ply,SB,M
Boys,74.84,DQ,Chapman Royall,Garden City,69.85,97.52,,,,Single-ply,SB,M
Boys,82.1,1,Ryan Thomas,Rankin,81.19,181.44,111.13,183.7,476.27,Single-ply,SBD,M
Boys,82.1,2,Peyton Rodriguez,Coahoma,79.38,161.03,122.47,181.44,464.93,Single-ply,SBD,M
Boys,82.1,3,Foster Burchett,Forsan,77.11,158.76,79.38,179.17,417.3,Single-ply,SBD,M
Boys,82.1,4,Hector Reyes,Eldorado,81.65,131.54,77.11,161.03,369.68,Single-ply,SBD,M
Boys,82.1,5,Jimmy Cruz,Coahoma,78.93,136.08,83.91,147.42,367.41,Single-ply,SBD,M
Boys,82.1,6,Ruben Mier,Garden City,77.11,102.06,74.84,165.56,342.46,Single-ply,SBD,M
Boys,82.1,7,Alex Hernandez #17,Colorado City Colorado,78.02,131.54,83.91,124.74,340.19,Single-ply,SBD,M
Boys,82.1,8,Pedro Ybarra,McCamey,81.19,113.4,61.23,120.2,294.84,Single-ply,SBD,M
Boys,89.81,1,Ramiro Reyes,Colorado City Colorado,88.9,208.65,156.49,197.31,562.45,Single-ply,SBD,M
Boys,89.81,2,Miles Mikeska,Eldorado,86.18,158.76,117.93,226.8,503.49,Single-ply,SBD,M
Boys,89.81,3,Chris Mims,Forsan,87.54,158.76,90.72,170.1,419.57,Single-ply,SBD,M
Boys,89.81,4,Matt Garcia,Mertzon Irion County,86.18,147.42,104.33,158.76,410.5,Single-ply,SBD,M
Boys,89.81,5,Will McKinney #2,Colorado City Colorado,83.46,136.08,97.52,158.76,392.36,Single-ply,SBD,M
Boys,89.81,6,Jonathan Young,Garden City,88.9,147.42,74.84,165.56,387.82,Single-ply,SBD,M
Boys,89.81,DQ,Miguel Lopez #5,Big Lake Reagan County,87.54,195.04,,,,Single-ply,SBD,M
Boys,99.79,1,Josh Jurecek,Eldorado,97.52,170.1,99.79,190.51,460.4,Single-ply,SBD,M
Boys,99.79,2,Austin Davidson,Mertzon Irion County,93.89,161.03,90.72,163.29,415.04,Single-ply,SBD,M
Boys,99.79,3,Ausden Medrano,Forsan,94.8,149.69,92.99,149.69,392.36,Single-ply,SBD,M
Boys,99.79,4,Brian Cravens,Coahoma,91.63,102.06,74.84,131.54,308.44,Single-ply,SBD,M
Boys,99.79,5,Curtis Sharp,Crane,95.25,111.13,74.84,113.4,299.37,Single-ply,SBD,M
Boys,99.79,6,Douglas Pilkington,Coahoma,98.43,74.84,61.23,74.84,210.92,Single-ply,SBD,M
Boys,109.77,1,Anthony Mata,Eldorado,101.6,192.78,120.2,195.04,508.02,Single-ply,SBD,M
Boys,109.77,2,Angel Aguilera,Big Lake Reagan County,106.14,185.97,106.59,158.76,451.32,Single-ply,SBD,M
Boys,109.77,3,Jacob Anderson,Crane,102.51,145.15,117.93,172.37,435.45,Single-ply,SBD,M
Boys,109.77,4,Blaise Coffman,Forsan,107.5,167.83,86.18,176.9,430.91,Single-ply,SBD,M
Boys,109.77,5,Copeland Riddell,Forsan,102.06,142.88,79.38,172.37,394.63,Single-ply,SBD,M
Boys,109.77,6,Derek Means,Crane,108.86,149.69,92.99,145.15,387.82,Single-ply,SBD,M
Boys,109.77,DQ,Rudy Brito,Coahoma,103.42,163.29,,,,Single-ply,SBD,M
Boys,124.74,1,JR Martinez,Eldorado,119.75,210.92,111.13,210.92,532.97,Single-ply,SBD,M
Boys,124.74,2,Caleb Wrinkle,Rankin,117.03,181.44,102.06,213.19,496.68,Single-ply,SBD,M
Boys,124.74,3,Eric Estrada,Eldorado,110.68,176.9,127.01,190.51,494.42,Single-ply,SBD,M
Boys,124.74,4,Dustin Fontana,Coahoma,111.58,167.83,113.4,181.44,462.66,Single-ply,SBD,M
Boys,124.74,5,David Mejia,Coahoma,114.31,145.15,79.38,158.76,383.29,Single-ply,SBD,M
Boys,124.74,6,Damien Venegas,McCamey,124.74,124.74,74.84,136.08,335.66,Single-ply,SBD,M
Boys,124.74,7,Hardy Berber,Colorado City Colorado,111.58,111.13,79.38,129.27,319.78,Single-ply,SBD,M
Boys,124.74,8,Frankie Mier,Garden City,119.75,104.33,77.11,133.81,315.25,Single-ply,SBD,M
Boys,124.74+,1,John Espinosa,Eldorado,146.06,199.58,136.08,185.97,521.63,Single-ply,SBD,M
Boys,124.74+,2,Tony Flores,Big Lake Reagan County,126.55,181.44,102.06,176.9,460.4,Single-ply,SBD,M
Boys,124.74+,3,Mike Villareal,Coahoma,156.94,188.24,92.99,176.9,458.13,Single-ply,SBD,M
Boys,124.74+,4,Aj Coronado,Colorado City Colorado,140.16,161.03,97.52,151.95,410.5,Single-ply,SBD,M
