Name,Age,WeightClassKg,Division,Sex,Best3SquatKg,Best3BenchKg,Best3DeadliftKg,TotalKg,Event,Equipment,Place
Ernesto Milian,,60,Open,M,208.65,117.93,249.48,576.06,SBD,Single-ply,1
Tony Conyers,,67.5,Open,M,240.4,176.9,263.08,680.39,SBD,Single-ply,1
Sherman Johnson,,67.5,Open,M,190.51,142.88,238.14,571.53,SBD,Single-ply,2
Tim Donovan,,67.5,Open,M,206.38,147.42,206.38,560.19,SBD,Single-ply,3
Steve Snell #2,,75,Open,M,235.87,147.42,251.74,635.03,SBD,Single-ply,1
Luis Soto #1,,82.5,Open,M,276.69,174.63,285.76,737.09,SBD,Single-ply,1
M. Barguara,,82.5,Open,M,283.5,179.17,263.08,725.75,SBD,Single-ply,2
O. Chavez,,82.5,Open,M,226.8,190.51,263.08,680.39,SBD,Single-ply,3
W. Curbello,,82.5,Open,M,229.06,165.56,240.4,635.03,SBD,Single-ply,4
S. Viera,,82.5,Open,M,224.53,136.08,260.82,621.42,SBD,Single-ply,5
Omar Lomba,,90,Open,M,285.76,201.85,308.44,796.06,SBD,Single-ply,1
Paul Mustakas,,90,Open,M,281.23,190.51,308.44,780.18,SBD,Single-ply,2
Virgil Diaz,23,90,Open,M,288.03,167.83,260.82,716.68,SBD,Single-ply,3
John Castro,,100,Open,M,272.16,190.51,290.3,752.96,SBD,Single-ply,1
J. Rio,,100,Open,M,272.16,172.37,260.82,705.34,SBD,Single-ply,2
D. Ames,,110,Open,M,292.57,208.65,272.16,773.38,SBD,Single-ply,1
Robert Palmer #3,,110,Open,M,283.5,190.51,285.76,759.77,SBD,Single-ply,2
Jorge Garcia,,125,Open,M,317.52,233.6,317.52,868.63,SBD,Single-ply,1
F. Zocchi,,125,Open,M,294.84,226.8,294.84,816.47,SBD,Single-ply,2
Mary Dorman,,,Class II & Below,F,127.01,72.57,147.42,347,SBD,Single-ply,1
Cathy Roydhouse,,,Class II & Below,F,83.91,47.63,120.2,251.74,SBD,Single-ply,2
K. Bravton,,,Class II & Below,F,104.33,56.7,117.93,278.96,SBD,Single-ply,3
Annie Walden,,,Class II & Below,F,97.52,49.9,90.72,238.14,SBD,Single-ply,4
L. Roberts,,,Class II & Below,F,49.9,29.48,61.24,140.61,SBD,Single-ply,5
Lea Vaillancourt,,,Class II & Above,F,115.67,74.84,158.76,349.27,SBD,Single-ply,1
Kim Besuden,,,Class II & Above,F,138.35,65.77,156.49,360.61,SBD,Single-ply,2
I. Batz,,,Class II & Above,F,138.35,77.11,167.83,383.29,SBD,Single-ply,3
Carol Fisher,,,Class II & Above,F,113.4,56.7,138.35,308.44,SBD,Single-ply,4
Sandra Sims,,,Class II & Above,F,108.86,63.5,136.08,308.44,SBD,Single-ply,5
S. Perez,,52,Class II & Below,M,131.54,79.38,151.95,362.87,SBD,Single-ply,1
E. Perez III,,52,Class II & Below,M,106.59,79.38,149.69,335.66,SBD,Single-ply,2
T. Antorino,,56,Class II & Below,M,124.74,108.86,167.83,401.43,SBD,Single-ply,1
S. Osman,,56,Class II & Below,M,117.93,92.99,165.56,376.48,SBD,Single-ply,2
John Perez #4,,56,Class II & Below,M,129.27,68.04,120.2,317.52,SBD,Single-ply,3
R. Rosales,,60,Class II & Below,M,145.15,92.99,154.22,392.36,SBD,Single-ply,1
H. Nelson,,60,Class II & Below,M,113.4,113.4,149.69,376.48,SBD,Single-ply,3
T. Morabito,,60,Class II & Below,M,124.74,127.01,158.76,410.5,SBD,Single-ply,2
Tom Small,,67.5,Class II & Below,M,190.51,99.79,204.12,494.42,SBD,Single-ply,1
Ray Perez #3,,67.5,Class II & Below,M,181.44,122.47,188.24,492.15,SBD,Single-ply,2
Rick Hartzog,,67.5,Class II & Below,M,154.22,108.86,195.04,458.13,SBD,Single-ply,3
W. Flores,,67.5,Class II & Below,M,142.88,124.74,176.9,444.52,SBD,Single-ply,4
Al Lane,,67.5,Class II & Below,M,158.76,104.33,181.44,444.52,SBD,Single-ply,5
D. Jones,,67.5,Class II & Below,M,145.15,97.52,195.04,437.72,SBD,Single-ply,6
J. Hernandez,,67.5,Class II & Below,M,151.95,88.45,195.04,435.45,SBD,Single-ply,7
D. Montford,,67.5,Class II & Below,M,120.2,108.86,190.51,419.57,SBD,Single-ply,8
Dan Crowe #1,,67.5,Class II & Below,M,149.69,77.11,170.1,396.89,SBD,Single-ply,9
D. Harrow,,67.5,Class II & Below,M,117.93,106.59,151.95,376.48,SBD,Single-ply,10
Kelley Collier,,75,Class II & Below,M,219.99,127.01,247.21,594.21,SBD,Single-ply,1
E. Smith,,75,Class II & Below,M,201.85,142.88,242.67,587.4,SBD,Single-ply,2
William Vargas,,75,Class II & Below,M,215.46,122.47,206.38,544.31,SBD,Single-ply,3
C. Lov,,75,Class II & Below,M,183.71,113.4,226.8,523.9,SBD,Single-ply,4
P. Ragano,,75,Class II & Below,M,172.37,111.13,192.78,476.27,SBD,Single-ply,5
J. Meade,,75,Class II & Below,M,156.49,108.86,195.04,460.4,SBD,Single-ply,6
M. Rosenblum,,75,Class II & Below,M,90.72,79.38,161.03,331.12,SBD,Single-ply,7
B. Onan,,75,Class II & Below,M,102.06,65.77,158.76,326.59,SBD,Single-ply,8
Robin Stockton,,82.5,Class II & Below,M,226.8,133.81,242.67,603.28,SBD,Single-ply,1
Joe Calandra,,82.5,Class II & Below,M,213.19,140.61,231.33,585.13,SBD,Single-ply,2
K. Dunlop,,82.5,Class II & Below,M,199.58,138.35,219.99,557.92,SBD,Single-ply,3
Mike Rizzi,,82.5,Class II & Below,M,213.19,129.27,215.46,557.92,SBD,Single-ply,4
L. Rogers,,82.5,Class II & Below,M,197.31,138.35,206.38,542.04,SBD,Single-ply,5
B. Gallo,,82.5,Class II & Below,M,215.46,127.01,190.51,532.97,SBD,Single-ply,6
E. Cavanaugh,,82.5,Class II & Below,M,181.44,122.47,217.72,521.63,SBD,Single-ply,7
C. Pecoraro,,82.5,Class II & Below,M,195.04,142.88,181.44,519.36,SBD,Single-ply,8
T. Ane,,82.5,Class II & Below,M,140.61,147.42,170.1,458.13,SBD,Single-ply,9
David Wilkinson,,90,Class II & Below,M,249.48,154.22,272.16,675.85,SBD,Single-ply,1
S. McCormack,,90,Class II & Below,M,256.28,161.03,256.28,673.59,SBD,Single-ply,2
S. Pacheco,,90,Class II & Below,M,226.8,170.1,260.82,657.71,SBD,Single-ply,3
Lee Haber,,90,Class II & Below,M,217.72,181.44,231.33,630.49,SBD,Single-ply,4
M. Foght,,90,Class II & Below,M,226.8,156.49,229.06,612.35,SBD,Single-ply,5
E. Nieves,,90,Class II & Below,M,254.01,136.08,208.65,598.74,SBD,Single-ply,6
Gary Lambert,,90,Class II & Below,M,195.04,131.54,222.26,548.85,SBD,Single-ply,7
Steve Beck,,90,Class II & Below,M,192.78,136.08,219.99,548.85,SBD,Single-ply,8
D. Heselton,,90,Class II & Below,M,195.04,117.93,206.38,519.36,SBD,Single-ply,9
Dean Eakin,,90,Class II & Below,M,190.51,120.2,204.12,514.83,SBD,Single-ply,10
K. Kurtz,,100,Class II & Below,M,263.08,170.1,272.16,705.34,SBD,Single-ply,1
M. Harrison,,100,Class II & Below,M,249.48,151.95,265.35,666.78,SBD,Single-ply,2
T. Poplawski,,100,Class II & Below,M,249.48,183.71,226.8,659.98,SBD,Single-ply,3
Louis Baltz,,100,Class II & Below,M,240.4,154.22,258.55,653.17,SBD,Single-ply,4
Tom Acker,,100,Class II & Below,M,244.94,154.22,249.48,648.64,SBD,Single-ply,5
A. Acebo,,100,Class II & Below,M,251.74,156.49,240.4,648.64,SBD,Single-ply,6
Richard Gelineau,,100,Class II & Below,M,204.12,147.42,276.69,628.23,SBD,Single-ply,7
T. Wagner,,100,Class II & Below,M,215.46,142.88,258.55,616.89,SBD,Single-ply,8
Dave Findora,,100,Class II & Below,M,204.12,174.63,226.8,605.55,SBD,Single-ply,9
P. Quartuccio,,100,Class II & Below,M,183.71,117.93,231.33,532.97,SBD,Single-ply,10
Derek Atwell,,100,Class II & Below,M,181.44,136.08,208.65,526.17,SBD,Single-ply,11
A. Acebo,,100,Class II & Below,M,174.63,120.2,185.97,480.81,SBD,Single-ply,1
R. Smith,,110,Class II & Below,M,294.84,183.71,272.16,750.7,SBD,Single-ply,2
Miles Wetzel,,110,Class II & Below,M,242.67,170.1,281.23,694,SBD,Single-ply,3
David Dallas,,110,Class II & Below,M,244.94,190.51,244.94,680.39,SBD,Single-ply,4
W. Roberts,,110,Class II & Below,M,231.33,167.83,267.62,666.78,SBD,Single-ply,5
T. Sacco,,110,Class II & Below,M,238.14,167.83,254.01,659.98,SBD,Single-ply,6
Vance German,,110,Class II & Below,M,254.01,158.76,247.21,659.98,SBD,Single-ply,7
Dan Macri,,110,Class II & Below,M,238.14,174.63,238.14,650.91,SBD,Single-ply,8
Jack Dempsey,,110,Class II & Below,M,219.99,167.83,226.8,614.62,SBD,Single-ply,9
D. Lyle,,110,Class II & Below,M,217.72,142.88,249.48,610.08,SBD,Single-ply,10
E. Sacco,,125,Class II & Below,M,317.52,192.78,306.18,816.47,SBD,Single-ply,1
Nick Reeb,,125,Class II & Below,M,272.16,208.65,278.96,759.77,SBD,Single-ply,2
D. Langworthy,,125,Class II & Below,M,265.35,183.71,263.08,712.14,SBD,Single-ply,3
J. Mederos,,125,Class II & Below,M,274.42,181.44,249.48,705.34,SBD,Single-ply,4
Garry Batson,,125,Class II & Below,M,240.4,195.04,249.48,684.93,SBD,Single-ply,5
Mark Quinn,,125,Class II & Below,M,244.94,151.95,258.55,655.44,SBD,Single-ply,6
Joe Cozza,,125,Class II & Below,M,229.06,161.03,240.4,630.49,SBD,Single-ply,7
Jerry Smith #1,,125+,Class II & Below,M,308.44,195.04,294.84,798.32,SBD,Single-ply,1
R. Delph,,125+,Class II & Below,M,254.01,163.29,281.23,698.53,SBD,Single-ply,2
W. Page,,125+,Class II & Below,M,260.82,195.04,240.4,696.27,SBD,Single-ply,3
Mark Rodberg,,125+,Class II & Below,M,226.8,129.27,204.12,560.19,SBD,Single-ply,4
Jerry Smith #1,,125+,Masters,M,308.44,195.04,294.84,798.32,SBD,Single-ply,5
W. Roberts,,110,Masters,M,231.33,167.83,267.62,666.78,SBD,Single-ply,1
William Vargas,,75,Masters,M,215.46,122.47,206.38,544.31,SBD,Single-ply,2
P. Quartuceio,,100,Masters,M,183.71,117.93,231.33,532.97,SBD,Single-ply,3
S. Perez,,52,Masters,M,131.54,79.38,151.95,362.87,SBD,Single-ply,4
M. Rosenblum,,75,Masters,M,90.72,79.38,161.03,331.12,SBD,Single-ply,5
