Division,WeightClassKg,Place,Name,Team,BodyweightKg,Best3SquatKg,Best3BenchKg,Best3DeadliftKg,TotalKg,Equipment,Event,Sex
Boys,51.71,1,Ramiro Trevinio,Laredo Nixon,51.26,140.61,79.38,151.95,371.95,Single-ply,SBD,M
Boys,51.71,2,Eddie Macias,Laredo Nixon,48.63,136.08,79.38,131.54,347,Single-ply,SBD,M
Boys,51.71,3,Rudy Sanchez,Somerset,49.44,120.2,65.77,136.08,322.05,Single-ply,SBD,M
Boys,51.71,DQ,Brandon Fernandez,Poteet,46.77,138.35,,,,Single-ply,SBD,M
Boys,55.79,1,Vynce O,Dilley,54.92,156.49,83.91,149.69,390.09,Single-ply,SBD,M
Boys,55.79,2,Eli Luna,Somerset,54.43,136.08,61.23,133.81,331.12,Single-ply,SBD,M
Boys,55.79,3,Fabian Apaez,Somerset,54.93,102.06,65.77,99.79,267.62,Single-ply,SBD,M
Boys,55.79,4,Brian Lazo,Crystal City,54.52,97.52,54.43,102.06,254.01,Single-ply,SBD,M
Boys,55.79,DQ,Silverio Mendoza,Crystal City,54.02,,,,,Single-ply,SBD,M
Boys,59.87,1,Richard Jimenez,Laredo Nixon,56.76,102.06,68.04,131.54,301.64,Single-ply,SBD,M
Boys,59.87,2,Aaron Urrutia,Del Rio,56.25,83.91,68.04,127.01,278.96,Single-ply,SBD,M
Boys,59.87,DQ,Juan Guzman,Crystal City,59.47,,,,,Single-ply,SBD,M
Boys,67.13,1,Josue Tobias,Laredo Nixon,66.74,226.8,142.88,238.14,607.81,Single-ply,SBD,M
Boys,67.13,2,Ismael Franco,Crystal City,66.04,206.38,131.54,217.72,555.65,Single-ply,SBD,M
Boys,67.13,3,Orlando Gutierrez,Crystal City,62.87,185.97,88.45,179.17,453.59,Single-ply,SBD,M
Boys,67.13,4,Anthony A,Dilley,65.35,174.63,90.72,181.44,446.79,Single-ply,SBD,M
Boys,67.13,5,Julian Rico,Somerset,60.36,161.03,97.52,161.03,419.57,Single-ply,SBD,M
Boys,67.13,6,Aaron Sanchez,Poteet,65.83,145.15,86.18,176.9,408.23,Single-ply,SBD,M
Boys,67.13,7,Garcia Antonio,Somerset,61.74,117.93,90.72,167.83,376.48,Single-ply,SBD,M
Boys,67.13,DQ,Vicente Ibarra,Crystal City,63.68,127.01,68.04,,,Single-ply,SBD,M
Boys,67.13,DQ,Paul Olveda,Crystal City,64.32,,,,,Single-ply,SBD,M
Boys,67.13,DQ,David Saenz,Crystal City,62.23,,,,,Single-ply,SBD,M
Boys,74.84,1,John Reyes #1,Pearsall,72.13,201.85,113.4,256.28,571.53,Single-ply,SBD,M
Boys,74.84,2,Roy DeLeon,Somerset,72.18,206.38,129.27,217.72,553.38,Single-ply,SBD,M
Boys,74.84,3,Eric Gonzalez #4,Carrizo Springs,74.57,195.04,108.86,210.92,514.83,Single-ply,SBD,M
Boys,74.84,4,Nick Rodriguez #1,Dilley,70.31,199.58,106.59,195.04,501.22,Single-ply,SBD,M
Boys,74.84,5,Jon Michael Lomas,Crystal City,72.12,192.78,90.72,183.7,467.2,Single-ply,SBD,M
Boys,74.84,6,Marcos Cruz,Carrizo Springs,72.59,188.24,90.72,174.63,453.59,Single-ply,SBD,M
Boys,74.84,7,Joseph Lozano,Laredo Nixon,71.73,158.76,92.99,174.63,426.38,Single-ply,SBD,M
Boys,74.84,8,Edwin Gonzalez,Laredo Nixon,71.26,154.22,83.91,172.37,410.5,Single-ply,SBD,M
Boys,74.84,9,Jose Herrerea,Somerset,73.98,113.4,86.18,163.29,362.87,Single-ply,SBD,M
Boys,74.84,DQ,Luis Perales,Carrizo Springs,74.4,,,,,Single-ply,SBD,M
Boys,74.84,DQ,Cesar Gonzalez,Somerset,69.88,199.58,,,,Single-ply,SBD,M
Boys,74.84,DQ,Alejandro Flores,Del Rio,73.48,165.56,102.06,,,Single-ply,SBD,M
Boys,74.84,DQ,Cesar Franco,Crystal City,74.21,,,,,Single-ply,SBD,M
Boys,74.84,DQ,Enrique G,Dilley,68.99,,,,,Single-ply,SBD,M
Boys,74.84,DQ,Frank Mendez,Carrizo Springs,74.41,,,,,Single-ply,SBD,M
Boys,82.1,1,Dylan Delgado,Somerset,81.66,249.48,124.74,217.72,591.94,Single-ply,SBD,M
Boys,82.1,2,Meme Moreno,Somerset,80.34,226.8,136.08,213.19,576.06,Single-ply,SBD,M
Boys,82.1,3,John Duenas,Somerset,79.84,183.7,113.4,183.7,480.81,Single-ply,SBD,M
Boys,82.1,4,Michael Gonzales,Somerset,75.33,147.42,111.13,158.76,417.3,Single-ply,SBD,M
Boys,82.1,5,Nick Padilla,Del Rio,79.83,142.88,111.13,158.76,412.77,Single-ply,SBD,M
Boys,82.1,6,Casimiro Rios,Crystal City,81.56,158.76,83.91,165.56,408.23,Single-ply,SBD,M
Boys,82.1,7,Ricardo Aguilar,Pearsall,79.42,158.76,77.11,158.76,394.63,Single-ply,SBD,M
Boys,82.1,8,Noah Escamilla,Somerset,79.83,151.95,83.91,147.42,383.29,Single-ply,SBD,M
Boys,82.1,9,Richardo Gonzalez,Del Rio,81.19,124.74,102.06,142.88,369.68,Single-ply,SBD,M
Boys,82.1,10,Fabian Diego,Del Rio,78.99,113.4,97.52,136.08,347,Single-ply,SBD,M
Boys,82.1,DQ,Juan Garcia,La Pryor,75.8,124.74,77.11,,,Single-ply,SBD,M
Boys,89.81,1,Mario Mendoza,Carrizo Springs,89.81,263.08,183.7,217.72,664.51,Single-ply,SBD,M
Boys,89.81,2,Arnold Herrera,Somerset,84.37,233.6,129.27,233.6,596.47,Single-ply,SBD,M
Boys,89.81,3,Marty T,Dilley,86.65,197.31,108.86,208.65,514.83,Single-ply,SBD,M
Boys,89.81,4,Beau M,Dilley,86.66,204.12,115.67,170.1,489.88,Single-ply,SBD,M
Boys,89.81,5,David Castro,Carrizo Springs,88.5,190.51,129.27,165.56,485.34,Single-ply,SBD,M
Boys,89.81,6,Oscar Monroy,Laredo Nixon,88.49,172.37,111.13,172.37,455.86,Single-ply,SBD,M
Boys,89.81,7,Joey Hernandez,Somerset,87.55,172.37,92.99,183.7,449.06,Single-ply,SBD,M
Boys,89.81,8,Daniel Gonzalez,Del Rio,85.78,142.88,113.4,170.1,426.38,Single-ply,SBD,M
Boys,89.81,9,Alex Luna,Crystal City,88.36,161.03,86.18,170.1,417.3,Single-ply,SBD,M
Boys,89.81,10,Mario Valdez,Laredo Nixon,83.51,149.69,95.25,163.29,408.23,Single-ply,SBD,M
Boys,89.81,DQ,Mark Nieto,Laredo Nixon,84.87,102.06,61.23,,,Single-ply,SBD,M
Boys,89.81,DQ,Cristian Rios,Crystal City,89.63,206.38,,,,Single-ply,SBD,M
Boys,89.81,DQ,Geovani Ortega,Somerset,86.21,104.33,68.04,,,Single-ply,SBD,M
Boys,99.79,1,Joseph Bueno,Somerset,94.39,256.28,127.01,242.67,625.96,Single-ply,SBD,M
Boys,99.79,2,Da'von Simmons,Crystal City,99.52,258.55,149.69,195.04,603.28,Single-ply,SBD,M
Boys,99.79,3,Tyler Crisp,Poteet,97.58,242.67,113.4,238.14,594.21,Single-ply,SBD,M
Boys,99.79,4,Mark Puente,Crystal City,98.79,224.53,149.69,183.7,557.92,Single-ply,SBD,M
Boys,99.79,5,Manuel Garcia,Somerset,96.62,226.8,104.33,190.51,521.63,Single-ply,SBD,M
Boys,99.79,6,Moses Gonzalez,Pearsall,94.83,165.56,111.13,192.78,469.47,Single-ply,SBD,M
Boys,99.79,7,Ricky Castaneda,Crystal City,92.9,172.37,108.86,179.17,460.4,Single-ply,SBD,M
Boys,99.79,8,Moses Carrasco,Poteet,90.76,190.51,83.91,181.44,455.86,Single-ply,SBD,M
Boys,99.79,9,Geronimo Flores,Somerset,97.13,181.44,81.65,181.44,444.52,Single-ply,SBD,M
Boys,99.79,10,Joe Gutierrez,Crystal City,95.35,172.37,92.99,167.83,433.18,Single-ply,SBD,M
Boys,109.77,1,Francisco Torrecille,Laredo Nixon,108.47,276.69,127.01,254.01,657.71,Single-ply,SBD,M
Boys,109.77,2,Emilio Alvarado,Crystal City,106.05,272.16,161.03,195.04,628.23,Single-ply,SBD,M
Boys,109.77,3,Joe Mendoza,Del Rio,104.78,226.8,147.42,217.72,591.94,Single-ply,SBD,M
Boys,109.77,4,Able Mendoza,Laredo Nixon,103.47,222.26,131.54,208.65,562.45,Single-ply,SBD,M
Boys,109.77,5,Dizan Rodriguez,Del Rio,100.52,210.92,133.81,204.12,548.85,Single-ply,SBD,M
Boys,109.77,6,David Arvizo,La Pryor,104.39,231.33,127.01,183.7,542.04,Single-ply,SBD,M
Boys,109.77,7,Eddie Moreno,Somerset,109.77,294.84,183.7,,478.54,Single-ply,SB,M
Boys,109.77,8,Mark Ruiz,Crystal City,103.42,170.1,97.52,190.51,458.13,Single-ply,SBD,M
Boys,109.77,9,Emilio Ceonstancio,Del Rio,102.97,165.56,90.72,163.29,419.57,Single-ply,SBD,M
Boys,109.77,10,Juan Balleza,Crystal City,106.59,172.37,77.11,158.76,408.23,Single-ply,SBD,M
Boys,109.77,11,Miguel Costilla,Del Rio,109.77,183.7,111.13,,294.84,Single-ply,SB,M
Boys,109.77,DQ,Rey Mendoza,Crystal City,107.77,244.94,,,,Single-ply,SBD,M
Boys,109.77,DQ,Anthony Alegre,Poteet,108.45,,,,,Single-ply,SBD,M
Boys,109.77,DQ,Daniel Romo,Somerset,103.47,,,,,Single-ply,SBD,M
Boys,124.74,1,James Woods,Somerset,123.84,333.39,158.76,276.69,768.84,Single-ply,SBD,M
Boys,124.74,2,Brandon Orosco,Carrizo Springs,121.63,233.6,129.27,201.85,564.72,Single-ply,SBD,M
Boys,124.74,3,Abee Hinojosa,Del Rio,123.83,208.65,113.4,206.38,528.44,Single-ply,SBD,M
Boys,124.74+,1,Joseph Rodriguez #6,Del Rio,151.95,210.92,158.76,244.94,614.62,Single-ply,SBD,M
Boys,124.74+,2,Isaiah Reyna,Somerset,137.48,249.48,90.72,210.92,551.11,Single-ply,SBD,M
Boys,124.74+,3,Ben Pagen,Poteet,162.89,172.37,106.59,181.44,460.4,Single-ply,SBD,M
Boys,,NS,Tim Carrasco,Poteet,,,,,,Single-ply,SBD,M
Boys,,NS,Juan M,Dilley,,,,,,Single-ply,SBD,M
Boys,,NS,Adriel Tovar,Poteet,,,,,,Single-ply,SBD,M
Boys,,NS,Mike Gomez,Poteet,,,,,,Single-ply,SBD,M
Boys,,NS,Carlos Romeero,Poteet,,,,,,Single-ply,SBD,M
Boys,,NS,Pierce R,Dilley,,,,,,Single-ply,SBD,M
Boys,,NS,Elijah Cuvriel,Pearsall,,,,,,Single-ply,SBD,M
Boys,,NS,Gabriel Menchaca,Pearsall,,,,,,Single-ply,SBD,M
Boys,,NS,Gabriel Martinez,Pearsall,,,,,,Single-ply,SBD,M
Boys,,NS,Blake Bently,Pearsall,,,,,,Single-ply,SBD,M
Boys,,NS,Alex Gandara,Pearsall,,,,,,Single-ply,SBD,M
Boys,,NS,Rolando Vasqez,Pearsall,,,,,,Single-ply,SBD,M
Boys,,NS,Jupe Tellez,La Pryor,,,,,,Single-ply,SBD,M
Boys,,NS,Anthony Maldonado,La Pryor,,,,,,Single-ply,SBD,M
Boys,,NS,Jorge Rojas,La Pryor,,,,,,Single-ply,SBD,M
Boys,,NS,Juan Rojas,La Pryor,,,,,,Single-ply,SBD,M
