{
  "name": "FreeID",
  "fields": [],
  "relationships": [],
  "changelogDate": "20201015210214",
  "entityTableName": "free_id",
  "dto": "no",
  "pagination": "pagination",
  "service": "serviceImpl",
  "jpaMetamodelFiltering": false,
  "fluentMethods": true,
  "readOnly": false,
  "embedded": false,
  "clientRootFolder": "",
  "applications": "*"
}
