{
    "name": "Activecampaign",
    "alias": "activecampaign",
    "description": "The CloudInfo ActiveCampaign Module.",
    "active": 1,
    "order": 100,
    "providers": [
        "Modules\\Activecampaign\\Providers\\ActiveCampaignServiceProvider",
        "Modules\\Activecampaign\\Providers\\EventServiceProvider",
        "Modules\\Activecampaign\\Providers\\RouteServiceProvider"
    ]
}
