[{
    "groupId": "101",
    "questionId": "1011",
    "content": "Ein Pferd",
    "isCorrect": false
},
{   
    "groupId": "102",
    "questionId": "1011",
    "content": "Ein Affe und ein Pferd",
    "isCorrect": false
}]