[{  
    "title": "Ilohhsionäres Kneipenquiz",
    "image":"",
    "rounds": [],
    "teams": [],
    "createdAt":{"$date":"2021-01-12T15:47:47.678Z"},
    "updatedAt":{"$date":"2021-01-12T15:47:47.678Z"}
}]