ru\tagirov\tm\repository\AbstractRepository.class
ru\tagirov\tm\entity\User.class
ru\tagirov\tm\command\adminCommand\AdminRemoveToUserCommand.class
ru\tagirov\tm\service\impl\ProjectService.class
ru\tagirov\tm\command\projectCommand\ProjectRemoveCommand.class
ru\tagirov\tm\command\taskCommand\TaskClearToProjectCommand.class
ru\tagirov\tm\command\allCommand\AboutCommand.class
ru\tagirov\tm\repository\impl\ProjectRepository.class
ru\tagirov\tm\command\userCommand\UserClearAllCommand.class
ru\tagirov\tm\service\IProjectService.class
ru\tagirov\tm\command\AbstractCommand.class
ru\tagirov\tm\TestClass.class
ru\tagirov\tm\command\taskCommand\TaskListToProjectCommand.class
ru\tagirov\tm\command\projectCommand\ProjectClearCommand.class
ru\tagirov\tm\command\userCommand\UserPasswordUpdateCommand.class
ru\tagirov\tm\service\impl\UserService.class
ru\tagirov\tm\util\Md5Util.class
ru\tagirov\tm\command\taskCommand\TaskAddToProjectCommand.class
ru\tagirov\tm\service\impl\TaskService.class
ru\tagirov\tm\util\UUIDUtil.class
ru\tagirov\tm\command\projectCommand\ProjectCreateCommand.class
ru\tagirov\tm\command\adminCommand\AdminShowTaskToUserCommand.class
ru\tagirov\tm\entity\Task.class
ru\tagirov\tm\repository\impl\UserRepository.class
ru\tagirov\tm\command\taskCommand\TaskUpdateToProjectCommand.class
ru\tagirov\tm\command\adminCommand\AdminShowUserCommand.class
ru\tagirov\tm\entity\AbstractEntity.class
ru\tagirov\tm\command\taskCommand\TaskListCommand.class
ru\tagirov\tm\repository\ITaskRepository.class
ru\tagirov\tm\util\DateUtil.class
ru\tagirov\tm\command\allCommand\LoginCommand.class
ru\tagirov\tm\enumeration\Role.class
ru\tagirov\tm\init\ServiceLocator.class
ru\tagirov\tm\command\allCommand\ExitCommand.class
ru\tagirov\tm\service\ITaskService.class
ru\tagirov\tm\repository\IUserRepository.class
ru\tagirov\tm\command\taskCommand\TaskClearCommand.class
ru\tagirov\tm\util\TerminalService.class
ru\tagirov\tm\command\userCommand\UserUpdateProfileCommand.class
ru\tagirov\tm\command\projectCommand\ProjectUpdateCommand.class
ru\tagirov\tm\command\userCommand\UserListAllCommand.class
ru\tagirov\tm\repository\IRepository.class
ru\tagirov\tm\command\allCommand\HelpCommand.class
ru\tagirov\tm\command\projectCommand\ProjectListCommand.class
ru\tagirov\tm\service\IUserService.class
ru\tagirov\tm\repository\impl\TaskRepository.class
ru\tagirov\tm\repository\IProjectRepository.class
ru\tagirov\tm\command\adminCommand\AdminShowTaskToProjectToUserCommand.class
ru\tagirov\tm\command\adminCommand\AdminShowProjectsToUserCommand.class
ru\tagirov\tm\entity\Project.class
ru\tagirov\tm\command\taskCommand\TaskRemoveToProjectCommand.class
ru\tagirov\tm\command\adminCommand\AdminShowAllUsersCommand.class
ru\tagirov\tm\service\AbstractService.class
ru\tagirov\tm\service\IService.class
ru\tagirov\tm\init\Bootstrap.class
ru\tagirov\tm\command\userCommand\UserShowProfileCommand.class
ru\tagirov\tm\command\allCommand\RegistrationCommand.class
ru\tagirov\tm\command\taskCommand\TaskRemoveCommand.class
ru\tagirov\tm\command\taskCommand\TaskCreateToProjectCommand.class
ru\tagirov\tm\command\taskCommand\TaskCreateCommand.class
ru\tagirov\tm\command\taskCommand\TaskUpdateCommand.class
ru\tagirov\tm\Application.class
