Division,WeightClassKg,Place,Name,Team,BodyweightKg,Best3SquatKg,Best3BenchKg,Best3DeadliftKg,TotalKg,Equipment,Event,Sex,BirthDate
Boys,51.71,1,LaMare Williams,Pineland West Sabine,51.71,86.18,54.43,92.99,233.6,Unlimited,SBD,M,
Boys,55.79,1,Cayne Dickerson,Pineland West Sabine,55.79,138.35,83.91,136.08,358.34,Unlimited,SBD,M,
Boys,55.79,2,Tristan McCauley,Pineland West Sabine,53.43,74.84,54.43,102.06,231.33,Unlimited,SBD,M,
Boys,59.87,1,Dario Reyes,Shelbyville,58.97,188.24,124.74,174.63,487.61,Unlimited,SBD,M,
Boys,67.13,1,Braeden Jordan,Hemphill,66.86,142.88,95.25,147.42,385.55,Unlimited,SBD,M,
Boys,67.13,2,Cj Ford,Pineland West Sabine,64.05,142.88,83.91,149.69,376.48,Unlimited,SBD,M,
Boys,67.13,3,Chase Mitchell,Pineland West Sabine,62.23,97.52,65.77,124.74,288.03,Unlimited,SBD,M,
Boys,67.13,DQ,Corey Holcomb,Pineland West Sabine,63.59,,,,,Unlimited,SBD,M,
Boys,74.84,1,Ronnie Williams,Shelbyville,74.84,136.08,106.59,183.7,426.38,Unlimited,SBD,M,
Boys,74.84,2,Tristan Vickers,Shelbyville,72.21,151.95,102.06,133.81,387.82,Unlimited,SBD,M,
Boys,74.84,3,Christian Chavez,Pineland West Sabine,68.76,136.08,81.65,158.76,376.48,Unlimited,SBD,M,
Boys,74.84,4,Hunter Crawford,Hemphill,68.31,124.74,68.04,129.27,322.05,Unlimited,SBD,M,
Boys,74.84,5,Trevor Ballard,Hemphill,68.76,113.4,56.7,133.81,303.91,Unlimited,SBD,M,
Boys,82.1,1,Sergio Reyes,Shelbyville,79.2,183.7,108.86,183.7,476.27,Unlimited,SBD,M,
Boys,82.1,2,Jordan Daniels,Hemphill,80.1,183.7,108.86,183.7,476.27,Unlimited,SBD,M,
Boys,82.1,3,Trevon McDaniel,Hemphill,76.66,131.54,90.72,192.78,415.04,Unlimited,SBD,M,
Boys,82.1,4,Ethan Powell,Pineland West Sabine,77.02,145.15,81.65,165.56,392.36,Unlimited,SBD,M,
Boys,82.1,5,Kyle Parnell,Pineland West Sabine,78.11,140.61,83.91,163.29,387.82,Unlimited,SBD,M,
Boys,82.1,6,Sawyer Fiscus,Hemphill,75.93,136.08,79.38,129.27,344.73,Unlimited,SBD,M,
Boys,89.81,1,Dustin Welch,Pineland West Sabine,88.09,219.99,113.4,199.58,532.97,Unlimited,SBD,M,
Boys,89.81,2,Chesney Wilkins,Shelbyville,89.81,188.24,124.74,192.78,505.76,Unlimited,SBD,M,
Boys,89.81,3,Justis Fowler,Hemphill,87.91,174.63,90.72,192.78,458.13,Unlimited,SBD,M,
Boys,89.81,4,Johntorian Farr,Hemphill,88.09,172.37,86.18,176.9,435.45,Unlimited,SBD,M,
Boys,89.81,5,Allary Daniels,San Augustine,89.81,122.47,83.91,147.42,353.8,Unlimited,SBD,M,
Boys,89.81,6,Caleb Harden,San Augustine,84.01,129.27,83.91,136.08,349.27,Unlimited,SBD,M,
Boys,89.81,DQ,Joseph Holman,San Augustine,87.36,,,,,Unlimited,SBD,M,
Boys,89.81,DQ,Kevin Freeman,Pineland West Sabine,89.81,,,,,Unlimited,SBD,M,
Boys,99.79,1,Kane Smith,Hemphill,94.53,206.38,136.08,206.38,548.85,Unlimited,SBD,M,
Boys,99.79,2,Jarrell Williams,Hemphill,96.8,197.31,127.01,188.24,512.56,Unlimited,SBD,M,
Boys,99.79,3,Courtney Davis,San Augustine,92.8,172.37,102.06,158.76,433.18,Unlimited,SBD,M,
Boys,99.79,4,Hunter Primrose,Pineland West Sabine,93.71,136.08,97.52,151.95,385.55,Unlimited,SBD,M,
Boys,99.79,5,Terry Cooper,San Augustine,92.44,124.74,77.11,142.88,344.73,Unlimited,SBD,M,
Boys,99.79,6,X'Twaan Sheperd,San Augustine,96.43,108.86,86.18,145.15,340.19,Unlimited,SBD,M,
Boys,109.77,1,Jose Gonzalez,Shelbyville,103.78,215.46,138.35,204.12,557.92,Unlimited,SBD,M,
Boys,109.77,2,JaKameron Roberts,San Augustine,106.14,181.44,115.67,204.12,501.22,Unlimited,SBD,M,
Boys,109.77,3,Rayburn McClelland,Pineland West Sabine,103.87,161.03,104.33,204.12,469.47,Unlimited,SBD,M,
Boys,109.77,4,Logan Haire,Pineland West Sabine,109.5,183.7,90.72,156.49,430.91,Unlimited,SBD,M,
Boys,124.74,1,Briley Rogers,Pineland West Sabine,123.1,299.37,192.78,247.21,739.36,Unlimited,SBD,M,
Boys,124.74,2,Tucker Stovall,Shelbyville,111.4,185.97,140.61,161.03,487.61,Unlimited,SBD,M,
Boys,124.74,3,Konner Miller,San Augustine,124.74,174.63,113.4,190.51,478.54,Unlimited,SBD,M,
Boys,124.74,4,Ely Corbello,Hemphill,117.03,165.56,117.93,183.7,467.2,Unlimited,SBD,M,
Boys,124.74,5,Esteban Antimo,Hemphill,120.47,142.88,79.38,136.08,358.34,Unlimited,SBD,M,
Boys,124.74,6,Cleveland Smith,Pineland West Sabine,114.31,136.08,65.77,122.47,324.32,Unlimited,SBD,M,
Boys,139.71,1,Evan Sensat,Pineland West Sabine,137.8,249.48,170.1,217.72,637.3,Unlimited,SBD,M,
Boys,139.71,2,Stephen Morrison,Pineland West Sabine,129.18,215.46,120.2,204.12,539.77,Unlimited,SBD,M,
Boys,139.71+,1,Keyston Simmons,Hemphill,162.93,226.8,113.4,183.7,523.9,Unlimited,SBD,M,
