Division,WeightClassKg,Place,Name,Team,BodyweightKg,Best3SquatKg,Best3BenchKg,Best3DeadliftKg,TotalKg,Equipment,Event,Sex,BirthDate
Girls,44.23,1,Aida Torres,Paris,44.13,106.59,61.23,111.13,278.96,Unlimited,SBD,F,
Girls,44.23,2,Myleigh Bradshaw,Tyler Chapel Hill,43.73,95.25,52.16,90.72,238.14,Unlimited,SBD,F,
Girls,44.23,3,Lorena Alvarez,Paris,43.45,81.65,38.56,90.72,210.92,Unlimited,SBD,F,
Girls,44.23,4,Cianna Devillier,Jacksonville,43.05,68.04,27.22,74.84,170.1,Unlimited,SBD,F,
Girls,47.85,1,Barbi Ruiz,Kaufman,47.72,113.4,70.31,111.13,294.84,Unlimited,SBD,F,
Girls,47.85,2,Shamiya Holt,Paris,46.08,108.86,54.43,113.4,276.69,Unlimited,SBD,F,
Girls,47.85,3,Madison Jeter,Sulphur Springs,45.81,92.99,61.23,102.06,256.28,Unlimited,SBD,F,
Girls,47.85,4,Ember Larson,Mabank,46.49,102.06,49.9,102.06,254.01,Unlimited,SBD,F,
Girls,47.85,5,Kali Perkins,Tyler Chapel Hill,46.95,63.5,40.82,83.91,188.24,Unlimited,SBD,F,
Girls,47.85,DQ,Landry Henington,Lindale,46.04,,,,,Unlimited,SBD,F,
Girls,51.94,1,Haylee Shultz,Sulphur Springs,51.8,136.08,83.91,151.95,371.95,Unlimited,SBD,F,
Girls,51.94,2,Anna Blassingame,Paris,50.8,117.93,83.91,117.93,319.78,Unlimited,SBD,F,
Girls,51.94,3,Kaliegh Klein,Kaufman,50.12,102.06,52.16,106.59,260.82,Unlimited,SBD,F,
Girls,51.94,4,Adeliz Hinojosa,Paris,51.8,102.06,49.9,102.06,254.01,Unlimited,SBD,F,
Girls,51.94,5,Torres Nixie,Athens,49.35,90.72,58.97,99.79,249.48,Unlimited,SBD,F,
Girls,51.94,6,Jessica Gibo,Paris,51.35,99.79,49.9,95.25,244.94,Unlimited,SBD,F,
Girls,51.94,7,Mackenzie Musselwhite,Henderson,49.35,90.72,45.36,92.99,229.06,Unlimited,SBD,F,
Girls,51.94,8,Ana Aguirre,Tyler Chapel Hill,50.62,90.72,52.16,79.38,222.26,Unlimited,SBD,F,
Girls,51.94,9,Reyna Espinoza,Palestine,49.94,83.91,40.82,81.65,206.38,Unlimited,SBD,F,
Girls,51.94,10,Pugh Emily,Athens,51.71,34.02,20.41,61.23,115.67,Unlimited,SBD,F,
Girls,56.02,1,Jalynn Gateley,Lindale,55.43,145.15,92.99,136.08,374.21,Unlimited,SBD,F,
Girls,56.02,2,Baleigh Cashion,Paris,56.02,138.35,74.84,129.27,342.46,Unlimited,SBD,F,
Girls,56.02,3,Lindsey Cope,Mabank,55.43,136.08,74.84,122.47,333.39,Unlimited,SBD,F,
Girls,56.02,4,Alondra Rangel,Jacksonville,55.79,136.08,74.84,113.4,324.32,Unlimited,SBD,F,
Girls,56.02,5,Madison Sherwood,Paris,54.07,122.47,72.57,124.74,319.78,Unlimited,SBD,F,
Girls,56.02,6,Kerra Moore-Eubanks,Tyler Chapel Hill,55.57,127.01,77.11,115.67,319.78,Unlimited,SBD,F,
Girls,56.02,7,Peyton Cook,Paris,55.34,115.67,61.23,106.59,283.5,Unlimited,SBD,F,
Girls,56.02,8,Samantha Breaux,Lindale,54.57,97.52,68.04,111.13,276.69,Unlimited,SBD,F,
Girls,56.02,9,Goode Wren,Henderson,53.16,111.13,56.7,106.59,274.42,Unlimited,SBD,F,
Girls,56.02,10,Isabel Ibarra,Paris,54.7,95.25,58.97,115.67,269.89,Unlimited,SBD,F,
Girls,56.02,11,Alondra Garcia,Paris,54.79,99.79,61.23,106.59,267.62,Unlimited,SBD,F,
Girls,60.1,1,Addison Frazier,Lindale,57.92,163.29,106.59,147.42,417.3,Unlimited,SBD,F,
Girls,60.1,2,Callie Riley,Mabank,59.15,149.69,90.72,122.47,362.87,Unlimited,SBD,F,
Girls,60.1,3,Shayla Ramirez,Jacksonville,59.69,122.47,79.38,122.47,324.32,Unlimited,SBD,F,
Girls,60.1,4,Zykaria Butler,Paris,59.6,136.08,68.04,113.4,317.51,Unlimited,SBD,F,
Girls,60.1,5,Abigail Harper,Paris,58.88,120.2,58.97,127.01,306.17,Unlimited,SBD,F,
Girls,60.1,6,Emalee McKeever,Lindale,58.65,122.47,61.23,113.4,297.1,Unlimited,SBD,F,
Girls,60.1,7,Amy Hurtado,Sulphur Springs,58.79,117.93,72.57,106.59,297.1,Unlimited,SBD,F,
Girls,60.1,8,Amber Huggins,Mabank,59.33,113.4,52.16,120.2,285.76,Unlimited,SBD,F,
Girls,60.1,9,Burt Kenley,Henderson,58.15,97.52,54.43,104.33,256.28,Unlimited,SBD,F,
Girls,60.1,10,Trinity OBryne,Lindale,59.51,106.59,52.16,95.25,254.01,Unlimited,SBD,F,
Girls,60.1,11,Addison Graves,Sulphur Springs,57.06,97.52,56.7,79.38,233.6,Unlimited,SBD,F,
Girls,60.1,DQ,Baylee Heisler,Kaufman,57.33,106.59,56.7,,,Unlimited,SBD,F,
Girls,67.36,1,Norris Nolyn,Henderson,65.86,183.7,106.59,165.56,455.86,Unlimited,SBD,F,
Girls,67.36,2,Mackenzie Martin,Paris,65.86,145.15,92.99,149.69,387.82,Unlimited,SBD,F,
Girls,67.36,3,Rebecca Solomon,Kaufman,66.54,142.88,70.31,124.74,337.93,Unlimited,SBD,F,
Girls,67.36,4,Tianna Cooper,Lindale,67.27,133.81,81.65,120.2,335.66,Unlimited,SBD,F,
Girls,67.36,5,Marsaydez Lewis,Tyler Chapel Hill,65.23,120.2,90.72,122.47,333.39,Unlimited,SBD,F,
Girls,67.36,6,Serenity Fuller,Lindale,67.31,104.33,90.72,129.27,324.32,Unlimited,SBD,F,
Girls,67.36,7,Mariah Brockway,Kaufman,63.91,117.93,72.57,129.27,319.78,Unlimited,SBD,F,
Girls,67.36,8,Carleigh McClenan,Henderson,64.32,122.47,63.5,117.93,303.91,Unlimited,SBD,F,
Girls,67.36,9,Brenli Padgett,Henderson,64.32,108.86,72.57,117.93,299.37,Unlimited,SBD,F,
Girls,67.36,10,Angelena Rodriguez,Tyler Chapel Hill,64.46,97.52,63.5,102.06,263.08,Unlimited,SBD,F,
Girls,67.36,11,Alex Monsivaiz,Sulphur Springs,61.23,92.99,65.77,102.06,260.82,Unlimited,SBD,F,
Girls,67.36,DQ,Kenza Larsen,Paris,66.13,,,,,Unlimited,SBD,F,
Girls,75.07,1,Synnika Rose,Paris,72.98,154.22,81.65,154.22,390.09,Unlimited,SBD,F,
Girls,75.07,2,Kiana Perkins,Kaufman,68.4,147.42,83.91,149.69,381.02,Unlimited,SBD,F,
Girls,75.07,3,Kyndal Anderson,Mabank,70.22,140.61,97.52,136.08,374.21,Unlimited,SBD,F,
Girls,75.07,4,Sophia Galysh,Lindale,73.35,147.42,92.99,133.81,374.21,Unlimited,SBD,F,
Girls,75.07,5,Aubrey Travis,Lindale,73.12,136.08,86.18,127.01,349.27,Unlimited,SBD,F,
Girls,75.07,6,Hailey Woodroof,Paris,73.48,124.74,74.84,140.61,340.19,Unlimited,SBD,F,
Girls,75.07,7,Castaneda Sarah,Athens,72.8,136.08,61.23,136.08,333.39,Unlimited,SBD,F,
Girls,75.07,8,Natalya Morales,Kaufman,72.67,131.54,65.77,117.93,315.25,Unlimited,SBD,F,
Girls,75.07,9,Grace Moye,Lindale,71.67,104.33,68.04,117.93,290.3,Unlimited,SBD,F,
Girls,75.07,DQ,Acaria Titus,Paris,72.85,133.81,,,,Unlimited,SBD,F,
Girls,75.07,DQ,Alizae Wrenn,Kaufman,67.95,,,,,Unlimited,SBD,F,
Girls,75.07,DQ,Cayla Thomas,Henderson,74.84,,,,,Unlimited,SBD,F,
Girls,82.33,1,Regan Wooten,Lindale,79.02,138.35,106.59,158.76,403.7,Unlimited,SBD,F,
Girls,82.33,2,Stephanie Preston-McGrew,Paris,78.83,161.03,81.65,158.76,401.43,Unlimited,SBD,F,
Girls,82.33,3,Catherine Egbe,Palestine,75.57,151.95,68.04,154.22,374.21,Unlimited,SBD,F,
Girls,82.33,4,Sophia Ford,Mabank,79.2,142.88,77.11,122.47,342.46,Unlimited,SBD,F,
Girls,82.33,5,Khloe Doolittle,Paris,78.83,133.81,65.77,136.08,335.66,Unlimited,SBD,F,
Girls,82.33,6,Brooklyn Person,Sulphur Springs,75.39,136.08,72.57,108.86,317.51,Unlimited,SBD,F,
Girls,82.33,7,Yazmine Cortez,Kaufman,77.25,115.67,74.84,122.47,312.98,Unlimited,SBD,F,
Girls,82.33,8,Tevi Lane,Lindale,81.01,74.84,54.43,102.06,231.33,Unlimited,SBD,F,
Girls,82.33,DQ,Mia Hayes,Lindale,77.34,142.88,90.72,,,Unlimited,SBD,F,
Girls,82.33,DQ,Kylee Combs,Kaufman,77.11,113.4,54.43,,,Unlimited,SBD,F,
Girls,82.33,DQ,Roberts Christina,Athens,82.1,,,,,Unlimited,SBD,F,
Girls,90.04,1,Kidd Anna,Athens,86.73,183.7,83.91,145.15,412.77,Unlimited,SBD,F,
Girls,90.04,2,Alexis Wilson,Mabank,86.91,158.76,108.86,136.08,403.7,Unlimited,SBD,F,
Girls,90.04,3,Kailey Looney,Mabank,87.18,170.1,108.86,122.47,401.43,Unlimited,SBD,F,
Girls,90.04,4,Peyton Nelson,Paris,84.37,145.15,74.84,142.88,362.87,Unlimited,SBD,F,
Girls,90.04,5,Madison Fancher,Henderson,89.63,124.74,86.18,120.2,331.12,Unlimited,SBD,F,
Girls,90.04,6,Laney Harwell,Jacksonville,88.09,122.47,74.84,127.01,324.32,Unlimited,SBD,F,
Girls,90.04,7,Kolbi McCoy,Sulphur Springs,85.28,113.4,65.77,113.4,292.57,Unlimited,SBD,F,
Girls,90.04,8,Marrissa Hare,Henderson,88.36,102.06,54.43,127.01,283.5,Unlimited,SBD,F,
Girls,90.04,9,Blayke Snowton,Paris,83.37,83.91,56.7,117.93,258.55,Unlimited,SBD,F,
Girls,90.04,10,Addison Mohan,Palestine,88.72,108.86,47.63,102.06,258.55,Unlimited,SBD,F,
Girls,90.04,DQ,Hannah Palermo,Mabank,85.18,,,,,Unlimited,SBD,F,
Girls,90.04,DQ,Kaylen Gamez,Lindale,83.82,113.4,61.23,,,Unlimited,SBD,F,
Girls,100.02,1,Aelena Kellum,Henderson,97.61,215.46,111.13,174.63,501.22,Unlimited,SBD,F,
Girls,100.02,2,Sarah Cobarrubias,Waxahachie Life,98.43,170.1,90.72,129.27,390.09,Unlimited,SBD,F,
Girls,100.02,3,Logan Johnson #5,Henderson,98.43,140.61,86.18,149.69,376.48,Unlimited,SBD,F,
Girls,100.02,4,Taniya Crumpton,Tyler Chapel Hill,90.08,133.81,102.06,129.27,365.14,Unlimited,SBD,F,
Girls,100.02,5,Madison Foster,Kaufman,92.8,147.42,79.38,138.35,365.14,Unlimited,SBD,F,
Girls,100.02,6,Crystal Bastida,Lindale,96.3,131.54,81.65,142.88,356.07,Unlimited,SBD,F,
Girls,100.02,7,Hailey Lovato,Waxahachie Life,99.02,124.74,79.38,120.2,324.32,Unlimited,SBD,F,
Girls,100.02,8,Gabriela Chavez,Paris,96.21,108.86,77.11,120.2,306.17,Unlimited,SBD,F,
Girls,100.02,9,Tressie Woodworth,Lindale,96.25,106.59,63.5,106.59,276.69,Unlimited,SBD,F,
Girls,100.02,10,Anaya Williams,Palestine,98.47,102.06,47.63,68.04,217.72,Unlimited,SBD,F,
Girls,110,1,Tymia Browner,Paris,108.86,165.56,111.13,158.76,435.45,Unlimited,SBD,F,
Girls,110,2,Taylor Harris,Mabank,105.19,183.7,90.72,151.95,426.38,Unlimited,SBD,F,
Girls,110,3,Rico Yiblia,Athens,108.82,181.44,77.11,136.08,394.63,Unlimited,SBD,F,
Girls,110,DQ,Asja Sims,Paris,109.77,,,,,Unlimited,SBD,F,
Girls,110+,1,Machelle Allen,Sulphur Springs,135.9,183.7,127.01,154.22,464.93,Unlimited,SBD,F,
Girls,110+,2,Sarai Harris,Paris,133.9,167.83,122.47,133.81,424.11,Unlimited,SBD,F,
Girls,110+,3,Reese Offutt,Sulphur Springs,126.51,151.95,99.79,142.88,394.63,Unlimited,SBD,F,
Girls,110+,4,Jasmine Simon,Henderson,113.4,158.76,83.91,140.61,383.29,Unlimited,SBD,F,
Girls,110+,5,Gabi Ferretiz,Palestine,117.57,174.63,68.04,117.93,360.61,Unlimited,SBD,F,
Girls,110+,6,Isabella Torres,Kaufman,133.81,136.08,83.91,136.08,356.07,Unlimited,SBD,F,
Girls,110+,7,Anajah White,Jacksonville,138.84,142.88,56.7,142.88,342.46,Unlimited,SBD,F,
Girls,110+,DQ,Mya White,Jacksonville,128.91,149.69,,,,Unlimited,SBD,F,
Girls,110+,DQ,Jacey Jenkins,Mabank,142.65,,,,,Unlimited,SBD,F,
