Division,WeightClassKg,Place,Name,Team,BodyweightKg,Best3SquatKg,Best3BenchKg,Best3DeadliftKg,TotalKg,Equipment,Event,Sex
Boys,55.79,1,Darius Rivera,Princeton,51.8,127.01,70.31,133.81,331.12,Single-ply,SBD,M
Boys,51.71,2,Russell Wilcox,Leonard,50.17,115.67,52.16,127.01,294.84,Single-ply,SBD,M
Boys,51.71,3,Skyler Packard,McKinney,49.35,106.59,54.43,117.93,278.96,Single-ply,SBD,M
Boys,51.71,4,Isai Cerrios,Sanger,50.98,90.72,65.77,106.59,263.08,Single-ply,SBD,M
Boys,51.71,5,Ramon Sánchez,Lone Oak,45.45,83.91,63.5,111.13,258.55,Single-ply,SBD,M
Boys,51.71,6,Jorge Solano,Bonham,51.44,97.52,43.09,92.99,233.6,Single-ply,SBD,M
Boys,55.79,1,Dillan Cromeens,Nevada Community,55.79,136.08,72.57,138.35,347,Single-ply,SBD,M
Boys,59.87,1,Kareem Williams,Carrollton Ranchview,58.33,204.12,104.33,179.17,487.61,Single-ply,SBD,M
Boys,59.87,2,Adam Piper,Whitesboro,58.97,129.27,90.72,129.27,349.27,Single-ply,SBD,M
Boys,67.13,3,Gio Soto,Leonard,60.06,122.47,81.65,138.35,342.46,Single-ply,SBD,M
Boys,59.87,4,Billy McMahon,Farmersville,56.43,113.4,65.77,113.4,292.57,Single-ply,SBD,M
Boys,59.87,5,Reuben Harlin,Whitesboro,59.69,70.31,61.23,111.13,242.67,Single-ply,SBD,M
Boys,59.87,13,Noah Raney,Sherman,56.43,122.47,81.65,149.69,353.8,Single-ply,SBD,M
Boys,59.87,DQ,Nyal Barnes,Allen,58.24,115.67,,,,Single-ply,SBD,M
Boys,67.13,1,Bradley Beck,McKinney,65.95,181.44,113.4,185.97,480.81,Single-ply,SBD,M
Boys,67.13,2,Dustin Louth,Princeton,62.78,170.1,74.84,181.44,426.38,Single-ply,SBD,M
Boys,67.13,3,Will Carter,Sanger,61.33,154.22,99.79,167.83,421.84,Single-ply,SBD,M
Boys,67.13,4,Chris Stevens #2,Sherman,66.13,179.17,81.65,158.76,419.57,Single-ply,SBD,M
Boys,67.13,5,Kason Freelen,Lone Oak,66.68,142.88,99.79,158.76,401.43,Single-ply,SBD,M
Boys,67.13,6,Chester Lee,Frisco Heritage,66.5,129.27,108.86,151.95,390.09,Single-ply,SBD,M
Boys,67.13,7,Jeffrey McLeod,Garland Rowlett,65.32,138.35,70.31,172.37,381.02,Single-ply,SBD,M
Boys,67.13,8,Mitch Cordy,Prosper,66.22,136.08,86.18,149.69,371.95,Single-ply,SBD,M
Boys,67.13,9,Arhman Mathis,Carrollton Ranchview,64.86,147.42,83.91,133.81,365.14,Single-ply,SBD,M
Boys,67.13,10,Jacob Kemp,Bonham,60.6,133.81,68.04,145.15,347,Single-ply,SBD,M
Boys,67.13,11,Jalen Henley,Allen,66.04,136.08,74.84,136.08,347,Single-ply,SBD,M
Boys,67.13,12,Chris Jackson #10,Prosper,63.32,113.4,86.18,136.08,335.66,Single-ply,SBD,M
Boys,67.13,13,Zach Drogosch,Allen,67.13,133.81,70.31,124.74,328.85,Single-ply,SBD,M
Boys,67.13,14,Simon Lafond,Garland Rowlett,61.05,115.67,56.7,138.35,310.71,Single-ply,SBD,M
Boys,67.13,15,Blake Weaver,Frisco Heritage,61.69,83.91,61.23,97.52,242.67,Single-ply,SBD,M
Boys,67.13,DQ,Clayton Stringer,Whitesboro,65.41,136.08,,,,Single-ply,SBD,M
Boys,67.13,DQ,Savon Miles,Princeton,66.5,151.95,,,,Single-ply,SBD,M
Boys,74.84,1,Anthony Wagner,Garland Rowlett,72.21,181.44,129.27,192.78,503.49,Single-ply,SBD,M
Boys,74.84,2,Brian Hesson,Lucas Lovejoy,72.21,185.97,106.59,195.04,487.61,Single-ply,SBD,M
Boys,74.84,3,Jarrell Washington,Leonard,68.49,172.37,104.33,181.44,458.13,Single-ply,SBD,M
Boys,74.84,4,Kahill Edwards,Carrollton Ranchview,72.39,172.37,97.52,188.24,458.13,Single-ply,SBD,M
Boys,74.84,5,Brice Chaney,Whitesboro,73.84,151.95,88.45,165.56,405.97,Single-ply,SBD,M
Boys,74.84,6,Jace Hart,Lone Oak,74.3,156.49,92.99,154.22,403.7,Single-ply,SBD,M
Boys,74.84,7,Ty Tolleson,Lone Oak,73.12,142.88,86.18,172.37,401.43,Single-ply,SBD,M
Boys,74.84,8,Connor Thompson,Prosper,72.85,136.08,106.59,147.42,390.09,Single-ply,SBD,M
Boys,74.84,9,Michael Jacob #3,Allen,73.12,133.81,86.18,149.69,369.68,Single-ply,SBD,M
Boys,74.84,10,Antony Smith,Carrollton Ranchview,70.03,133.81,86.18,131.54,351.53,Single-ply,SBD,M
Boys,82.1,11,Neal Botteron,Frisco Heritage,75.02,111.13,104.33,136.08,351.53,Single-ply,SBD,M
Boys,74.84,12,Ron Jasterzinski,Bonham,69.04,131.54,77.11,136.08,344.73,Single-ply,SBD,M
Boys,74.84,13,Nic Hintz,Frisco Heritage,73.3,127.01,81.65,136.08,344.73,Single-ply,SBD,M
Boys,74.84,14,Cyle Ferrell,Nevada Community,73.94,115.67,92.99,124.74,333.39,Single-ply,SBD,M
Boys,74.84,15,Caleb Hill,Bonham,74.48,151.95,61.23,120.2,333.39,Single-ply,SBD,M
Boys,74.84,16,Walker Copeland,Leonard,73.57,111.13,70.31,149.69,331.12,Single-ply,SBD,M
Boys,74.84,17,Hayden Pierce,Frisco Heritage,72.76,117.93,74.84,131.54,324.32,Single-ply,SBD,M
Boys,74.84,18,Chase Brown,Frisco Heritage,70.58,108.86,54.43,108.86,272.16,Single-ply,SBD,M
Boys,74.84,19,Michael Carpin,Frisco Heritage,70.85,92.99,61.23,104.33,258.55,Single-ply,SBD,M
Boys,74.84,20,Jake LoGrasso,Frisco Heritage,69.76,79.38,52.16,106.59,238.14,Single-ply,SBD,M
Boys,74.84,DQ,Cody Maupin,Nevada Community,74.03,149.69,,,,Single-ply,SBD,M
Boys,82.1,1,Levi Haggard,Bonham,81.56,233.6,124.74,217.72,576.06,Single-ply,SBD,M
Boys,82.1,2,Collin Charles,Frisco Heritage,80.01,204.12,136.08,226.8,566.99,Single-ply,SBD,M
Boys,82.1,3,ShaCody Williams,Sherman,77.02,195.04,136.08,204.12,535.24,Single-ply,SBD,M
Boys,89.81,4,Cameron Hartsfield,Allen,82.28,192.78,108.86,197.31,498.95,Single-ply,SBD,M
Boys,82.1,5,Cameron Williams #10,Sherman,75.75,174.63,108.86,195.04,478.54,Single-ply,SBD,M
Boys,82.1,6,John Eskue,Sanger,75.84,181.44,113.4,181.44,476.27,Single-ply,SBD,M
Boys,82.1,7,Malik Johnson,Carrollton Ranchview,80.92,188.24,79.38,188.24,455.86,Single-ply,SBD,M
Boys,82.1,8,Jad Jabary,Allen,77.75,165.56,115.67,158.76,439.98,Single-ply,SBD,M
Boys,82.1,9,Edgar Gomez,Garland Rowlett,80.65,156.49,113.4,170.1,439.98,Single-ply,SBD,M
Boys,82.1,10,Dalton Harris,McKinney,80.83,174.63,104.33,158.76,437.72,Single-ply,SBD,M
Boys,82.1,11,Kenton Manis,Bonham,81.1,174.63,81.65,181.44,437.72,Single-ply,SBD,M
Boys,82.1,12,Scott Prescher,Valley View,75.57,167.83,106.59,158.76,433.18,Single-ply,SBD,M
Boys,82.1,13,Jacobi Verdin,Sanger,81.65,172.37,106.59,154.22,433.18,Single-ply,SBD,M
Boys,89.81,14,Trenton Williams,Princeton,82.19,170.1,102.06,161.03,433.18,Single-ply,SBD,M
Boys,82.1,15,Hunter Garrett,Whitesboro,76.2,142.88,97.52,158.76,399.16,Single-ply,SBD,M
Boys,82.1,16,Justin Bennett,Leonard,76.2,142.88,90.72,161.03,394.63,Single-ply,SBD,M
Boys,82.1,17,Louis Lopez,Prosper,81.1,145.15,92.99,147.42,385.55,Single-ply,SBD,M
Boys,82.1,18,Conner Barns,Sanger,77.66,158.76,99.79,124.74,383.29,Single-ply,SBD,M
Boys,82.1,19,Aaron Mazyck,Carrollton Ranchview,79.2,133.81,74.84,174.63,383.29,Single-ply,SBD,M
Boys,82.1,20,Wade Woodard,Prosper,75.48,129.27,104.33,127.01,360.61,Single-ply,SBD,M
Boys,82.1,21,Robert Merryfield,Frisco Heritage,75.93,140.61,72.57,147.42,360.61,Single-ply,SBD,M
Boys,82.1,22,Eli Gammage,Lone Oak,75.93,120.2,83.91,129.27,333.39,Single-ply,SBD,M
Boys,82.1,23,Jacob Gray #3,Frisco Heritage,78.65,122.47,63.5,127.01,312.98,Single-ply,SBD,M
Boys,82.1,24,Collin Kilcrease,Whitesboro,80.92,122.47,92.99,95.25,310.71,Single-ply,SBD,M
Boys,89.81,DQ,Steven Rios,Princeton,82.28,142.88,,131.54,,Single-ply,SBD,M
Boys,89.81,1,Dakota Barnes,Bonham,87.82,229.06,104.33,235.87,569.26,Single-ply,SBD,M
Boys,89.81,2,Nigel Hasty,Garland Rowlett,85.82,197.31,124.74,222.26,544.31,Single-ply,SBD,M
Boys,89.81,3,Derek Shelby,Sanger,86,192.78,127.01,190.51,510.29,Single-ply,SBD,M
Boys,89.81,4,Stryker Hunnicutt,Bonham,88.27,185.97,111.13,213.19,510.29,Single-ply,SBD,M
Boys,99.79,5,Slayton Shiels,Lucas Lovejoy,89.99,174.63,124.74,199.58,498.95,Single-ply,SBD,M
Boys,89.81,6,Mikey Dobbles,Bonham,89.54,195.04,97.52,185.97,478.54,Single-ply,SBD,M
Boys,89.81,7,Arnold Contreras,Leonard,85.09,210.92,97.52,165.56,474,Single-ply,SBD,M
Boys,89.81,8,Tyler McClain,Lone Oak,89.09,165.56,113.4,183.7,462.66,Single-ply,SBD,M
Boys,89.81,9,Jordan Buckaloo,Leonard,85.28,181.44,99.79,165.56,446.79,Single-ply,SBD,M
Boys,89.81,10,Payton Thompson,Princeton,87.45,147.42,102.06,158.76,408.23,Single-ply,SBD,M
Boys,89.81,11,Bryant Leslie,Nevada Community,83.19,154.22,92.99,136.08,383.29,Single-ply,SBD,M
Boys,89.81,12,Ruben Garcia,Leonard,87.18,127.01,90.72,142.88,360.61,Single-ply,SBD,M
Boys,89.81,14,Cason Riley,Leonard,85.82,136.08,72.57,142.88,351.53,Single-ply,SBD,M
Boys,89.81,15,Alex Wick,Farmersville,82.64,127.01,90.72,127.01,344.73,Single-ply,SBD,M
Boys,89.81,16,Tyler Weaver,Carrollton Ranchview,84.19,131.54,79.38,124.74,335.66,Single-ply,SBD,M
Boys,89.81,17,Nick Davis,Farmersville,87.27,113.4,81.65,127.01,322.05,Single-ply,SBD,M
Boys,89.81,18,Clay Stephens,Bonham,88.45,111.13,56.7,129.27,297.1,Single-ply,SBD,M
Boys,99.79,1,Nick Conklin,Sanger,92.71,226.8,147.42,238.14,612.35,Single-ply,SBD,M
Boys,99.79,2,Axel DeLeon,Little Elm,98.7,244.94,133.81,233.6,612.35,Single-ply,SBD,M
Boys,109.77,3,Taylor Davis #5,Princeton,99.88,208.65,136.08,206.38,551.11,Single-ply,SBD,M
Boys,99.79,4,Calvin Estrada,Garland Rowlett,93.35,201.85,113.4,192.78,508.02,Single-ply,SBD,M
Boys,99.79,5,Brandon Behrens,Prosper,94.35,183.7,122.47,188.24,494.42,Single-ply,SBD,M
Boys,99.79,6,Julius Hall,Carrollton Ranchview,99.06,181.44,117.93,195.04,494.42,Single-ply,SBD,M
Boys,99.79,7,Kevin Salas,Prosper,99.79,179.17,138.35,174.63,492.15,Single-ply,SBD,M
Boys,99.79,8,Keenan Samuel,McKinney,95.16,204.12,108.86,172.37,485.34,Single-ply,SBD,M
Boys,109.77,9,Chris O'Tool,Little Elm,99.97,176.9,111.13,185.97,474,Single-ply,SBD,M
Boys,99.79,10,Jd Poe,Lucas Lovejoy,95.25,181.44,115.67,172.37,469.47,Single-ply,SBD,M
Boys,99.79,11,Joey Clegg,Garland Rowlett,93.62,156.49,127.01,183.7,467.2,Single-ply,SBD,M
Boys,99.79,12,Dalton Lloyd,Lucas Lovejoy,99.25,170.1,102.06,167.83,439.98,Single-ply,SBD,M
Boys,99.79,13,Guy Roecker,Lucas Lovejoy,96.16,165.56,108.86,158.76,433.18,Single-ply,SBD,M
Boys,99.79,14,John Calhoun,McKinney,97.61,149.69,68.04,172.37,390.09,Single-ply,SBD,M
Boys,109.77,15,Nathan Shaddock,Garland Rowlett,99.97,138.35,92.99,151.95,383.29,Single-ply,SBD,M
Boys,99.79,16,Ty Stone,McKinney,94.8,129.27,90.72,147.42,367.41,Single-ply,SBD,M
Boys,99.79,17,Max Anderson,Lucas Lovejoy,91.72,124.74,77.11,147.42,349.27,Single-ply,SBD,M
Boys,99.79,18,Julian Abdallah,Carrollton Ranchview,94.71,133.81,81.65,133.81,349.27,Single-ply,SBD,M
Boys,99.79,19,Colin Yang,Frisco Heritage,96.62,127.01,61.23,129.27,317.51,Single-ply,SBD,M
Boys,99.79,DQ,Derrek Clayton,Sherman,96.8,210.92,,195.04,,Single-ply,SBD,M
Boys,109.77,1,Hiram Muhammad,Lucas Lovejoy,107.68,249.48,145.15,274.42,669.05,Single-ply,SBD,M
Boys,109.77,2,Zac McCoy,Little Elm,106.5,231.33,147.42,192.78,571.53,Single-ply,SBD,M
Boys,124.74,3,Colton Busby,Lone Oak,109.95,190.51,111.13,183.7,485.34,Single-ply,SBD,M
Boys,124.74,4,Lance Williams,Allen,109.95,188.24,124.74,156.49,469.47,Single-ply,SBD,M
Boys,109.77,5,Dequan Washington,Carrollton Ranchview,103.78,174.63,113.4,176.9,464.93,Single-ply,SBD,M
Boys,109.77,6,James Weimer,Nevada Community,104.05,199.58,95.25,165.56,460.4,Single-ply,SBD,M
Boys,109.77,7,Ahmon Mayes,Prosper,108.5,170.1,102.06,183.7,455.86,Single-ply,SBD,M
Boys,109.77,8,James Nguyen #2,Lucas Lovejoy,106.32,165.56,81.65,181.44,428.64,Single-ply,SBD,M
Boys,109.77,9,Zak Mirza,Garland Rowlett,107.68,154.22,113.4,158.76,426.38,Single-ply,SBD,M
Boys,109.77,10,Austen Lange,Sanger,100.88,158.76,92.99,158.76,410.5,Single-ply,SBD,M
Boys,109.77,11,Jeff Forst,Frisco Heritage,108.77,156.49,83.91,170.1,410.5,Single-ply,SBD,M
Boys,124.74,12,Cooper Carson,McKinney,109.95,158.76,83.91,154.22,396.89,Single-ply,SBD,M
Boys,109.77,13,Taylor Hartman,Nevada Community,107.41,147.42,83.91,149.69,381.02,Single-ply,SBD,M
Boys,109.77,14,Tim Womble,Frisco Heritage,108.05,136.08,83.91,151.95,371.95,Single-ply,SBD,M
Boys,109.77,15,Casey Misenheimer,Whitesboro,105.96,113.4,83.91,129.27,326.59,Single-ply,SBD,M
Boys,109.77,DQ,Tristan Paredes,Nevada Community,108.5,158.76,83.91,,,Single-ply,SBD,M
Boys,109.77,DQ,Nick Phillips,Princeton,107.95,183.7,106.59,,,Single-ply,SBD,M
Boys,124.74,1,Colt Nelson,Sanger,120.75,251.74,158.76,238.14,648.64,Single-ply,SBD,M
Boys,124.74,2,Jerome Daniels,Little Elm,124.1,244.94,156.49,235.87,637.3,Single-ply,SBD,M
Boys,124.74,3,Donavan White,Princeton,116.26,244.94,124.74,226.8,596.47,Single-ply,SBD,M
Boys,124.74,4,Ethan Watson,Bonham,115.21,233.6,140.61,204.12,578.33,Single-ply,SBD,M
Boys,124.74,5,Joel Lopez,Farmersville,119.02,226.8,120.2,201.85,548.85,Single-ply,SBD,M
Boys,124.74,6,John Clark,Allen,122.02,215.46,120.2,192.78,528.44,Single-ply,SBD,M
Boys,124.74,7,Kyle Scheffler,Sanger,120.2,181.44,138.35,199.58,519.36,Single-ply,SBD,M
Boys,124.74,8,Fritz Hull,Prosper,113.94,204.12,124.74,185.97,514.83,Single-ply,SBD,M
Boys,124.74,9,Jack Willeford,Farmersville,121.2,199.58,127.01,183.7,510.29,Single-ply,SBD,M
Boys,124.74,10,Albert Sanchez,Sanger,123.74,181.44,120.2,165.56,467.2,Single-ply,SBD,M
Boys,124.74,11,Jake Baumert,Lucas Lovejoy,116.75,151.95,124.74,181.44,458.13,Single-ply,SBD,M
Boys,124.74,12,Alex Gomez,Garland Rowlett,112.67,167.83,111.13,176.9,455.86,Single-ply,SBD,M
Boys,124.74,13,Lohit Adusumilli,Frisco Heritage,110.68,124.74,83.91,138.35,347,Single-ply,SBD,M
Boys,124.74,DQ,Charles King,Valley View,110.95,111.13,,97.52,,Single-ply,SBD,M
Boys,124.74,DQ,Adam Stapleton,Whitesboro,115.48,210.92,,,,Single-ply,SBD,M
Boys,124.74+,1,Brain Gutierrez,Garland Rowlett,157.49,265.35,124.74,215.46,605.55,Single-ply,SBD,M
Boys,124.74+,2,Matt Hawkins,Nevada Community,140.61,240.4,129.27,226.8,596.47,Single-ply,SBD,M
Boys,124.74+,3,Price Samford,Allen,132.45,233.6,136.08,204.12,573.79,Single-ply,SBD,M
Boys,124.74+,4,Bryan Townsend,Whitesboro,125.19,215.46,142.88,179.17,537.51,Single-ply,SBD,M
Boys,124.74+,5,Adam Waw,Sherman,150.59,217.72,131.54,181.44,530.7,Single-ply,SBD,M
Boys,124.74+,6,Cameron Adkins,Leonard,130.91,215.46,115.67,190.51,521.63,Single-ply,SBD,M
Boys,124.74+,7,Chandler Layer,Garland Rowlett,131.63,208.65,117.93,190.51,517.1,Single-ply,SBD,M
Boys,124.74+,8,Keyuna Hastings,Sherman,133.17,217.72,117.93,181.44,517.1,Single-ply,SBD,M
Boys,124.74+,9,Dylan Bain,Lucas Lovejoy,138.62,197.31,127.01,185.97,510.29,Single-ply,SBD,M
Boys,124.74+,10,Rj Carranza,Nevada Community,144.7,195.04,74.84,165.56,435.45,Single-ply,SBD,M
Boys,124.74+,DQ,Ryan Turner,Carrollton Ranchview,133.81,192.78,106.59,,,Single-ply,SBD,M
Boys,,NS,Jeff Harris,Allen,,,,,,Single-ply,SBD,M
Boys,,NS,Tyran McClendon,Allen,,,,,,Single-ply,SBD,M
Boys,,NS,Brian Rogers,Farmersville,,,,,,Single-ply,SBD,M
Boys,,NS,Tyler Stevens #4,Leonard,,,,,,Single-ply,SBD,M
Boys,,NS,Adrian Escandon,Nevada Community,,,,,,Single-ply,SBD,M
Boys,,NS,Corey Rogers,Nevada Community,,,,,,Single-ply,SBD,M
Boys,,NS,Johnny Geter,McKinney,,,,,,Single-ply,SBD,M
Boys,,NS,Davin Wagner,McKinney,,,,,,Single-ply,SBD,M
Boys,,NS,Jonathon Schuster,McKinney,,,,,,Single-ply,SBD,M
Boys,,NS,Zach Ladis,McKinney,,,,,,Single-ply,SBD,M
Boys,,NS,John Embry,Lucas Lovejoy,,,,,,Single-ply,SBD,M
Boys,,NS,Brady Petersen,Prosper,,,,,,Single-ply,SBD,M
Boys,,NS,Cj Bryant,Princeton,,,,,,Single-ply,SBD,M
Boys,,NS,Reed Williams,Frisco Heritage,,,,,,Single-ply,SBD,M
Boys,,NS,Cj McKinzie,Whitesboro,,,,,,Single-ply,SBD,M
Boys,,NS,Jeremiah Luke,Frisco Heritage,,,,,,Single-ply,SBD,M
Boys,,NS,Seth Sain,Frisco Heritage,,,,,,Single-ply,SBD,M
Boys,,NS,Cameron O'Rear,Frisco Heritage,,,,,,Single-ply,SBD,M
