Division,WeightClassKg,Place,Name,Team,BodyweightKg,Best3SquatKg,Best3BenchKg,Best3DeadliftKg,TotalKg,Equipment,Event,Sex,BirthDate
Girls,44.23,1,Aliya Aguila,Wylie East,43.27,86.18,49.9,88.45,224.53,Unlimited,SBD,F,
Girls,44.23,2,Gianisley Garcia,Wylie East,42.55,83.91,47.63,88.45,219.99,Unlimited,SBD,F,
Girls,44.23,3,Sara Potter,Wylie East,42.46,74.84,29.48,61.23,165.56,Unlimited,SBD,F,
Girls,47.85,1,Jolie Campbell,Wylie,47.81,111.13,70.31,104.33,285.76,Unlimited,SBD,F,
Girls,47.85,2,Kimberly Carrizales,Chilton,44.91,92.99,52.16,117.93,263.08,Unlimited,SBD,F,
Girls,47.85,3,Allison Gonzales,Sunnyvale,47.08,97.52,47.63,86.18,231.33,Unlimited,SBD,F,
Girls,47.85,4,Peyton Billingsly,Sunnyvale,47.72,72.57,34.02,77.11,183.7,Unlimited,SBD,F,
Girls,47.85,5,Abigail Garza,North Mesquite,45,52.16,22.68,72.57,147.42,Unlimited,SBD,F,
Girls,47.85,6,Ahslim Medina,North Mesquite,45.81,43.09,27.22,77.11,147.42,Unlimited,SBD,F,
Girls,47.85,DQ,Jalynn Russ,Castleberry,47.36,74.84,,,,Unlimited,SBD,F,
Girls,51.94,1,Natalie Crim,Wylie,51.8,154.22,70.31,124.74,349.27,Unlimited,SBD,F,
Girls,51.94,2,Nina Nguyen,Wylie,50.53,131.54,70.31,120.2,322.05,Unlimited,SBD,F,
Girls,51.94,3,Krista Ruiz,Wylie,51.17,115.67,68.04,102.06,285.76,Unlimited,SBD,F,
Girls,51.94,4,Mahnoor Kiani,Wylie East,51.53,104.33,43.09,113.4,260.82,Unlimited,SBD,F,
Girls,51.94,5,Yarida Deleon,Chilton,49.62,86.18,49.9,77.11,213.19,Unlimited,SBD,F,
Girls,51.94,6,Tamiyah Goff,North Mesquite,48.99,45.36,29.48,70.31,145.15,Unlimited,SBD,F,
Girls,56.02,1,ShaZayah Murphy-Jones,Chilton,53.43,136.08,63.5,140.61,340.19,Unlimited,SBD,F,
Girls,56.02,2,Carolina Orozco,Carrollton Creekview,53.16,108.86,52.16,102.06,263.08,Unlimited,SBD,F,
Girls,56.02,3,Emily Conn,Wylie,53.16,104.33,56.7,97.52,258.55,Unlimited,SBD,F,
Girls,56.02,4,Tamia Bankhead,Wylie,53.98,88.45,38.56,122.47,249.48,Unlimited,SBD,F,
Girls,56.02,5,An Bui,Wylie,54.79,99.79,52.16,97.52,249.48,Unlimited,SBD,F,
Girls,56.02,6,Valeria Hernandez,Wylie,55.97,90.72,40.82,111.13,242.67,Unlimited,SBD,F,
Girls,56.02,7,Tristan Staley,Sunnyvale,55.43,92.99,49.9,95.25,238.14,Unlimited,SBD,F,
Girls,56.02,8,Alyssa Montenegro,Carrollton Creekview,53.89,99.79,40.82,92.99,233.6,Unlimited,SBD,F,
Girls,56.02,9,Leighla Royal,Carrollton Creekview,54.52,90.72,43.09,99.79,233.6,Unlimited,SBD,F,
Girls,56.02,10,Jaquelyn Bonilla,Carrollton Creekview,54.07,63.5,45.36,77.11,185.97,Unlimited,SBD,F,
Girls,56.02,DQ,Tessa Roseberry,Kemp,54.88,70.31,,,,Unlimited,SBD,F,
Girls,56.02,DQ,Liberty Gamero,Wylie,54.79,117.93,58.97,,,Unlimited,SBD,F,
Girls,60.1,1,Isabella Ortega,Wylie,59.87,161.03,90.72,136.08,387.82,Unlimited,SBD,F,
Girls,60.1,3,Sara White,Wylie,59.87,131.54,65.77,117.93,315.25,Unlimited,SBD,F,
Girls,60.1,4,Yasmin Munoz,Wylie,59.78,129.27,52.16,124.74,306.17,Unlimited,SBD,F,
Girls,60.1,5,La'Tarri Williams,Italy,59.87,113.4,61.23,124.74,299.37,Unlimited,SBD,F,
Girls,60.1,6,Jazmin Alvarez,Mesquite Horn,59.78,111.13,56.7,117.93,285.76,Unlimited,SBD,F,
Girls,60.1,7,Dawn Rae Haddox,Pioneer Technology and Arts Academy North Dallas,56.15,102.06,54.43,124.74,281.23,Unlimited,SBD,F,
Girls,60.1,8,Hannah Powell,Sunnyvale,59.33,113.4,54.43,92.99,260.82,Unlimited,SBD,F,
Girls,60.1,9,Camden Miller,Wylie,57.33,99.79,58.97,99.79,258.55,Unlimited,SBD,F,
Girls,60.1,10,Abigail Baldwin,Sunnyvale,58.24,99.79,47.63,92.99,240.4,Unlimited,SBD,F,
Girls,60.1,11,Ruby Segura,Carrollton Creekview,58.42,81.65,38.56,74.84,195.04,Unlimited,SBD,F,
Girls,60.1,12,Jaida Cortez,North Mesquite,58.33,63.5,38.56,79.38,181.44,Unlimited,SBD,F,
Girls,67.36,1,Jaedyn Smith,Wylie,66.59,167.83,120.2,149.69,437.72,Unlimited,SBD,F,
Girls,67.36,2,Addisyn Schmidt,Wylie,67.22,158.76,72.57,127.01,358.34,Unlimited,SBD,F,
Girls,67.36,4,Grace Garza,Wylie,60.96,129.27,74.84,136.08,340.19,Unlimited,SBD,F,
Girls,67.36,5,Kennedy Allen,Carrollton Creekview,65.86,136.08,56.7,124.74,317.51,Unlimited,SBD,F,
Girls,67.36,6,Jessi Anderson,Carrollton Creekview,65.23,127.01,72.57,115.67,315.25,Unlimited,SBD,F,
Girls,67.36,7,Mireyli Castillo,Mesquite Poteet,61.96,108.86,52.16,115.67,276.69,Unlimited,SBD,F,
Girls,67.36,8,Merry Gebreselassie,Wylie,64.32,97.52,52.16,127.01,276.69,Unlimited,SBD,F,
Girls,67.36,9,Brooke Johnson,Sunnyvale,64.5,106.59,52.16,97.52,256.28,Unlimited,SBD,F,
Girls,67.36,10,Sylvia Baldwin,Sunnyvale,62.32,99.79,52.16,115.67,267.62,Unlimited,SBD,F,
Girls,67.36,11,Nelly Felkel,Krum,63.96,95.25,56.7,102.06,254.01,Unlimited,SBD,F,
Girls,67.36,12,Caroline Moore,Sunnyvale,64.23,97.52,56.7,95.25,249.48,Unlimited,SBD,F,
Girls,67.36,13,Miriah Garcia,Castleberry,64.05,88.45,47.63,111.13,247.21,Unlimited,SBD,F,
Girls,67.36,14,Andrea Valles,Castleberry,64.14,86.18,56.7,92.99,235.87,Unlimited,SBD,F,
Girls,67.36,DQ,Viktoria Banda,Kemp,64.95,74.84,,,,Unlimited,SBD,F,
Girls,75.07,1,Yanelle Munoz,Wylie,71.58,172.37,86.18,133.81,392.36,Unlimited,SBD,F,
Girls,75.07,2,Caroline Greco,Wylie,74.12,136.08,90.72,136.08,362.87,Unlimited,SBD,F,
Girls,75.07,2,Gabrielle Batiste,Wylie East,73.94,149.69,86.18,124.74,360.61,Unlimited,SBD,F,
Girls,75.07,3,Ava Chavarria,West Mesquite,74.66,113.4,63.5,142.88,319.78,Unlimited,SBD,F,
Girls,75.07,4,Lillie Moore,Kemp,73.3,113.4,56.7,113.4,283.5,Unlimited,SBD,F,
Girls,75.07,5,Jasmine Lawerence,Mesquite Horn,68.22,90.72,52.16,131.54,274.42,Unlimited,SBD,F,
Girls,75.07,6,Aliyah Skinner,Wylie East,72.85,108.86,47.63,108.86,265.35,Unlimited,SBD,F,
Girls,75.07,7,Savannah Sheilds,Wylie,74.3,115.67,47.63,99.79,263.08,Unlimited,SBD,F,
Girls,75.07,8,Jayla Barnes,Krum,74.75,104.33,43.09,106.59,254.01,Unlimited,SBD,F,
Girls,75.07,9,Marlene Arzola,North Mesquite,72.48,102.06,36.29,111.13,249.48,Unlimited,SBD,F,
Girls,75.07,DQ,Yaritza Munoz,Wylie,74.12,138.35,,,,Unlimited,SBD,F,
Girls,82.33,1,Moriah Miller,Kemp,80.29,174.63,95.25,158.76,428.64,Unlimited,SBD,F,
Girls,82.33,2,Alex Davis,Wylie East,81.83,172.37,83.91,133.81,390.09,Unlimited,SBD,F,
Girls,82.33,3,Sian Wensink,Wylie,78.11,124.74,79.38,124.74,328.85,Unlimited,SBD,F,
Girls,82.33,4,Lily Cabrera,Sunnyvale,79.02,124.74,70.31,120.2,315.25,Unlimited,SBD,F,
Girls,82.33,5,Esther Emokpae,Wylie,80.56,127.01,40.82,142.88,310.71,Unlimited,SBD,F,
Girls,82.33,6,Esther Haastrup,Wylie East,81.1,129.27,56.7,124.74,310.71,Unlimited,SBD,F,
Girls,82.33,7,Sophia McCaleb,Mesquite Poteet,80.92,122.47,56.7,127.01,306.17,Unlimited,SBD,F,
Girls,82.33,8,Nyobi Newton,Kemp,80.47,127.01,63.5,108.86,299.37,Unlimited,SBD,F,
Girls,82.33,9,Alyia Barbosa,Castleberry,79.56,111.13,54.43,129.27,294.84,Unlimited,SBD,F,
Girls,82.33,10,Elizabeth Vogel,Wylie,77.11,106.59,49.9,129.27,285.76,Unlimited,SBD,F,
Girls,82.33,11,Roxanne Dominguez,Castleberry,81.19,102.06,52.16,111.13,265.35,Unlimited,SBD,F,
Girls,82.33,12,Valentina Chiquin,Carrollton Creekview,81.19,102.06,49.9,95.25,247.21,Unlimited,SBD,F,
Girls,82.33,DQ,Breanna Zamarripa,North Mesquite,76.66,,,,,Unlimited,SBD,F,
Girls,82.33,DQ,Shanit Iglehart,Mesquite Horn,76.57,86.18,38.56,,,Unlimited,SBD,F,
Girls,90.04,1,Tammy Green,Kemp,89.09,174.63,90.72,161.03,426.38,Unlimited,SBD,F,
Girls,90.04,2,Mia David,Sunnyvale,88,181.44,83.91,133.81,399.16,Unlimited,SBD,F,
Girls,90.04,3,Kamryn Smith,Wylie,89.99,151.95,92.99,151.95,396.89,Unlimited,SBD,F,
Girls,90.04,3,Jaida Jackson,Carrollton Creekview,83.64,131.54,74.84,138.35,344.73,Unlimited,SBD,F,
Girls,90.04,4,Katie Derleth,Sunnyvale,89.54,120.2,65.77,124.74,310.71,Unlimited,SBD,F,
Girls,90.04,5,Haley Gill-Wyatt,Dallas Life Oak Cliff,84.46,136.08,56.7,111.13,303.91,Unlimited,SBD,F,
Girls,90.04,6,Zoey Trevino,Chilton,83.19,122.47,70.31,106.59,299.37,Unlimited,SBD,F,
Girls,90.04,7,Tatum Bridges,Carrollton Creekview,88.27,111.13,70.31,102.06,283.5,Unlimited,SBD,F,
Girls,90.04,8,Yazmin Watkins,North Mesquite,84.46,83.91,45.36,90.72,219.99,Unlimited,SBD,F,
Girls,90.04,9,Scarlet Guardiola,North Mesquite,89.99,61.23,36.29,83.91,181.44,Unlimited,SBD,F,
Girls,90.04,DQ,Victoria Tovar,Castleberry,82.37,127.01,68.04,,,Unlimited,SBD,F,
Girls,100.02,1,Felicity Gamboa,Chilton,94.98,115.67,65.77,115.67,297.1,Unlimited,SBD,F,
Girls,100.02,2,Allye Morton,Wylie,90.72,108.86,45.36,131.54,285.76,Unlimited,SBD,F,
Girls,100.02,3,Kaytlin McGrath,Wylie East,91.81,111.13,47.63,117.93,276.69,Unlimited,SBD,F,
Girls,100.02,4,Hellen Paz,West Mesquite,96.25,97.52,43.09,97.52,238.14,Unlimited,SBD,F,
Girls,110,1,Mariela Valdes,Carrollton Creekview,108.86,176.9,106.59,145.15,428.64,Unlimited,SBD,F,
Girls,110,2,Kiera Parsons,Krum,107.95,151.95,72.57,129.27,353.8,Unlimited,SBD,F,
Girls,110,3,Caryssa Degrate,Chilton,106.14,140.61,83.91,117.93,342.46,Unlimited,SBD,F,
Girls,110,4,Elle Peeples,Wylie East,109.86,136.08,95.25,104.33,335.66,Unlimited,SBD,F,
Girls,110+,1,Peyton Grady,Mesquite Horn,127.55,201.85,102.06,147.42,451.32,Unlimited,SBD,F,
Girls,110+,2,Olivia Wren,Chilton,129.36,167.83,97.52,167.83,433.18,Unlimited,SBD,F,
Girls,110+,3,Cholee Starnes,Mesquite Horn,116.39,129.27,79.38,138.35,347,Unlimited,SBD,F,
Girls,110+,4,Ashley Hernandez,Dallas Life Oak Cliff,124.65,92.99,65.77,106.59,265.35,Unlimited,SBD,F,
