Division,WeightClassKg,Place,Name,Team,BodyweightKg,Best3SquatKg,Best3BenchKg,Best3DeadliftKg,TotalKg,Equipment,Event,Sex,BirthDate
Boys,51.71,1,Kennedy Miller,Henderson,50.35,79.38,58.97,102.06,240.4,Unlimited,SBD,M,
Boys,51.71,2,Justin Vu,Grapeland,44.45,92.99,43.09,102.06,238.14,Unlimited,SBD,M,
Boys,51.71,3,Arthur Arita,Tyler Chapel Hill,49.9,61.23,52.16,95.25,208.65,Unlimited,SBD,M,
Boys,51.71,4,Kolby Lynn,Rusk,50.8,43.09,38.56,88.45,170.1,Unlimited,SBD,M,
Boys,55.79,1,Olandris Feggett,Tyler Chapel Hill,53.07,120.2,90.72,120.2,331.12,Unlimited,SBD,M,
Boys,55.79,2,Drake Arnold,Arp,54.43,83.91,58.97,111.13,254.01,Unlimited,SBD,M,
Boys,55.79,DQ,Ian Eversbeard,Rusk,55.43,88.45,,,,Unlimited,SBD,M,
Boys,55.79,DQ,Brendan Burrows,Rusk,55.52,106.59,,,,Unlimited,SBD,M,
Boys,59.87,1,Jace Harrod,Palestine,59.87,165.56,97.52,170.1,433.18,Unlimited,SBD,M,
Boys,59.87,2,Raul Munoz,New Summerfield,57.61,83.91,58.97,90.72,233.6,Unlimited,SBD,M,
Boys,59.87,DQ,Jordan Rodriguez,Tyler Chapel Hill,59.42,,,,,Unlimited,SBD,M,
Boys,67.13,1,Manny Monterosa,Palestine,62.6,158.76,92.99,183.7,435.45,Unlimited,SBD,M,
Boys,67.13,2,Micah Green,Palestine,65.77,156.49,95.25,165.56,417.3,Unlimited,SBD,M,
Boys,67.13,3,Angel Maldonado,Groveton,66.68,156.49,92.99,165.56,415.04,Unlimited,SBD,M,
Boys,67.13,4,Cooper Perry,Palestine,65.77,156.49,86.18,154.22,396.89,Unlimited,SBD,M,
Boys,67.13,5,Clayton Williams,Arp,66.22,136.08,97.52,158.76,392.36,Unlimited,SBD,M,
Boys,67.13,6,Tony Mondono,Jacksonville,63.96,136.08,83.91,158.76,378.75,Unlimited,SBD,M,
Boys,67.13,7,Colton Anderson,Rusk,64.86,142.88,92.99,142.88,378.75,Unlimited,SBD,M,
Boys,67.13,8,Brendan Dark,Arp,62.6,115.67,95.25,133.81,344.73,Unlimited,SBD,M,
Boys,67.13,9,Derek Cannon,Hawkins,67.13,113.4,90.72,136.08,340.19,Unlimited,SBD,M,
Boys,67.13,10,Mario Hernandez,Tyler Chapel Hill,64.41,127.01,86.18,124.74,337.93,Unlimited,SBD,M,
Boys,67.13,11,Chris Powers,Rusk,63.05,106.59,61.23,108.86,276.69,Unlimited,SBD,M,
Boys,67.13,DQ,Jaroon Cook,Rusk,67.04,129.27,,,,Unlimited,SBD,M,
Boys,67.13,DQ,Zack Garrett,Arp,60.33,165.56,111.13,,,Unlimited,SBD,M,
Boys,67.13,DQ,Trent Powell,Jacksonville,61.23,136.08,,,,Unlimited,SBD,M,
Boys,74.84,1,Martin Camargo,Henderson,74.39,206.38,111.13,219.99,537.51,Unlimited,SBD,M,
Boys,74.84,2,Phoenix Bowman,Groveton,69.85,199.58,108.86,170.1,478.54,Unlimited,SBD,M,
Boys,74.84,3,Adriano Vazquez,Palestine,73.48,183.7,99.79,188.24,471.74,Unlimited,SBD,M,
Boys,74.84,4,Jackson Sherwood,Arp,73.03,165.56,117.93,183.7,467.2,Unlimited,SBD,M,
Boys,74.84,5,Isiah Hill,Palestine,72.57,165.56,106.59,176.9,449.06,Unlimited,SBD,M,
Boys,74.84,6,Landon Conley,Groveton,73.94,172.37,104.33,170.1,446.79,Unlimited,SBD,M,
Boys,74.84,7,Jonathan Cockrell,Pollok Central,73.03,156.49,92.99,170.1,419.57,Unlimited,SBD,M,
Boys,74.84,8,Wyatt Calley,Arp,70.31,133.81,95.25,170.1,399.16,Unlimited,SBD,M,
Boys,74.84,9,Christian Maldonado,Groveton,67.59,136.08,92.99,163.29,392.36,Unlimited,SBD,M,
Boys,74.84,10,Colton Cox,Groveton,71.21,124.74,70.31,145.15,340.19,Unlimited,SBD,M,
Boys,74.84,DQ,Osmar Carrizales,Henderson,74.39,161.03,,,,Unlimited,SBD,M,
Boys,74.84,DQ,Au'maz Jackson,Henderson,68.04,,,,,Unlimited,SBD,M,
Boys,82.1,1,Trystin Ard,Groveton,79.38,217.72,129.27,217.72,564.72,Unlimited,SBD,M,
Boys,82.1,2,Jhony Martinez,Palestine,80.29,195.04,142.88,210.92,548.85,Unlimited,SBD,M,
Boys,82.1,3,Tristan Williamson,Hawkins,81.65,195.04,127.01,181.44,503.49,Unlimited,SBD,M,
Boys,82.1,4,Marcus Rinehart,Hawkins,79.38,174.63,113.4,181.44,469.47,Unlimited,SBD,M,
Boys,82.1,5,Zach Reagan,Palestine,76.2,176.9,102.06,181.44,460.4,Unlimited,SBD,M,
Boys,82.1,6,Walker Dublin,Jacksonville,81.65,158.76,106.59,183.7,449.06,Unlimited,SBD,M,
Boys,82.1,7,Carter Harris,Tyler Chapel Hill,78.47,142.88,111.13,145.15,399.16,Unlimited,SBD,M,
Boys,82.1,8,Cason Weatherton,Henderson,79.38,79.38,156.49,122.47,358.34,Unlimited,SBD,M,
Boys,82.1,9,Hudson Bayless,Rusk,80.47,102.06,79.38,142.88,324.32,Unlimited,SBD,M,
Boys,82.1,10,Cody Butchee,Pollok Central,80.29,90.72,70.31,120.2,281.23,Unlimited,SBD,M,
Boys,89.81,1,Hayden Rasberry,Henderson,88.9,213.19,147.42,199.58,560.19,Unlimited,SBD,M,
Boys,89.81,2,Andrew Hooper,Rusk,86.73,201.85,156.49,183.7,542.04,Unlimited,SBD,M,
Boys,89.81,3,Troy Conley,Hawkins,88,201.85,133.81,197.31,532.97,Unlimited,SBD,M,
Boys,89.81,4,Emmanuel Ponce,Arp,86.18,195.04,124.74,192.78,512.56,Unlimited,SBD,M,
Boys,89.81,5,Drew Diles,Jacksonville,88,156.49,92.99,170.1,419.57,Unlimited,SBD,M,
Boys,89.81,6,Jamario Coleman,Jacksonville,89.81,163.29,90.72,156.49,410.5,Unlimited,SBD,M,
Boys,89.81,7,Andrew Gonzalez,Groveton,86.18,156.49,106.59,145.15,408.23,Unlimited,SBD,M,
Boys,89.81,8,Toby Simpson,Jacksonville,88.45,154.22,90.72,145.15,390.09,Unlimited,SBD,M,
Boys,89.81,9,Jaxon Smith,Henderson,89.36,92.99,113.4,120.2,326.59,Unlimited,SBD,M,
Boys,89.81,10,Nathan Comte,New Summerfield,88.9,113.4,63.5,131.54,308.44,Unlimited,SBD,M,
Boys,89.81,DQ,Robert Spencer,Pollok Central,88.45,111.13,,,,Unlimited,SBD,M,
Boys,89.81,DQ,Jessi Sanchez,Henderson,88.45,195.04,108.86,,,Unlimited,SBD,M,
Boys,99.79,1,Isley Jackson,Hawkins,95.71,199.58,127.01,192.78,519.36,Unlimited,SBD,M,
Boys,99.79,2,Caelan Soultanov,Jacksonville,94.35,163.29,124.74,204.12,492.15,Unlimited,SBD,M,
Boys,99.79,3,Kevin Zamora,Palestine,90.26,204.12,90.72,183.7,478.54,Unlimited,SBD,M,
Boys,99.79,4,Lazaro Rodriguez,Tyler Chapel Hill,91.63,176.9,124.74,174.63,476.27,Unlimited,SBD,M,
Boys,99.79,5,Tye Tamplin,Arp,95.25,170.1,102.06,181.44,453.59,Unlimited,SBD,M,
Boys,99.79,6,Colton Baring,Henderson,91.17,179.17,102.06,170.1,451.32,Unlimited,SBD,M,
Boys,99.79,7,Zachary Suggs,Hawkins,98.88,170.1,108.86,165.56,444.52,Unlimited,SBD,M,
Boys,99.79,8,Waylon McClure,Groveton,93.89,151.95,113.4,158.76,424.11,Unlimited,SBD,M,
Boys,99.79,9,Jack Fisher,Rusk,92.35,163.29,104.33,151.95,419.57,Unlimited,SBD,M,
Boys,99.79,10,Ty Lindsey,Jacksonville,92.08,151.95,104.33,142.88,399.16,Unlimited,SBD,M,
Boys,99.79,11,Jake King,Groveton,98.88,142.88,99.79,154.22,396.89,Unlimited,SBD,M,
Boys,99.79,12,Landon Luce,Grapeland,98.43,156.49,65.77,138.35,360.61,Unlimited,SBD,M,
Boys,109.77,1,Cameron Johnson,Hawkins,105.69,240.4,183.7,170.1,594.21,Unlimited,SBD,M,
Boys,109.77,2,Henry Thirkill,Tyler Chapel Hill,107.5,217.72,192.78,181.44,591.94,Unlimited,SBD,M,
Boys,109.77,3,Kolton Meader,Henderson,102.97,199.58,142.88,217.72,560.19,Unlimited,SBD,M,
Boys,109.77,4,Dallas Gipson,Tyler Chapel Hill,109.77,213.19,138.35,181.44,532.97,Unlimited,SBD,M,
Boys,109.77,5,Alex Ramirez,Jacksonville,106.14,199.58,124.74,199.58,523.9,Unlimited,SBD,M,
Boys,109.77,6,Chris Jenkins,Arp,103.87,215.46,124.74,163.29,503.49,Unlimited,SBD,M,
Boys,109.77,7,Mj Rose,Hawkins,106.59,183.7,115.67,172.37,471.74,Unlimited,SBD,M,
Boys,109.77,8,Carter Holland,Rusk,107.5,185.97,111.13,170.1,467.2,Unlimited,SBD,M,
Boys,109.77,9,Ty Kirkland,Henderson,105.69,188.24,99.79,170.1,458.13,Unlimited,SBD,M,
Boys,109.77,10,Ronnie Williams,Palestine,102.51,183.7,106.59,158.76,449.06,Unlimited,SBD,M,
Boys,109.77,11,Guillermo Vargas,New Summerfield,107.95,158.76,97.52,181.44,437.72,Unlimited,SBD,M,
Boys,109.77,12,Travin Davis,Henderson,104.33,174.63,92.99,158.76,426.38,Unlimited,SBD,M,
Boys,109.77,13,Ethan Hudson,Groveton,100.7,142.88,97.52,165.56,405.97,Unlimited,SBD,M,
Boys,109.77,14,Pedro Garcia,Pollok Central,104.33,142.88,104.33,145.15,392.36,Unlimited,SBD,M,
Boys,109.77,15,Lane Olson,Grapeland,106.14,124.74,86.18,136.08,347,Unlimited,SBD,M,
Boys,109.77,DQ,Logan Townsend,Groveton,102.06,235.87,,,,Unlimited,SBD,M,
Boys,124.74,1,Isaiah Collins,Tyler Chapel Hill,111.58,226.8,142.88,206.38,576.06,Unlimited,SBD,M,
Boys,124.74,2,Calvin Boyd,Jacksonville,119.29,226.8,136.08,188.24,551.11,Unlimited,SBD,M,
Boys,124.74,DQ,Cash Moore,Groveton,117.03,,,,,Unlimited,SBD,M,
Boys,139.71,1,Jesse Ellington,Grapeland,136.08,226.8,183.7,247.21,657.71,Unlimited,SBD,M,
Boys,139.71,2,Jacob Lopez,Rusk,135.26,190.51,142.88,204.12,537.51,Unlimited,SBD,M,
Boys,139.71,3,Matthew Rattiff,Henderson,139.25,197.31,117.93,183.7,498.95,Unlimited,SBD,M,
Boys,139.71,4,Ima Rosales,Rusk,128.82,213.19,113.4,165.56,492.15,Unlimited,SBD,M,
Boys,139.71,5,Jiovann Rangel,Jacksonville,128.37,158.76,106.59,183.7,449.06,Unlimited,SBD,M,
Boys,139.71,DQ,Quinton Hines,Arp,127.01,183.7,111.13,,,Unlimited,SBD,M,
Boys,139.71+,1,Bryce Everett,Arp,162.39,247.21,204.12,219.99,671.32,Unlimited,SBD,M,
Boys,139.71+,2,Justin Ellington,Grapeland,146.51,238.14,174.63,226.8,639.57,Unlimited,SBD,M,
Boys,139.71+,3,Keldrick Davis,Tyler Chapel Hill,140.61,240.4,158.76,210.92,610.08,Unlimited,SBD,M,
Boys,139.71+,4,Julian Garcia,Palestine,142.43,215.46,142.88,206.38,564.72,Unlimited,SBD,M,
Boys,,NS,William Smith III,Grapeland,,,,,,Unlimited,SBD,M,
Boys,,NS,Christian Espinoza,Jacksonville,,,,,,Unlimited,SBD,M,
Boys,,NS,Carlos Arredondo,New Summerfield,,,,,,Unlimited,SBD,M,
Boys,,NS,Aiden Rodgers,Hawkins,,,,,,Unlimited,SBD,M,
