Division,WeightClassKg,Place,Name,Team,BodyweightKg,Best3SquatKg,Best3BenchKg,Best3DeadliftKg,TotalKg,Equipment,Event,Sex,BirthDate
Girls,44.23,1,Hailey Palmer,Lampasas,43.54,77.11,38.56,92.99,208.65,Unlimited,SBD,F,
Girls,44.23,2,Valerie Razo,Bangs,44,77.11,45.36,74.84,197.31,Unlimited,SBD,F,
Girls,44.23,DQ,Jaloma Alivia,Ballinger,43.09,77.11,40.82,,,Unlimited,SBD,F,
Girls,44.23,DQ,Erin Baumann,Mertzon Irion County,36.29,65.77,31.75,,,Unlimited,SBD,F,
Girls,47.85,1,Zoe Baumann,Mertzon Irion County,47.17,102.06,52.16,117.93,272.16,Unlimited,SBD,F,
Girls,47.85,2,Kalista Lara,Goldthwaite,47.17,92.99,56.7,83.91,233.6,Unlimited,SBD,F,
Girls,47.85,3,Halle Maxwell,Burnet,47.63,90.72,43.09,97.52,231.33,Unlimited,SBD,F,
Girls,51.94,1,Emaleigh Argote,San Saba,51.35,90.72,56.7,113.4,260.82,Unlimited,SBD,F,
Girls,51.94,2,Olivia Hoot,Llano,51.71,92.99,49.9,92.99,235.87,Unlimited,SBD,F,
Girls,51.94,3,Ava Speichert,Lampasas,50.8,83.91,38.56,90.72,213.19,Unlimited,SBD,F,
Girls,51.94,4,Rhylie Brewer,Lampasas,50.8,74.84,49.9,83.91,208.65,Unlimited,SBD,F,
Girls,51.94,5,Kemry Ybarra,Lampasas,47.99,77.11,43.09,81.65,201.85,Unlimited,SBD,F,
Girls,51.94,6,Gentry Shepard,Bangs,51.71,65.77,24.95,65.77,156.49,Unlimited,SBD,F,
Girls,56.02,1,Emma Rutledge,Ballinger,54.43,140.61,83.91,142.88,367.41,Unlimited,SBD,F,
Girls,56.02,2,Abby Smith,Burnet,52.16,142.88,81.65,124.74,349.27,Unlimited,SBD,F,
Girls,56.02,3,Josie Teague,Burnet,53.98,127.01,65.77,106.59,299.37,Unlimited,SBD,F,
Girls,56.02,4,Lily Rygaard,Burnet,53.98,120.2,54.43,113.4,288.03,Unlimited,SBD,F,
Girls,56.02,5,Destinie Hayes,Junction,54.88,104.33,52.16,113.4,269.89,Unlimited,SBD,F,
Girls,56.02,6,Madison Morrison,Llano,55.34,95.25,49.9,111.13,256.28,Unlimited,SBD,F,
Girls,56.02,7,Carson Hoot,Llano,53.07,102.06,54.43,95.25,251.74,Unlimited,SBD,F,
Girls,56.02,8,Catalina Isbell,Llano,54.43,92.99,54.43,104.33,251.74,Unlimited,SBD,F,
Girls,56.02,9,Skyler Michaud,Lampasas,53.07,90.72,58.97,97.52,247.21,Unlimited,SBD,F,
Girls,56.02,10,Sophia Storm,Lampasas,55.34,86.18,45.36,108.86,240.4,Unlimited,SBD,F,
Girls,56.02,11,Mikenzie Halfmann,Ballinger,54.43,88.45,45.36,95.25,229.06,Unlimited,SBD,F,
Girls,60.1,1,Loveli Sanders,Ballinger,58.51,145.15,72.57,133.81,351.53,Unlimited,SBD,F,
Girls,60.1,2,Kirsten Poling,Bangs,59.42,127.01,79.38,127.01,333.39,Unlimited,SBD,F,
Girls,60.1,3,Rachel Fry,Llano,59.42,115.67,68.04,117.93,301.64,Unlimited,SBD,F,
Girls,60.1,4,Aurora Ward,Mertzon Irion County,58.06,108.86,56.7,108.86,274.42,Unlimited,SBD,F,
Girls,60.1,5,Alana McDuffee,Ballinger,56.25,102.06,52.16,117.93,272.16,Unlimited,SBD,F,
Girls,60.1,6,Rubi Monroy,Llano,56.25,102.06,63.5,102.06,267.62,Unlimited,SBD,F,
Girls,60.1,7,Hailee Beltran,Burnet,56.7,97.52,54.43,108.86,260.82,Unlimited,SBD,F,
Girls,60.1,8,Jillian Rodriguez,Ballinger,57.15,108.86,47.63,102.06,258.55,Unlimited,SBD,F,
Girls,60.1,9,Gabby Zapata,Bangs,59.87,92.99,47.63,117.93,258.55,Unlimited,SBD,F,
Girls,60.1,10,Denver Conklin,Lampasas,59.42,92.99,52.16,104.33,249.48,Unlimited,SBD,F,
Girls,60.1,11,Karla Espinoza,Junction,57.15,81.65,52.16,102.06,235.87,Unlimited,SBD,F,
Girls,60.1,12,Emily Gonzalez,Lampasas,59.42,83.91,47.63,102.06,233.6,Unlimited,SBD,F,
Girls,60.1,13,Eva Bradley,Lometa,58.06,90.72,43.09,90.72,224.53,Unlimited,SBD,F,
Girls,60.1,14,Sally Powell,Bangs,59.87,74.84,34.02,88.45,197.31,Unlimited,SBD,F,
Girls,60.1,15,Abigail Gonzalez,San Saba,59.06,74.84,31.75,79.38,185.97,Unlimited,SBD,F,
Girls,67.36,1,Kasey Solis,Bangs,62.14,145.15,61.23,136.08,342.46,Unlimited,SBD,F,
Girls,67.36,2,Maddison Henry,Lometa,66.22,127.01,70.31,117.93,315.25,Unlimited,SBD,F,
Girls,67.36,3,Cambree Hoyt,Llano,66.68,122.47,61.23,117.93,301.64,Unlimited,SBD,F,
Girls,67.36,4,Maddie Dixon,Ballinger,64.41,111.13,56.7,124.74,292.57,Unlimited,SBD,F,
Girls,67.36,5,Gracie Farmer,Burnet,63.5,97.52,54.43,122.47,274.42,Unlimited,SBD,F,
Girls,67.36,6,Amberlyn Glasscock,Burnet,61.23,106.59,47.63,115.67,269.89,Unlimited,SBD,F,
Girls,67.36,7,Ashlee Flores,Lampasas,63.5,104.33,56.7,97.52,258.55,Unlimited,SBD,F,
Girls,67.36,8,Perla Ramirez,San Saba,67.31,81.65,40.82,88.45,210.92,Unlimited,SBD,F,
Girls,67.36,9,Alyssa Whisenhunt,Jonesboro,64.41,81.65,34.02,92.99,208.65,Unlimited,SBD,F,
Girls,67.36,10,Mckenna Kepler,Lometa,66.22,81.65,34.02,92.99,208.65,Unlimited,SBD,F,
Girls,67.36,DQ,Jalynn Carrillo,Bangs,67.13,,,,,Unlimited,SBD,F,
Girls,67.36,DQ,Justice Baker #2,Bangs,63.5,,,,,Unlimited,SBD,F,
Girls,75.07,1,Alexis Leatherwood,Burnet,71.67,140.61,65.77,138.35,344.73,Unlimited,SBD,F,
Girls,75.07,2,Addyson King,Ballinger,73.94,133.81,68.04,131.54,333.39,Unlimited,SBD,F,
Girls,75.07,3,Stormy Stringer,Bangs,74.84,142.88,77.11,108.86,328.85,Unlimited,SBD,F,
Girls,75.07,4,Hannah Haddon,Ballinger,74.39,124.74,58.97,133.81,317.51,Unlimited,SBD,F,
Girls,75.07,5,Amaya Cabrera,Goldthwaite,71.21,129.27,56.7,129.27,315.25,Unlimited,SBD,F,
Girls,75.07,6,Nyomi Hernandez,Ballinger,72.57,108.86,61.23,129.27,299.37,Unlimited,SBD,F,
Girls,75.07,7,Rebecca Vaughn,Llano,71.21,115.67,63.5,113.4,292.57,Unlimited,SBD,F,
Girls,75.07,8,Carleigh Imrie,Burnet,72.57,97.52,47.63,102.06,247.21,Unlimited,SBD,F,
Girls,75.07,DQ,Kiara Mata,Ballinger,68.95,113.4,79.38,,,Unlimited,SBD,F,
Girls,82.33,1,Carolina Cervantes,San Saba,81.65,163.29,68.04,149.69,381.02,Unlimited,SBD,F,
Girls,82.33,2,Arianna Bermudez,Lampasas,80.74,163.29,81.65,131.54,376.48,Unlimited,SBD,F,
Girls,82.33,3,Kimberly Watson,Burnet,78.02,131.54,70.31,131.54,333.39,Unlimited,SBD,F,
Girls,82.33,4,Valeria Macias,San Saba,81.87,138.35,52.16,138.35,328.85,Unlimited,SBD,F,
Girls,82.33,5,Tyler Wells,Lampasas,77.11,113.4,56.7,113.4,283.5,Unlimited,SBD,F,
Girls,82.33,6,Kasey Watson,Burnet,78.93,99.79,61.23,113.4,274.42,Unlimited,SBD,F,
Girls,82.33,7,Marley Champeau,Lampasas,78.47,104.33,43.09,117.93,265.35,Unlimited,SBD,F,
Girls,82.33,8,Maddie Cohn,Jonesboro,79.83,102.06,61.23,95.25,258.55,Unlimited,SBD,F,
Girls,82.33,DQ,Ili Modesto,Junction,78.02,149.69,65.77,,,Unlimited,SBD,F,
Girls,82.33,DQ,Claire Seybert,Bangs,82.1,127.01,70.31,,,Unlimited,SBD,F,
Girls,90.04,1,Maddy Cardenas,Burnet,82.55,129.27,65.77,136.08,331.12,Unlimited,SBD,F,
Girls,90.04,2,Hadley Howard,Lampasas,86.18,113.4,70.31,104.33,288.03,Unlimited,SBD,F,
Girls,90.04,3,Jasmine Lewis,Bangs,89.81,115.67,47.63,115.67,278.96,Unlimited,SBD,F,
Girls,90.04,4,Caitlin Wilkerson,Junction,84.82,113.4,54.43,102.06,269.89,Unlimited,SBD,F,
Girls,90.04,5,Ishylia Cummings,Lampasas,84.37,102.06,52.16,111.13,265.35,Unlimited,SBD,F,
Girls,90.04,DQ,Maddi Moise,Burnet,88,122.47,,,,Unlimited,SBD,F,
Girls,90.04,DQ,Allison Leitch,Junction,85.73,,,,,Unlimited,SBD,F,
Girls,100.02,1,Sophia Cuevas,San Saba,99.7,131.54,72.57,117.93,322.05,Unlimited,SBD,F,
Girls,100.02,2,Mary Jane Cantu,San Saba,98.11,111.13,61.23,113.4,285.76,Unlimited,SBD,F,
Girls,110,1,Camrie Henderson,Llano,100.7,129.27,58.97,113.4,301.64,Unlimited,SBD,F,
Girls,110+,1,Joely Norton,Junction,142.52,74.84,43.09,68.04,185.97,Unlimited,SBD,F,
