Division,WeightClassKg,Place,Name,Team,BodyweightKg,Best3SquatKg,Best3BenchKg,Best3DeadliftKg,TotalKg,Equipment,Event,Sex,BirthDate
Boys,51.71,1,Damian Ash,Royse City,50.35,149.69,90.72,145.15,385.55,Unlimited,SBD,M,
Boys,51.71,2,Jeremiah Jackson,Royse City,49.9,104.33,70.31,102.06,276.69,Unlimited,SBD,M,
Boys,51.71,3,Angel Delrio,Forney,50.35,95.25,49.9,104.33,249.48,Unlimited,SBD,M,
Boys,51.71,4,Chance Walker,Ferris,47.63,81.65,52.16,86.18,219.99,Unlimited,SBD,M,
Boys,51.71,5,Aaron Cisneros,Bishop Lynch,48.99,70.31,47.63,102.06,219.99,Unlimited,SBD,M,
Boys,55.79,1,Braulio Rodriguez,Nevada Community,54.88,183.7,124.74,204.12,512.56,Unlimited,SBD,M,
Boys,55.79,2,Kevin Chavez,Royse City,53.98,163.29,79.38,181.44,424.11,Unlimited,SBD,M,
Boys,55.79,3,Graysen Patterson,Quinlan Ford,55.79,113.4,74.84,147.42,335.66,Unlimited,SBD,M,
Boys,55.79,4,Israel Alaniz,Wills Point,54.88,106.59,65.77,106.59,278.96,Unlimited,SBD,M,
Boys,55.79,5,Eric Melendez,Carrollton Turner,54.88,102.06,58.97,113.4,274.42,Unlimited,SBD,M,
Boys,55.79,DQ,Jared Ricker,Royse City,53.07,,77.11,142.88,,Unlimited,SBD,M,
Boys,59.87,1,Nathan Kolstad,Nevada Community,59.06,188.24,90.72,170.1,449.06,Unlimited,SBD,M,
Boys,59.87,2,Anthony Rosales,Princeton,59.24,174.63,92.99,181.44,449.06,Unlimited,SBD,M,
Boys,59.87,3,Cole Crawford,Royse City,58.97,149.69,92.99,129.27,371.95,Unlimited,SBD,M,
Boys,59.87,4,Nathan Vargas,Forney,59.42,133.81,83.91,145.15,362.87,Unlimited,SBD,M,
Boys,59.87,5,Kayden Simms,Royse City,57.61,127.01,81.65,147.42,356.07,Unlimited,SBD,M,
Boys,59.87,6,Seth Jenkins,Wills Point,58.51,136.08,68.04,142.88,347,Unlimited,SBD,M,
Boys,59.87,7,Mario De La Paz,Wills Point,57.15,129.27,86.18,124.74,340.19,Unlimited,SBD,M,
Boys,67.13,1,Austin Reynolds,Royse City,66.68,208.65,142.88,201.85,553.38,Unlimited,SBD,M,
Boys,67.13,2,Landry Hoffman,Royse City,66.68,204.12,122.47,201.85,528.44,Unlimited,SBD,M,
Boys,67.13,3,Michael Lopez,Princeton,65.32,199.58,111.13,195.04,505.76,Unlimited,SBD,M,
Boys,67.13,4,Jose Elisondo,Carrollton Turner,65.32,192.78,120.2,185.97,498.95,Unlimited,SBD,M,
Boys,67.13,5,Jacob Walker,Princeton,66.22,181.44,97.52,197.31,476.27,Unlimited,SBD,M,
Boys,67.13,6,Quaylin Milligan,Forney,65.77,158.76,86.18,199.58,444.52,Unlimited,SBD,M,
Boys,67.13,7,Brannon Stetson,Royse City,67.13,170.1,88.45,183.7,442.25,Unlimited,SBD,M,
Boys,67.13,8,Josias Ramirez-Diaz,Quinlan Ford,66.22,158.76,113.4,161.03,433.18,Unlimited,SBD,M,
Boys,67.13,9,Robert Parsons,Bishop Lynch,61.69,170.1,90.72,158.76,419.57,Unlimited,SBD,M,
Boys,67.13,10,Samuel Carter,Mabank,62.6,131.54,99.79,181.44,412.77,Unlimited,SBD,M,
Boys,67.13,11,Cooper O'Neal,Wills Point,62.6,158.76,90.72,145.15,394.63,Unlimited,SBD,M,
Boys,67.13,12,Brody Smith,Quinlan Ford,66.22,165.56,61.23,158.76,385.55,Unlimited,SBD,M,
Boys,67.13,13,Jayden Heath,Forney,65.77,142.88,90.72,142.88,376.48,Unlimited,SBD,M,
Boys,67.13,14,Joseph Hastings,Wills Point,66.22,136.08,92.99,142.88,371.95,Unlimited,SBD,M,
Boys,67.13,15,Timothy Van Dyke,Nevada Community,63.96,131.54,72.57,165.56,369.68,Unlimited,SBD,M,
Boys,67.13,16,Maddox McCrossen,Mabank,63.96,145.15,83.91,136.08,365.14,Unlimited,SBD,M,
Boys,67.13,17,Tito Siewczynski,Dallas Jesuit,66.22,138.35,77.11,138.35,353.8,Unlimited,SBD,M,
Boys,67.13,18,Majd Aicha,Royse City,60.78,136.08,79.38,129.27,344.73,Unlimited,SBD,M,
Boys,67.13,19,Michael Johnson,South Garland,62.14,133.81,68.04,136.08,337.93,Unlimited,SBD,M,
Boys,67.13,20,Reed Radelat,Dallas Jesuit,63.5,117.93,77.11,127.01,322.05,Unlimited,SBD,M,
Boys,67.13,21,Kaden Simpson,Quinlan Ford,65.77,92.99,61.23,142.88,297.1,Unlimited,SBD,M,
Boys,67.13,22,Zayvain Green,Dallas Lincoln,67.13,83.91,65.77,115.67,265.35,Unlimited,SBD,M,
Boys,67.13,23,Ethan Gilbert,Royse City,62.6,90.72,63.5,97.52,251.74,Unlimited,SBD,M,
Boys,74.84,1,Easton McMillan,Forney,73.48,251.74,158.76,215.46,625.96,Unlimited,SBD,M,
Boys,74.84,2,Blake Kurtz,Royse City,73.03,210.92,129.27,190.51,530.7,Unlimited,SBD,M,
Boys,74.84,3,Diesel Tijerina,Royse City,73.48,201.85,129.27,192.78,523.9,Unlimited,SBD,M,
Boys,74.84,4,Hunter Boswell,Mabank,70.31,199.58,117.93,176.9,494.42,Unlimited,SBD,M,
Boys,74.84,5,Patrick Moreno,Carrollton Turner,72.12,181.44,113.4,192.78,487.61,Unlimited,SBD,M,
Boys,74.84,6,Jace Oliver,Royse City,71.67,170.1,102.06,181.44,453.59,Unlimited,SBD,M,
Boys,74.84,7,Alejandro Cardiel,Wills Point,73.48,174.63,108.86,165.56,449.06,Unlimited,SBD,M,
Boys,74.84,8,Jayden Jones,Bishop Lynch,72.12,149.69,102.06,192.78,444.52,Unlimited,SBD,M,
Boys,74.84,9,Nicholas Patterson,Mabank,74.84,158.76,111.13,170.1,439.98,Unlimited,SBD,M,
Boys,74.84,10,Stone Warren,Quinlan Ford,73.03,147.42,92.99,188.24,428.64,Unlimited,SBD,M,
Boys,74.84,11,Emmanuel Sevilla,Quinlan Ford,71.67,147.42,102.06,176.9,426.38,Unlimited,SBD,M,
Boys,74.84,12,Carson Miller,Nevada Community,70.76,156.49,79.38,181.44,417.3,Unlimited,SBD,M,
Boys,74.84,13,Caleb Van Duinen,Dallas Jesuit,71.21,151.95,88.45,167.83,408.23,Unlimited,SBD,M,
Boys,74.84,14,Pierson Fontane,Bishop Lynch,71.67,138.35,104.33,151.95,394.63,Unlimited,SBD,M,
Boys,74.84,15,Daniel Benitez,Nevada Community,73.94,142.88,86.18,161.03,390.09,Unlimited,SBD,M,
Boys,74.84,16,Reese Mattorano,Dallas Jesuit,74.84,147.42,77.11,158.76,383.29,Unlimited,SBD,M,
Boys,74.84,17,Brandon Nguyen,Garland Naaman Forest,69.4,124.74,90.72,163.29,378.75,Unlimited,SBD,M,
Boys,74.84,18,Zaelyn Leffall,Royse City,70.31,151.95,79.38,140.61,371.95,Unlimited,SBD,M,
Boys,74.84,19,Carlos Pineda,Carrollton Turner,74.84,136.08,81.65,151.95,369.68,Unlimited,SBD,M,
Boys,74.84,20,Jacob James,Royse City,73.48,113.4,97.52,151.95,362.87,Unlimited,SBD,M,
Boys,74.84,21,Chris Cantu,Ferris,69.4,113.4,70.31,138.35,322.05,Unlimited,SBD,M,
Boys,74.84,22,Isaac Robinson,Dallas Lincoln,74.84,77.11,79.38,136.08,292.57,Unlimited,SBD,M,
Boys,74.84,23,Kamryn Shannon,Dallas Lincoln,72.57,83.91,65.77,136.08,285.76,Unlimited,SBD,M,
Boys,74.84,24,Marlowe Polma,Dallas Jesuit,73.03,83.91,56.7,104.33,244.94,Unlimited,SBD,M,
Boys,74.84,DQ,Manny Martinez,Princeton,68.49,206.38,,215.46,,Unlimited,SBD,M,
Boys,74.84,DQ,Grady Upchurch,Princeton,73.94,206.38,,,,Unlimited,SBD,M,
Boys,82.1,1,Colton Monroe,Bishop Lynch,80.74,283.5,183.7,242.67,709.87,Unlimited,SBD,M,
Boys,82.1,2,Will Ngyuen,Princeton,80.29,238.14,174.63,213.19,625.96,Unlimited,SBD,M,
Boys,82.1,3,Blake White,Quinlan Ford,80.74,204.12,136.08,235.87,576.06,Unlimited,SBD,M,
Boys,82.1,4,Gabe Duncan,Royse City,79.38,192.78,142.88,183.7,519.36,Unlimited,SBD,M,
Boys,82.1,5,David Deatherage,Mabank,79.38,204.12,120.2,192.78,517.1,Unlimited,SBD,M,
Boys,82.1,6,Tanner Williams,Princeton,77.56,213.19,108.86,183.7,505.76,Unlimited,SBD,M,
Boys,82.1,7,Bladimir Pena,Carrollton Turner,79.38,192.78,108.86,204.12,505.76,Unlimited,SBD,M,
Boys,82.1,8,LaDatrick Robinson,Forney,79.38,204.12,102.06,188.24,494.42,Unlimited,SBD,M,
Boys,82.1,9,Landon Eastep,Mabank,81.65,190.51,106.59,190.51,487.61,Unlimited,SBD,M,
Boys,82.1,10,Caiden Pendola,Dallas Jesuit,79.38,174.63,108.86,195.04,478.54,Unlimited,SBD,M,
Boys,82.1,11,Demarcus Johnson,Royse City,78.02,158.76,108.86,170.1,437.72,Unlimited,SBD,M,
Boys,82.1,12,Andres Aislant,Carrollton Turner,75.75,145.15,92.99,165.56,403.7,Unlimited,SBD,M,
Boys,82.1,13,Gabe Alaniz,Wills Point,80.74,147.42,86.18,161.03,394.63,Unlimited,SBD,M,
Boys,82.1,14,Jayden Luna,Ferris,79.83,142.88,83.91,151.95,378.75,Unlimited,SBD,M,
Boys,82.1,15,Lisandro Diaz,South Garland,81.65,142.88,70.31,147.42,360.61,Unlimited,SBD,M,
Boys,82.1,16,Daniel Starkey,Royse City,79.38,136.08,83.91,131.54,351.53,Unlimited,SBD,M,
Boys,82.1,17,Miguel Vera,South Garland,81.65,129.27,70.31,138.35,337.93,Unlimited,SBD,M,
Boys,89.81,1,Daniel Tyutyunnik,Princeton,89.36,231.33,115.67,265.35,612.35,Unlimited,SBD,M,
Boys,89.81,2,Aiden McGinnis,Bishop Lynch,87.09,197.31,145.15,260.82,603.28,Unlimited,SBD,M,
Boys,89.81,3,Elvis Carrera,Ferris,86.64,226.8,154.22,219.99,601.01,Unlimited,SBD,M,
Boys,89.81,4,Robbie Martinez,Carrollton Turner,83.46,213.19,142.88,213.19,569.26,Unlimited,SBD,M,
Boys,89.81,5,Saul Sanchez,Bishop Lynch,88,204.12,142.88,199.58,546.58,Unlimited,SBD,M,
Boys,89.81,6,Edgar Castilla,Carrollton Turner,88.9,192.78,124.74,226.8,544.31,Unlimited,SBD,M,
Boys,89.81,7,Jake Samples,Wills Point,86.64,183.7,127.01,224.53,535.24,Unlimited,SBD,M,
Boys,89.81,8,Nathan Carruth,Mabank,84.37,195.04,131.54,204.12,530.7,Unlimited,SBD,M,
Boys,89.81,9,Jonthan Walters,Princeton,87.09,226.8,122.47,181.44,530.7,Unlimited,SBD,M,
Boys,89.81,10,Noah Grill,Royse City,89.81,197.31,133.81,185.97,517.1,Unlimited,SBD,M,
Boys,89.81,11,Boston Hand,Mabank,89.36,170.1,136.08,170.1,476.27,Unlimited,SBD,M,
Boys,89.81,12,Jackson Sorrells,Nevada Community,86.64,188.24,99.79,185.97,474,Unlimited,SBD,M,
Boys,89.81,13,Santiago Moreno,South Garland,89.36,161.03,102.06,181.44,444.52,Unlimited,SBD,M,
Boys,89.81,14,Wilson Watkins,Dallas Jesuit,85.28,174.63,102.06,165.56,442.25,Unlimited,SBD,M,
Boys,89.81,15,Colby Langham,Royse City,89.81,167.83,111.13,142.88,421.84,Unlimited,SBD,M,
Boys,89.81,16,Hudson Young,Quinlan Ford,83.01,158.76,92.99,163.29,415.04,Unlimited,SBD,M,
Boys,89.81,17,Thomas Hastings,Wills Point,84.82,154.22,108.86,138.35,401.43,Unlimited,SBD,M,
Boys,89.81,18,Jace Reed,Nevada Community,86.18,145.15,88.45,158.76,392.36,Unlimited,SBD,M,
Boys,89.81,19,Wyatt Blann,Nevada Community,87.09,147.42,83.91,154.22,385.55,Unlimited,SBD,M,
Boys,89.81,20,Hanssel Galdames,South Garland,85.28,120.2,68.04,136.08,324.32,Unlimited,SBD,M,
Boys,89.81,DQ,Jaxon Watjen,Princeton,86.18,195.04,,192.78,,Unlimited,SBD,M,
Boys,89.81,DQ,Cooper Cline,Mabank,85.28,158.76,124.74,,,Unlimited,SBD,M,
Boys,99.79,1,Marc Calderon,Ferris,96.16,240.4,165.56,226.8,632.76,Unlimited,SBD,M,
Boys,99.79,2,Carson Maddox,Wills Point,97.52,254.01,158.76,204.12,616.89,Unlimited,SBD,M,
Boys,99.79,3,Jj Goode,Wills Point,95.71,238.14,161.03,204.12,603.28,Unlimited,SBD,M,
Boys,99.79,4,John Paul Akanga,Forney,92.53,226.8,158.76,201.85,587.4,Unlimited,SBD,M,
Boys,99.79,5,Nathan Fraire,Garland Naaman Forest,97.52,240.4,120.2,215.46,576.06,Unlimited,SBD,M,
Boys,99.79,6,Christian Torres,Mabank,96.16,226.8,163.29,179.17,569.26,Unlimited,SBD,M,
Boys,99.79,7,Landry Hopkins,Forney,95.25,188.24,133.81,195.04,517.1,Unlimited,SBD,M,
Boys,99.79,8,Gabe Weinstien,Bishop Lynch,98.43,204.12,124.74,183.7,512.56,Unlimited,SBD,M,
Boys,99.79,9,Cole Drake,Bishop Lynch,96.16,181.44,147.42,174.63,503.49,Unlimited,SBD,M,
Boys,99.79,10,Garrett Taylor,Nevada Community,93.44,174.63,127.01,192.78,494.42,Unlimited,SBD,M,
Boys,99.79,11,Courtney Jones,Garland Naaman Forest,95.25,190.51,102.06,195.04,487.61,Unlimited,SBD,M,
Boys,99.79,12,Eli Mata,Wills Point,99.79,176.9,131.54,176.9,485.34,Unlimited,SBD,M,
Boys,99.79,13,Austin States,Quinlan Ford,94.8,183.7,99.79,197.31,480.81,Unlimited,SBD,M,
Boys,99.79,14,Kevin Martinez,Dallas Jesuit,93.44,188.24,113.4,176.9,478.54,Unlimited,SBD,M,
Boys,99.79,15,Keyvon Prunty,Princeton,92.08,197.31,106.59,158.76,462.66,Unlimited,SBD,M,
Boys,99.79,16,Payton Wallen,Quinlan Ford,94.35,183.7,106.59,165.56,455.86,Unlimited,SBD,M,
Boys,99.79,17,Manuel Vera,South Garland,94.35,183.7,90.72,181.44,455.86,Unlimited,SBD,M,
Boys,99.79,18,Jesus Gonzales,Ferris,94.8,145.15,117.93,188.24,451.32,Unlimited,SBD,M,
Boys,99.79,19,Hunter Rawlins,Nevada Community,99.79,167.83,88.45,192.78,449.06,Unlimited,SBD,M,
Boys,99.79,20,Jalen McLennan,South Garland,91.63,167.83,90.72,183.7,442.25,Unlimited,SBD,M,
Boys,99.79,21,Ryder Malone,Mabank,93.89,158.76,108.86,142.88,410.5,Unlimited,SBD,M,
Boys,99.79,DQ,Cameron Shinn,Royse City,96.16,,97.52,181.44,,Unlimited,SBD,M,
Boys,99.79,DQ,Jayden Foster,Nevada Community,99.79,206.38,,185.97,,Unlimited,SBD,M,
Boys,109.77,1,Tristan Rodelo,Carrollton Turner,106.14,244.94,131.54,242.67,619.15,Unlimited,SBD,M,
Boys,109.77,2,Seth Yates,Royse City,107.5,215.46,145.15,170.1,530.7,Unlimited,SBD,M,
Boys,109.77,3,Caden Newton,Forney,103.42,206.38,151.95,163.29,521.63,Unlimited,SBD,M,
Boys,109.77,4,Cash Lewis,Forney,100.7,183.7,138.35,192.78,514.83,Unlimited,SBD,M,
Boys,109.77,5,Elian Perez,South Garland,105.23,204.12,111.13,183.7,498.95,Unlimited,SBD,M,
Boys,109.77,6,Hayden Chavez,Bishop Lynch,102.97,199.58,115.67,176.9,492.15,Unlimited,SBD,M,
Boys,109.77,7,Sebastian Lopez,Royse City,101.15,199.58,117.93,142.88,460.4,Unlimited,SBD,M,
Boys,124.74,1,Rafael Perdomo,Garland Naaman Forest,121.11,276.69,167.83,272.16,716.68,Unlimited,SBD,M,
Boys,124.74,2,Corbin Fowler,Quinlan Ford,113.85,251.74,167.83,226.8,646.37,Unlimited,SBD,M,
Boys,124.74,3,Kutter Vlasin,Forney,122.92,226.8,133.81,192.78,553.38,Unlimited,SBD,M,
Boys,124.74,4,Matthew Diosdado,Forney,122.02,215.46,136.08,183.7,535.24,Unlimited,SBD,M,
Boys,124.74,5,Jack Scott,Nevada Community,122.47,192.78,138.35,190.51,521.63,Unlimited,SBD,M,
Boys,124.74,6,Sip Bingham,Princeton,124.28,210.92,120.2,183.7,514.83,Unlimited,SBD,M,
Boys,124.74,7,Jesus Barron,South Garland,117.93,206.38,102.06,183.7,492.15,Unlimited,SBD,M,
Boys,124.74,8,Hamilton Walker,Bishop Lynch,119.75,181.44,120.2,185.97,487.61,Unlimited,SBD,M,
Boys,124.74,9,Jaylon Johnson,Garland Naaman Forest,119.75,156.49,111.13,204.12,471.74,Unlimited,SBD,M,
Boys,124.74,10,Thomas Westerman,Dallas Jesuit,116.57,111.13,90.72,120.2,322.05,Unlimited,SBD,M,
Boys,124.74,11,Antoine Elmore,Dallas Lincoln,116.12,90.72,70.31,124.74,285.76,Unlimited,SBD,M,
Boys,124.74,DQ,Landon Hunsaker,Mabank,113.85,219.99,142.88,,,Unlimited,SBD,M,
Boys,139.71,1,Reuben Logan,Royse City,127.91,249.48,181.44,183.7,614.62,Unlimited,SBD,M,
Boys,139.71,2,Bryan Sanchez,Quinlan Ford,130.18,249.48,149.69,215.46,614.62,Unlimited,SBD,M,
Boys,139.71,3,Hector Platas,South Garland,136.08,206.38,136.08,208.65,551.11,Unlimited,SBD,M,
Boys,139.71,4,Johnny Mancera,Ferris,135.17,210.92,158.76,174.63,544.31,Unlimited,SBD,M,
Boys,139.71,5,Calab Mitchell,Princeton,137.89,158.76,120.2,161.03,439.98,Unlimited,SBD,M,
Boys,139.71,6,Joshua Cruz,Dallas Lincoln,125.19,158.76,97.52,142.88,399.16,Unlimited,SBD,M,
Boys,139.71+,1,Jordan Hooks,Bishop Lynch,150.59,260.82,183.7,231.33,675.85,Unlimited,SBD,M,
Boys,139.71+,2,Saul Jauregi,South Garland,146.51,158.76,90.72,188.24,437.72,Unlimited,SBD,M,
Boys,139.71+,DQ,Brennan Lockhart,Ferris,151.5,183.7,,219.99,,Unlimited,SBD,M,
