Place,Name,Division,Equipment,Event,BirthDate,BirthYear,Sex,BodyweightKg,WeightClassKg,Squat1Kg,Squat2Kg,Squat3Kg,Best3SquatKg,Bench1Kg,Bench2Kg,Bench3Kg,Best3BenchKg,Deadlift1Kg,Deadlift2Kg,Deadlift3Kg,Best3DeadliftKg,TotalKg
1,Tess Kubyn,Sub-Juniors,Raw,SBD,,2008,F,45.82,47,92.5,97.5,-102.5,97.5,37.5,40,42.5,42.5,92.5,97.5,102.5,102.5,242.5
1,Lou-Eva Clerc,Sub-Juniors,Raw,SBD,,2006,F,63.4,69,-100,105,112.5,112.5,52.5,55,60,60,-100,112.5,115,115,287.5
1,Margot Casier,Juniors,Raw,SBD,,2004,F,61.35,63,77.5,85,90,90,42.5,47.5,50,50,82.5,90,95,95,235
1,Manon Menard,Juniors,Raw,SBD,,2001,F,66.35,69,117.5,122.5,-127.5,122.5,60,65,67.5,67.5,125,130,-135,130,320
1,Barbara Santos De Almeida,Seniors,Raw,SBD,,1997,F,51.88,52,132.5,140,-142.5,140,72.5,77.5,80,80,150,157.5,160,160,380
2,Kenza Bakir,Seniors,Raw,SBD,,1993,F,51,52,127.5,132.5,135,135,60,62.5,65,65,142.5,150,-155,150,350
1,Oceane Szymanski,Seniors,Raw,SBD,,2000,F,62.1,63,102.5,110,115,115,55,60,-65,60,117.5,130,137.5,137.5,312.5
1,Manon Ettori,Seniors,Raw,SBD,,1998,F,71.7,76,135,140,145,145,65,67.5,70,70,160,170,175,175,390
1,Cassandra Lecocq,Seniors,Raw,SBD,,1995,F,81.1,84,-125,125,-135,125,50,55,60,60,120,130,140,140,325
1,Emeline Rudnik,Seniors,Raw,SBD,,1992,F,91.5,84+,95,-102.5,-110,95,55,60,65,65,125,135,145,145,305
1,Emilie Clavier,Masters 1,Raw,SBD,,1979,F,67.45,69,145,155,160,160,92.5,-97.5,97.5,97.5,160,172.5,180,180,437.5
1,Lenny Barale,Sub-Juniors,Raw,SBD,,2006,M,71.6,74,200,210,-220,210,110,-115,-115,110,220,230,240,240,560
2,Noah Roquer,Sub-Juniors,Raw,SBD,,2006,M,69.75,74,147.5,155,162.5,162.5,90,97.5,102.5,102.5,180,195,-202.5,195,460
1,Kemil Bekhakhcha,Sub-Juniors,Raw,SBD,,2006,M,91.95,93,160,170,180,180,102.5,-105,-105,102.5,205,220,-230,220,502.5
1,Jules Moreau,Juniors,Raw,SBD,,2001,M,66,66,125,135,140,140,92.5,97.5,100,100,185,195,205,205,445
2,Sylvain Aboulinc,Juniors,Raw,SBD,,2001,M,65.7,66,130,-140,-140,130,80,-85,-85,80,-150,-150,150,150,360
1,Victor Roubaud,Juniors,Raw,SBD,,2002,M,82.3,83,200,210,-220,210,145,147.5,-150,147.5,235,245,-252.5,245,602.5
2,Nathan Lafon,Juniors,Raw,SBD,,2005,M,82.65,83,210,-215,215,215,160,165,-170,165,-210,220,-232.5,220,600
3,Leo Gimeno,Juniors,Raw,SBD,,2001,M,82.6,83,160,170,180,180,135,142.5,-150,142.5,175,190,-202.5,190,512.5
1,Jawad Benchkoura Faure,Juniors,Raw,SBD,,2003,M,91.1,93,215,-225,-225,215,140,150,-155,150,240,255,260,260,625
1,Theo Colliot-Martinez,Juniors,Raw,SBD,,2004,M,100.8,105,185,197.5,205,205,120,132.5,140,140,210,220,230,230,575
2,Corentin Gouilloux,Juniors,Raw,SBD,,2004,M,103.4,105,175,190,-200,190,-95,100,-105,100,165,180,-190,180,470
1,Nessim Ben Hamadi,Juniors,Raw,SBD,,2002,M,125.5,120+,207.5,217.5,230,230,125,130,-137.5,130,240,255,-270,255,615
1,Lucas Mazella,Seniors,Raw,SBD,,1999,M,60.8,66,145,152.5,160,160,120,125,-130,125,185,195,205,205,490
2,Richard Combes,Seniors,Raw,SBD,,1986,M,63.45,66,150,160,-165,160,-120,120,125,125,160,175,185,185,470
1,Hugo Perreu,Seniors,Raw,SBD,,1997,M,73.7,74,205,210,-220,210,145,155,-160,155,240,250,-257.5,250,615
2,Emmanuel Coriolan,Seniors,Raw,SBD,,1991,M,72.7,74,130,137.5,145,145,-105,105,-112.5,105,185,-192.5,192.5,192.5,442.5
3,Maurizio Bellagamba,Seniors,Raw,SBD,,1992,M,72.1,74,130,137.5,142.5,142.5,80,87.5,-92.5,87.5,155,165,172.5,172.5,402.5
1,Jeremy Borel-Garin,Seniors,Raw,SBD,,1998,M,83,83,160,-167.5,-175,160,100,-105,-105,100,210,225,235,235,495
1,Jérémy Benoit,Seniors,Raw,SBD,,1993,M,91.8,93,250,260,-265,260,160,167.5,-170,167.5,287.5,-300,300,300,727.5
2,Kevin Gilles,Seniors,Raw,SBD,,1993,M,91.9,93,190,197.5,-200,197.5,115,120,125,125,215,225,230,230,552.5
1,Maxime Labardin,Seniors,Raw,SBD,,1991,M,104.6,105,247.5,260,270,270,172.5,180,182.5,182.5,287.5,300,-307.5,300,752.5
2,Mickael Santarelli,Seniors,Raw,SBD,,1991,M,105,105,230,245,250,250,165,175,182.5,182.5,270,300,-307.5,300,732.5
3,Aldric Guy,Seniors,Raw,SBD,,2000,M,96.6,105,-190,-190,190,190,-115,115,120,120,190,205,-215,205,515
1,Sébastien Hupfer,Masters 1,Raw,SBD,,1981,M,91.8,93,-260,275,280,280,155,160,165,165,250,280,-285,280,725
1,Ali Hamadi,Masters 2,Raw,SBD,,1967,M,92.25,93,145,155,157.5,157.5,107.5,115,117.5,117.5,185,200,-205,200,475
1,Jean Claude Larbi,Masters 4,Raw,SBD,,1948,M,91.3,93,75,85,92.5,92.5,55,60,62.5,62.5,-160,165,,165,320
2,Michel Lavie,Masters 4,Raw,SBD,,1950,M,90.7,93,75,80,82.5,82.5,90,95,97.5,97.5,115,120,,120,300
1,Lou-Eva Clerc,Sub-Juniors,Raw,B,,2006,F,63,63,,,,,57.5,60,-62.5,60,,,,,60
1,Axelle Michel,Seniors,Raw,B,,1989,F,62.35,63,,,,,70,75,-80,75,,,,,75
1,Emilie Clavier,Masters 1,Raw,B,,1979,F,67,69,,,,,92.5,97.5,100,100,,,,,100
1,Stephanie Duboux,Masters 1,Raw,B,,1976,F,75.05,76,,,,,82.5,87.5,90,90,,,,,90
1,Sylvie Knafo,Masters 2,Raw,B,,1974,F,51.3,52,,,,,37.5,-40,40,40,,,,,40
1,Andrée Duboux,Masters 4,Raw,B,,1946,F,54.7,57,,,,,47.5,50,52.5,52.5,,,,,52.5
1,Paul Bonnello,Sub-Juniors,Raw,B,,2007,M,73.6,74,,,,,-117.5,117.5,122.5,122.5,,,,,122.5
1,Ellliott Martinez,Juniors,Raw,B,,2003,M,64.45,66,,,,,125,130,135,135,,,,,135
2,Noah Bottagisi,Juniors,Raw,B,,2005,M,65.75,66,,,,,112.5,120,-125,120,,,,,120
1,Ugo Tricas,Juniors,Raw,B,,2003,M,73.7,74,,,,,130,135,-137.5,135,,,,,135
1,Nolan Amaouche,Juniors,Raw,B,,2005,M,87.9,93,,,,,115,120,-122.5,120,,,,,120
1,Julien Dimitrief Dontcheff,Juniors,Raw,B,,2004,M,97.8,105,,,,,127.5,135,-140,135,,,,,135
1,Richard Combes,Seniors,Raw,B,,1986,M,64.25,66,,,,,125,-135,-135,125,,,,,125
1,Léo Ottinger,Seniors,Raw,B,,2000,M,93,93,,,,,215,220,-225,220,,,,,220
2,Théo Gouffin,Seniors,Raw,B,,1997,M,92.5,93,,,,,140,-145,-145,140,,,,,140
1,Mickael Santarelli,Seniors,Raw,B,,1991,M,105,105,,,,,175,185,-190,185,,,,,185
1,Aymeric Vasseur,Seniors,Raw,B,,2000,M,112.15,120,,,,,200,205,-207.5,205,,,,,205
1,Volkan Ay,Masters 1,Raw,B,,1982,M,73.6,74,,,,,125,,,125,,,,,125
1,Michel Aguilera,Masters 2,Raw,B,,1966,M,92.45,93,,,,,130,137.5,142.5,142.5,,,,,142.5
1,Philippe Caracchioli,Masters 2,Raw,B,,1965,M,104.45,105,,,,,122.5,-127.5,-127.5,122.5,,,,,122.5
1,Raphael Messi,Masters 2,Raw,B,,1972,M,123.9,120+,,,,,180,185,190,190,,,,,190
1,Claude Simian,Masters 3,Raw,B,,1963,M,102.2,105,,,,,160,167.5,-172.5,167.5,,,,,167.5
1,Michel Lavie,Masters 4,Raw,B,,1950,M,81,83,,,,,90,95,97.5,97.5,,,,,97.5
