Division,WeightClassKg,Place,Name,Team,BodyweightKg,Best3SquatKg,Best3BenchKg,Best3DeadliftKg,TotalKg,Equipment,Event,Sex,BirthDate
Boys,59.87,1,Fisher Lestos,Galveston Ball,59.87,140.61,90.72,151.95,383.29,Unlimited,SBD,M,
Boys,67.13,1,Keenan Lawrence,La Porte,66.86,188.24,124.74,226.8,539.77,Unlimited,SBD,M,
Boys,67.13,2,Elijah Wilson,Pasadena Memorial,63.14,149.69,97.52,161.03,408.23,Unlimited,SBD,M,
Boys,74.84,1,Raymond Gibbs,La Porte,72.21,176.9,106.59,204.12,487.61,Unlimited,SBD,M,
Boys,74.84,2,Jadon Alexander,Galveston Ball,73.03,174.63,102.06,158.76,435.45,Unlimited,SBD,M,
Boys,82.1,1,Ethan Burden,Pasadena Memorial,81.92,224.53,136.08,224.53,585.13,Unlimited,SBD,M,
Boys,82.1,2,Kevin Rojas de Ordonez,La Porte,78.74,179.17,136.08,183.7,498.95,Unlimited,SBD,M,
Boys,82.1,3,Richard Quiroz,Galveston Ball,82.1,174.63,108.86,183.7,467.2,Unlimited,SBD,M,
Boys,82.1,4,Will Joiner,Pasadena Dobie,80.01,183.7,92.99,179.17,455.86,Unlimited,SBD,M,
Boys,89.81,1,Fabian Garza,Pasadena Memorial,89.27,240.4,161.03,238.14,639.57,Unlimited,SBD,M,
Boys,89.81,2,Christopher Contreras,Pasadena Dobie,88.36,199.58,142.88,210.92,553.38,Unlimited,SBD,M,
Boys,89.81,3,Tayton Self,La Porte,89.09,183.7,129.27,208.65,521.63,Unlimited,SBD,M,
Boys,89.81,4,Tommy Sanchez,La Porte,89.45,174.63,120.2,208.65,503.49,Unlimited,SBD,M,
Boys,89.81,5,Isaiah Vivier,Pasadena Dobie,89.72,158.76,97.52,174.63,430.91,Unlimited,SBD,M,
Boys,89.81,DQ,Joey Cancilla,Galveston Ball,89.81,,,,,Unlimited,SBD,M,
Boys,89.81,DQ,Nathaniel Belleville,Pasadena Dobie,89.81,,,,,Unlimited,SBD,M,
Boys,99.79,1,Mauricio Gloria,Pasadena Memorial,93.89,233.6,131.54,222.26,587.4,Unlimited,SBD,M,
Boys,99.79,2,Bransen Shanley,La Porte,95.25,201.85,136.08,201.85,539.77,Unlimited,SBD,M,
Boys,99.79,3,Leon Nguyen,Pasadena Dobie,94.44,204.12,106.59,204.12,514.83,Unlimited,SBD,M,
Boys,99.79,4,Gabriel Sanchez,La Porte,99.2,188.24,120.2,188.24,496.68,Unlimited,SBD,M,
Boys,109.77,1,David Campos,La Porte,106.05,206.38,156.49,206.38,569.26,Unlimited,SBD,M,
Boys,109.77,2,Icsom Jones,La Porte,109.23,174.63,124.74,188.24,487.61,Unlimited,SBD,M,
Boys,124.74,1,Corey Sanders,Galveston Ball,124.74,219.99,149.69,254.01,623.69,Unlimited,SBD,M,
Boys,124.74,2,Landon Guzman,La Porte,123.38,238.14,131.54,197.31,566.99,Unlimited,SBD,M,
Boys,124.74,3,Robert Champs,Galveston Ball,124.74,204.12,120.2,226.8,551.11,Unlimited,SBD,M,
Boys,124.74,4,Pedro Garza,Pasadena Dobie,118.02,215.46,122.47,210.92,548.85,Unlimited,SBD,M,
Boys,124.74,5,Dylan Alford,Galveston Ball,124.74,183.7,124.74,199.58,508.02,Unlimited,SBD,M,
Boys,124.74,6,Dario Rodriguez,Pasadena Dobie,111.49,192.78,102.06,183.7,478.54,Unlimited,SBD,M,
Boys,124.74,DQ,Teddy Charlery,La Porte,113.4,,,,,Unlimited,SBD,M,
Boys,124.74,DQ,Shamen Jackson,Galveston Ball,124.74,,,,,Unlimited,SBD,M,
Boys,139.71,1,Luke Mora,La Porte,136.4,272.16,158.76,226.8,657.71,Unlimited,SBD,M,
Boys,139.71,2,Theo Washington,Pasadena Dobie,130.27,229.06,136.08,226.8,591.94,Unlimited,SBD,M,
Boys,139.71,3,Alberto Ortiz,Pasadena Dobie,130.82,256.28,158.76,165.56,580.6,Unlimited,SBD,M,
Boys,139.71,4,Rey Zertuche,La Porte,126.1,215.46,142.88,213.19,571.53,Unlimited,SBD,M,
Boys,139.71,5,Gunnar Chase,Galveston Ball,129.27,233.6,142.88,195.04,571.53,Unlimited,SBD,M,
Boys,139.71,6,Tommy Fields,Galveston Ball,139.71,206.38,120.2,183.7,510.29,Unlimited,SBD,M,
