Division,WeightClassKg,Place,Name,Team,BodyweightKg,Best3SquatKg,Best3BenchKg,Best3DeadliftKg,TotalKg,Equipment,Event,Sex
Girls,44.23,1,Ally Highful,Los Fresnos,43.41,122.47,49.9,111.13,283.5,Single-ply,SBD,F
Girls,44.23,2,Dani Burget,Weslaco East,43.59,104.33,52.16,115.67,272.16,Single-ply,SBD,F
Girls,44.23,3,Daniela Perez,Los Fresnos,43.09,95.25,43.09,104.33,242.67,Single-ply,SBD,F
Girls,47.85,1,Sophie Avila,Los Fresnos,47.31,124.74,61.23,140.61,326.59,Single-ply,SBD,F
Girls,47.85,2,Stephanie Martinez,Weslaco East,47.22,90.72,45.36,97.52,233.6,Single-ply,SBD,F
Girls,47.85,3,Alexis Rivas #2,Brownsville Lopez,47.31,97.52,38.56,92.99,229.06,Single-ply,SBD,F
Girls,47.85,4,Brittney Salcido,PSJA Memorial,46.63,88.45,40.82,79.38,208.65,Single-ply,SBD,F
Girls,47.85,5,Esmeralda Saldana,Brownsville Lopez,46.31,83.91,34.02,83.91,201.85,Single-ply,SBD,F
Girls,47.85,6,Noemi Adame,Brownsville Porter,45.31,83.91,24.95,86.18,195.04,Single-ply,SBD,F
Girls,47.85,7,Johana Torres,Donna,46.27,61.23,31.75,77.11,170.1,Single-ply,SBD,F
Girls,47.85,DQ,Alexa Alaniz,Brownsville Hanna,46.4,,,,,Single-ply,SBD,F
Girls,51.94,1,Janie Ramos,Weslaco East,51.17,120.2,52.16,138.35,310.71,Single-ply,SBD,F
Girls,51.94,2,Joanna Philo,Los Fresnos,50.94,120.2,49.9,131.54,301.64,Single-ply,SBD,F
Girls,51.94,3,Alexis Torres #2,Los Fresnos,49.99,106.59,56.7,127.01,290.3,Single-ply,SBD,F
Girls,51.94,4,Leena Salinas,Donna,51.44,115.67,45.36,111.13,272.16,Single-ply,SBD,F
Girls,51.94,5,Nicole Rodriguez,Donna North,49.8,77.11,43.09,111.13,231.33,Single-ply,SBD,F
Girls,51.94,6,Kasandra Rodriguez,PSJA Memorial,50.71,72.57,27.22,86.18,185.97,Single-ply,SBD,F
Girls,51.94,7,Sandra Madrigal,Donna,49.71,58.97,27.22,79.38,165.56,Single-ply,SBD,F
Girls,51.94,8,Daisy Castellnos,Santa Rosa,51.39,47.63,27.22,65.77,140.61,Single-ply,SBD,F
Girls,51.94,DQ,Tamara Guerrero,Brownsville Hanna,49.12,133.81,,,,Single-ply,SBD,F
Girls,51.94,DQ,Yvonne Garcia,McAllen Memorial,49.17,70.31,,,,Single-ply,SBD,F
Girls,56.02,1,Ravyn Deangel,Donna,55.25,154.22,65.77,115.67,335.66,Single-ply,SBD,F
Girls,56.02,2,Daisy Galvan,Weslaco East,54.39,124.74,63.5,131.54,319.78,Single-ply,SBD,F
Girls,56.02,3,Briana Ruiz,Los Fresnos,54.2,117.93,54.43,108.86,281.23,Single-ply,SBD,F
Girls,56.02,4,Odalys Alvarado,PSJA,54.25,99.79,56.7,108.86,265.35,Single-ply,SBD,F
Girls,56.02,5,Danielle Rocha,Donna North,55.43,95.25,49.9,108.86,254.01,Single-ply,SBD,F
Girls,56.02,6,Jenacy Avitia,Donna North,55.79,90.72,54.43,97.52,242.67,Single-ply,SBD,F
Girls,56.02,7,Miranda Barraza,Edinburg,53.3,95.25,31.75,108.86,235.87,Single-ply,SBD,F
Girls,56.02,8,Brianna Sanchez,PSJA Memorial,54.57,74.84,38.56,88.45,201.85,Single-ply,SBD,F
Girls,56.02,9,Priscilla Gonzalez,Donna North,53.34,72.57,36.29,88.45,197.31,Single-ply,SBD,F
Girls,56.02,10,Lourdes Sabino,Donna North,53.71,70.31,34.02,86.18,190.51,Single-ply,SBD,F
Girls,56.02,11,Jovanna Rangel,Edinburg Economedes,53.71,43.09,24.95,79.38,147.42,Single-ply,SBD,F
Girls,56.02,DQ,Clarissa Guel,Edinburg Economedes,53.98,43.09,,,,Single-ply,SBD,F
Girls,56.02,DQ,Kristina Martinez,McAllen Memorial,55.75,83.91,,,,Single-ply,SBD,F
Girls,60.1,1,Doris Gutierrez,Weslaco East,59.1,156.49,74.84,158.76,390.09,Single-ply,SBD,F
Girls,60.1,2,Sofia Cruz,Brownsville Hanna,59.15,138.35,63.5,124.74,326.59,Single-ply,SBD,F
Girls,60.1,3,Pina Ovalle,PSJA,59.38,111.13,63.5,140.61,315.25,Single-ply,SBD,F
Girls,60.1,4,Mireya Martinez,PSJA Memorial,60.01,102.06,56.7,104.33,263.08,Single-ply,SBD,F
Girls,60.1,5,Larissa Villanueva,Donna North,57.79,97.52,56.7,102.06,256.28,Single-ply,SBD,F
Girls,60.1,6,Xitlali Montes,Brownsville Hanna,58.56,102.06,38.56,113.4,254.01,Single-ply,SBD,F
Girls,60.1,7,Susan Jaramillo,PSJA Memorial,57.92,95.25,43.09,106.59,244.94,Single-ply,SBD,F
Girls,60.1,8,Nasay Herbert,Brownsville Porter,58.97,95.25,36.29,108.86,240.4,Single-ply,SBD,F
Girls,60.1,9,Genesis Reyes,PSJA,56.79,79.38,38.56,86.18,204.12,Single-ply,SBD,F
Girls,60.1,10,Lori Celedon,McAllen Rowe,59.47,79.38,36.29,83.91,199.58,Single-ply,SBD,F
Girls,60.1,11,Emily Trevino,Brownsville Porter,57.29,81.65,38.56,77.11,197.31,Single-ply,SBD,F
Girls,60.1,12,Odalys Serna,Edinburg Economedes,57.83,74.84,31.75,79.38,185.97,Single-ply,SBD,F
Girls,60.1,DQ,Emily Montemayor,Donna,58.97,83.91,,,,Single-ply,SBD,F
Girls,60.1,DQ,Corina Yanez,Donna,57.06,,,,,Single-ply,SBD,F
Girls,60.1,DQ,Paloma Mendiola,Brownsville Lopez,58.47,108.86,,,,Single-ply,SBD,F
Girls,67.36,1,Julissa Torres,Los Fresnos,64.59,161.03,90.72,151.95,403.7,Single-ply,SBD,F
Girls,67.36,2,Stephanie Trevino,Los Fresnos,65.18,154.22,81.65,154.22,390.09,Single-ply,SBD,F
Girls,67.36,3,Alexandra Chavez,Brownsville Hanna,66.45,165.56,72.57,147.42,385.55,Single-ply,SBD,F
Girls,67.36,4,Norma Chapa,Donna North,66.22,142.88,79.38,156.49,378.75,Single-ply,SBD,F
Girls,67.36,5,Bryanna Ramos,Weslaco East,65.59,136.08,79.38,136.08,351.53,Single-ply,SBD,F
Girls,67.36,6,Alexis Quezada,Los Fresnos,66.13,142.88,61.23,136.08,340.19,Single-ply,SBD,F
Girls,67.36,7,Marisol Pulido,Brownsville Lopez,63.68,136.08,56.7,142.88,335.66,Single-ply,SBD,F
Girls,67.36,8,Val Reyes,Brownsville Hanna,64.32,136.08,61.23,122.47,319.78,Single-ply,SBD,F
Girls,67.36,9,Gabby Haylock,Brownsville Hanna,60.78,124.74,52.16,124.74,301.64,Single-ply,SBD,F
Girls,67.36,10,Amanda Olivarez #1,Donna North,65.95,120.2,65.77,115.67,301.64,Single-ply,SBD,F
Girls,67.36,11,Dalila Sanchez,Donna North,62.6,113.4,49.9,120.2,283.5,Single-ply,SBD,F
Girls,67.36,12,Jennifer Cisneros,Brownsville Lopez,67.27,113.4,52.16,117.93,283.5,Single-ply,SBD,F
Girls,67.36,13,Destini Thomas,Donna,62.32,97.52,70.31,108.86,276.69,Single-ply,SBD,F
Girls,67.36,14,Heidi Villasenor,Donna,67.13,113.4,54.43,108.86,276.69,Single-ply,SBD,F
Girls,67.36,15,Karen Martinez,Donna,66.22,115.67,47.63,106.59,269.89,Single-ply,SBD,F
Girls,67.36,16,Carla De Leon,PSJA Memorial,63.41,102.06,43.09,106.59,251.74,Single-ply,SBD,F
Girls,67.36,17,Joanna Trujillo,Brownsville Porter,61.05,106.59,36.29,92.99,235.87,Single-ply,SBD,F
Girls,67.36,18,Jasmine Gonzalez,Edinburg,65.82,79.38,49.9,104.33,233.6,Single-ply,SBD,F
Girls,67.36,19,Mia Ruiz,McAllen Rowe,63.05,72.57,38.56,86.18,197.31,Single-ply,SBD,F
Girls,67.36,20,Alyssa de la Garza,McAllen Rowe,65.32,54.43,27.22,56.7,138.35,Single-ply,SBD,F
Girls,67.36,21,Alisha Galvan,Santa Rosa,65.73,45.36,27.22,63.5,136.08,Single-ply,SBD,F
Girls,67.36,22,Jaqueline Rios,McAllen Rowe,64.86,45.36,24.95,58.97,129.27,Single-ply,SBD,F
Girls,75.07,1,Jackie Cano,PSJA,71.94,133.81,72.57,124.74,331.12,Single-ply,SBD,F
Girls,75.07,2,Victoria Trevino,PSJA Memorial,71.17,104.33,54.43,108.86,267.62,Single-ply,SBD,F
Girls,75.07,3,Saida Delgado,Brownsville Porter,73.07,99.79,38.56,113.4,251.74,Single-ply,SBD,F
Girls,75.07,4,Melissa Silva,Donna North,74.03,88.45,47.63,115.67,251.74,Single-ply,SBD,F
Girls,75.07,5,Ashley Pena,PSJA Memorial,70.62,92.99,40.82,102.06,235.87,Single-ply,SBD,F
Girls,75.07,6,Vanessa Ravell,Brownsville Porter,70.35,106.59,43.09,81.65,231.33,Single-ply,SBD,F
Girls,75.07,7,Arianna Guerra,Donna,71.67,74.84,40.82,106.59,222.26,Single-ply,SBD,F
Girls,75.07,8,Alice Hernandez,Brownsville Porter,72.17,90.72,34.02,92.99,217.72,Single-ply,SBD,F
Girls,75.07,9,Jordy Banda,Edinburg,70.26,74.84,43.09,90.72,208.65,Single-ply,SBD,F
Girls,75.07,10,Mia Murphy,McAllen Rowe,69.72,77.11,36.29,90.72,204.12,Single-ply,SBD,F
Girls,75.07,11,Karla Salinas,Edinburg,68.36,74.84,45.36,72.57,192.78,Single-ply,SBD,F
Girls,75.07,12,Mariana Chavez,McAllen Rowe,72.71,63.5,29.48,77.11,170.1,Single-ply,SBD,F
Girls,75.07,DQ,Krista Figueroa,Brownsville Hanna,71.62,142.88,,,,Single-ply,SBD,F
Girls,75.07,DQ,Olivia Espinoza,Weslaco East,73.66,165.56,,,,Single-ply,SBD,F
Girls,82.33,1,Jesed Castro,Los Fresnos,76.38,192.78,104.33,163.29,460.4,Single-ply,SBD,F
Girls,82.33,2,Julie Torres,Los Fresnos,77.93,165.56,81.65,167.83,415.04,Single-ply,SBD,F
Girls,82.33,3,Paola Espinoza,Weslaco East,76.07,170.1,81.65,149.69,401.43,Single-ply,SBD,F
Girls,82.33,4,Melaine Quintero,Brownsville Lopez,75.21,138.35,47.63,138.35,324.32,Single-ply,SBD,F
Girls,82.33,5,Jennifer Saldana,Brownsville Lopez,80.06,136.08,63.5,124.74,324.32,Single-ply,SBD,F
Girls,82.33,6,Marisela Gonzalez,Edinburg,76.38,92.99,49.9,108.86,251.74,Single-ply,SBD,F
Girls,82.33,7,Samantha Soto,PSJA Memorial,76.57,92.99,29.48,92.99,215.46,Single-ply,SBD,F
Girls,82.33,8,Esly Escanuela,Santa Rosa,80.56,65.77,36.29,79.38,181.44,Single-ply,SBD,F
Girls,82.33,DQ,Vanessa Guzman,PSJA Memorial,77.47,86.18,,,,Single-ply,SBD,F
Girls,82.33,DQ,Kennia Vasquez,Brownsville Porter,76.11,,,,,Single-ply,SBD,F
Girls,82.33,DQ,Selena Martinez,Edinburg Economedes,80.29,88.45,38.56,,,Single-ply,SBD,F
Girls,90.04,1,Maya Perez,Brownsville Hanna,85.82,167.83,58.97,149.69,376.48,Single-ply,SBD,F
Girls,90.04,2,Kassie Lopez,Brownsville Porter,86.95,129.27,54.43,95.25,278.96,Single-ply,SBD,F
Girls,90.04,3,Jessica Flores,Edinburg,84.1,102.06,61.23,102.06,265.35,Single-ply,SBD,F
Girls,90.04,4,Summer Castro,Lyford,88.63,97.52,52.16,92.99,242.67,Single-ply,SBD,F
Girls,90.04,5,Ianelly Garza,Brownsville Porter,89.31,97.52,31.75,102.06,231.33,Single-ply,SBD,F
Girls,90.04,6,Priscilla Acosta,McAllen Rowe,83.28,88.45,36.29,102.06,226.8,Single-ply,SBD,F
Girls,90.04,7,Brittany Barrer,Brownsville Porter,82.92,88.45,40.82,95.25,224.53,Single-ply,SBD,F
Girls,100.02,1,Julianna Delgado,Brownsville Lopez,98.25,179.17,61.23,167.83,408.23,Single-ply,SBD,F
Girls,100.02,2,Carolina De Leon,Weslaco East,92.26,158.76,74.84,158.76,392.36,Single-ply,SBD,F
Girls,100.02,3,Luz Oviedo,PSJA Memorial,97.48,106.59,56.7,111.13,274.42,Single-ply,SBD,F
Girls,100.02+,1,Ashley Tapia,PSJA,104.05,179.17,79.38,170.1,428.64,Single-ply,SBD,F
Girls,100.02+,2,Crystal Medrano,Weslaco East,100.74,172.37,77.11,145.15,394.63,Single-ply,SBD,F
Girls,100.02+,3,Amanda Garcia,Brownsville Hanna,108.91,170.1,74.84,122.47,367.41,Single-ply,SBD,F
Girls,100.02+,4,Joy Perez,Brownsville Hanna,117.8,147.42,70.31,142.88,360.61,Single-ply,SBD,F
Girls,100.02+,5,Rene Almazan,Brownsville Porter,106.82,145.15,61.23,115.67,322.05,Single-ply,SBD,F
Girls,100.02+,6,Esmeralda Carbajal,Donna,110.31,106.59,45.36,129.27,281.23,Single-ply,SBD,F
Girls,100.02+,7,Chasity Alvarez,McAllen Rowe,106,90.72,38.56,97.52,226.8,Single-ply,SBD,F
Girls,100.02+,DQ,Melissa Moralez,Weslaco East,114.4,195.04,,,,Single-ply,SBD,F
