Division,WeightClassKg,Place,Name,Team,BodyweightKg,Best3SquatKg,Best3BenchKg,Best3DeadliftKg,TotalKg,Equipment,Event,Sex,BirthDate
Girls,44.23,1,Taylor Craig,Bells,43.73,104.33,72.57,90.72,267.62,Unlimited,SBD,F,
Girls,44.23,2,Lesly Alva,Denison,43.05,90.72,40.82,95.25,226.8,Unlimited,SBD,F,
Girls,44.23,3,Julissa Facundo,Leonard,42,52.16,29.48,74.84,156.49,Unlimited,SBD,F,
Girls,44.23,4,Hannah Foster,Sadler S & S Consolidated,43.14,56.7,34.02,63.5,154.22,Unlimited,SBD,F,
Girls,44.23,5,Sienna Thompson,Prosper,40.91,58.97,31.75,61.23,151.95,Unlimited,SBD,F,
Girls,47.85,1,Ariana Jarillo,Sherman,44.95,104.33,45.36,111.13,260.82,Unlimited,SBD,F,
Girls,47.85,2,Eva Jordan,Bells,46.54,95.25,58.97,81.65,235.87,Unlimited,SBD,F,
Girls,47.85,3,Abigail Eanes,Denison,46.54,86.18,43.09,92.99,222.26,Unlimited,SBD,F,
Girls,47.85,4,Anna Weatherford,Bells,47.81,79.38,43.09,92.99,215.46,Unlimited,SBD,F,
Girls,47.85,5,Mimi Jebakumar,Prosper,44.77,68.04,38.56,102.06,208.65,Unlimited,SBD,F,
Girls,47.85,6,Natalie Vega,Sadler S & S Consolidated,47.63,72.57,43.09,68.04,183.7,Unlimited,SBD,F,
Girls,47.85,7,Maya Garcia,Howe,46.81,56.7,34.02,83.91,174.63,Unlimited,SBD,F,
Girls,51.94,1,Paige Phillips,Sherman,51.44,115.67,52.16,95.25,263.08,Unlimited,SBD,F,
Girls,51.94,2,Gianna Steinhilber,Prosper,48.44,97.52,52.16,90.72,240.4,Unlimited,SBD,F,
Girls,51.94,3,Chloe Miller,Bells,51.85,90.72,47.63,88.45,226.8,Unlimited,SBD,F,
Girls,51.94,4,Emilee Fretwell,Denison,51.26,79.38,43.09,83.91,206.38,Unlimited,SBD,F,
Girls,51.94,5,Amilya Verdugo,Sadler S & S Consolidated,51.17,74.84,38.56,88.45,201.85,Unlimited,SBD,F,
Girls,51.94,6,Graycee Wrisner,Wolfe City,49.99,61.23,38.56,79.38,179.17,Unlimited,SBD,F,
Girls,51.94,7,Madison Nicholas,Denison,50.39,61.23,34.02,70.31,165.56,Unlimited,SBD,F,
Girls,51.94,DQ,Cooper Bolterman,Prosper,51.75,81.65,,,,Unlimited,SBD,F,
Girls,56.02,1,Balie Patrick,Bells,54.43,127.01,74.84,124.74,326.59,Unlimited,SBD,F,
Girls,56.02,2,Sarah Marr,Prosper,54.25,102.06,65.77,102.06,269.89,Unlimited,SBD,F,
Girls,56.02,3,Mylie Miller,Sherman,52.3,102.06,61.23,88.45,251.74,Unlimited,SBD,F,
Girls,56.02,4,Kylee Moore,Commerce,53.57,113.4,40.82,97.52,251.74,Unlimited,SBD,F,
Girls,56.02,5,Brooke Scott,Pottsboro,54.3,108.86,43.09,99.79,251.74,Unlimited,SBD,F,
Girls,56.02,6,Nikki White,Sadler S & S Consolidated,55.07,95.25,52.16,102.06,249.48,Unlimited,SBD,F,
Girls,56.02,7,Katie-Lynn Douglas,Denison,53.84,86.18,43.09,106.59,235.87,Unlimited,SBD,F,
Girls,56.02,8,Bayleigh Fulce,Denison,55.38,79.38,56.7,90.72,226.8,Unlimited,SBD,F,
Girls,56.02,9,Dianne Flores,Tom Bean,54.43,77.11,54.43,92.99,224.53,Unlimited,SBD,F,
Girls,56.02,10,Izzy Palacios,Pottsboro,54.84,86.18,40.82,92.99,219.99,Unlimited,SBD,F,
Girls,56.02,11,Victoria Martinez,Howe,55.93,74.84,43.09,90.72,208.65,Unlimited,SBD,F,
Girls,56.02,12,Zariyah Franklin,Sherman Texoma Christian School,54.34,63.5,40.82,79.38,183.7,Unlimited,SBD,F,
Girls,56.02,DQ,Ella Hale,Wolfe City,55.2,115.67,,,,Unlimited,SBD,F,
Girls,60.1,1,Jaycie Grisham,Howe,57.7,165.56,106.59,138.35,410.5,Unlimited,SBD,F,
Girls,60.1,2,Samiya King,Prosper,59.65,136.08,61.23,136.08,333.39,Unlimited,SBD,F,
Girls,60.1,3,Karalyne Mask,Bells,60.06,138.35,77.11,117.93,333.39,Unlimited,SBD,F,
Girls,60.1,4,Buckley Turner,Denison,59.56,136.08,70.31,120.2,326.59,Unlimited,SBD,F,
Girls,60.1,5,Juli Bush,Leonard,60.01,147.42,68.04,111.13,326.59,Unlimited,SBD,F,
Girls,60.1,6,Alison Hardwick,Collinsville,58.2,129.27,68.04,120.2,317.51,Unlimited,SBD,F,
Girls,60.1,7,Makalya Thomison,Sherman,59.65,129.27,61.23,115.67,306.17,Unlimited,SBD,F,
Girls,60.1,8,Kaylee Baxter,Leonard,58.88,111.13,61.23,102.06,274.42,Unlimited,SBD,F,
Girls,60.1,9,Lauren Pemberton,Leonard,59.74,102.06,61.23,106.59,269.89,Unlimited,SBD,F,
Girls,60.1,10,Cambree Fromme,Leonard,59.65,106.59,54.43,104.33,265.35,Unlimited,SBD,F,
Girls,60.1,11,Gabi Moreno,Sadler S & S Consolidated,58.15,102.06,47.63,108.86,258.55,Unlimited,SBD,F,
Girls,60.1,12,Trinity Newby,Leonard,58.29,99.79,54.43,104.33,258.55,Unlimited,SBD,F,
Girls,60.1,13,Shiloh Cameron,Commerce,59.69,102.06,49.9,97.52,249.48,Unlimited,SBD,F,
Girls,60.1,14,Kimberley Gonzalez,Howe,58.65,97.52,49.9,92.99,240.4,Unlimited,SBD,F,
Girls,60.1,15,Nevaeh Lawrence,Sadler S & S Consolidated,59.38,97.52,47.63,86.18,231.33,Unlimited,SBD,F,
Girls,60.1,16,Kayley Laubhan,Howe,58.11,86.18,49.9,90.72,226.8,Unlimited,SBD,F,
Girls,67.36,1,Abigail Grady,Leonard,64,154.22,77.11,142.88,374.21,Unlimited,SBD,F,
Girls,67.36,2,Jessalyn Edwards,Bells,66.36,133.81,74.84,127.01,335.66,Unlimited,SBD,F,
Girls,67.36,3,Allyson Fierro,Sadler S & S Consolidated,67.22,142.88,54.43,136.08,333.39,Unlimited,SBD,F,
Girls,67.36,4,Mckenzie Guiette,Wolfe City,67.18,113.4,90.72,120.2,324.32,Unlimited,SBD,F,
Girls,67.36,5,Katelyn Iwayan,Denison,66.95,127.01,74.84,120.2,322.05,Unlimited,SBD,F,
Girls,67.36,6,Bella Wilkerson,Sherman,64.73,142.88,68.04,106.59,317.51,Unlimited,SBD,F,
Girls,67.36,7,Brynn Blevins,Sadler S & S Consolidated,66.77,115.67,61.23,136.08,312.98,Unlimited,SBD,F,
Girls,67.36,8,Addi Smith,Bells,64.59,124.74,74.84,111.13,310.71,Unlimited,SBD,F,
Girls,67.36,9,Emily Chappell,Commerce,62.78,120.2,61.23,124.74,306.17,Unlimited,SBD,F,
Girls,67.36,10,Taylor Fischer,Sadler S & S Consolidated,65.45,113.4,54.43,108.86,276.69,Unlimited,SBD,F,
Girls,67.36,11,Marlie Dixon,Sherman,60.78,113.4,68.04,92.99,274.42,Unlimited,SBD,F,
Girls,67.36,12,Marissa Spencer,Sherman,65.45,99.79,56.7,104.33,260.82,Unlimited,SBD,F,
Girls,67.36,13,Addison Schankenberg,Sadler S & S Consolidated,64.23,108.86,45.36,95.25,249.48,Unlimited,SBD,F,
Girls,67.36,14,Audrey Sethaler,Pottsboro,61.46,83.91,40.82,90.72,215.46,Unlimited,SBD,F,
Girls,67.36,15,Alena Guerrero,Denison,65.77,77.11,52.16,86.18,215.46,Unlimited,SBD,F,
Girls,67.36,16,Celestina Barrientez,Anna,63.41,74.84,34.02,70.31,179.17,Unlimited,SBD,F,
Girls,67.36,DQ,Mariana Guerrero,Howe,67.22,77.11,,,,Unlimited,SBD,F,
Girls,75.07,1,Nikai Draper,Prosper,72.21,154.22,70.31,147.42,371.95,Unlimited,SBD,F,
Girls,75.07,2,Stephanie Garcia,Gainesville,71.17,131.54,92.99,136.08,360.61,Unlimited,SBD,F,
Girls,75.07,3,Miriam Nieto,Leonard,73.26,136.08,72.57,136.08,344.73,Unlimited,SBD,F,
Girls,75.07,4,Karen Colin,Sadler S & S Consolidated,73.75,145.15,61.23,127.01,333.39,Unlimited,SBD,F,
Girls,75.07,5,Isabelle Oefinger,Bells,70.53,127.01,77.11,122.47,326.59,Unlimited,SBD,F,
Girls,75.07,6,Savannah Bond,Sherman,73.53,102.06,54.43,108.86,265.35,Unlimited,SBD,F,
Girls,75.07,7,Kaylee Dodson,Wolfe City,71.62,102.06,65.77,95.25,263.08,Unlimited,SBD,F,
Girls,75.07,8,Emily Marks,Wolfe City,68.81,104.33,54.43,99.79,258.55,Unlimited,SBD,F,
Girls,75.07,9,Reagan Stanley,Tom Bean,74.98,97.52,54.43,99.79,251.74,Unlimited,SBD,F,
Girls,75.07,10,Ava Aleman,Denison,74.98,90.72,45.36,79.38,215.46,Unlimited,SBD,F,
Girls,75.07,11,Reese Apple,Tom Bean,68.72,63.5,47.63,86.18,197.31,Unlimited,SBD,F,
Girls,75.07,12,Brenna Greyson,Sherman Texoma Christian School,70.49,49.9,36.29,72.57,158.76,Unlimited,SBD,F,
Girls,75.07,DQ,Elizabeth Cross,Dodd City,73.35,,,,,Unlimited,SBD,F,
Girls,75.07,DQ,Micaela Garza,Leonard,74.03,,,,,Unlimited,SBD,F,
Girls,75.07,DQ,Lydia Davis,Prosper,70.58,,,,,Unlimited,SBD,F,
Girls,75.07,DQ,Jadda McLean,Pottsboro,71.44,138.35,,,,Unlimited,SBD,F,
Girls,82.33,1,Allie Beaver,Sherman,78.93,117.93,81.65,111.13,310.71,Unlimited,SBD,F,
Girls,82.33,2,Aryana Hernandez,Sherman,76.97,129.27,58.97,113.4,301.64,Unlimited,SBD,F,
Girls,82.33,3,Jayden Osenbaugh,Commerce,82.1,86.18,38.56,88.45,213.19,Unlimited,SBD,F,
Girls,90.04,1,Addysan Pickett,Gainesville,87.14,170.1,77.11,124.74,371.95,Unlimited,SBD,F,
Girls,90.04,2,Maddie Alonzo,Pottsboro,89.18,138.35,79.38,129.27,347,Unlimited,SBD,F,
Girls,90.04,3,Texie Forkner,Bells,82.74,115.67,65.77,108.86,290.3,Unlimited,SBD,F,
Girls,90.04,4,Kristen Guillen,Pottsboro,88.68,102.06,54.43,102.06,258.55,Unlimited,SBD,F,
Girls,90.04,5,Fariday Gonzalez,Howe,83.87,106.59,56.7,92.99,256.28,Unlimited,SBD,F,
Girls,100.02,1,Hailey Shrum,Denison,97.2,151.95,90.72,124.74,367.41,Unlimited,SBD,F,
Girls,100.02,2,Libby Cernero,Sherman,97.7,129.27,70.31,140.61,340.19,Unlimited,SBD,F,
Girls,100.02,3,Catelyn Armstrong,Howe,91.85,113.4,70.31,142.88,326.59,Unlimited,SBD,F,
Girls,100.02,4,Araceli Garza,Leonard,96.3,129.27,79.38,111.13,319.78,Unlimited,SBD,F,
Girls,110,1,Haley Gentry,Sherman,104.42,174.63,97.52,145.15,417.3,Unlimited,SBD,F,
Girls,110,2,Lexi Stanbery,Wolfe City,104.83,151.95,92.99,115.67,360.61,Unlimited,SBD,F,
Girls,110,3,Cera Sanchez,Bells,108.09,129.27,83.91,115.67,328.85,Unlimited,SBD,F,
Girls,110,4,Taylor Walters,Wolfe City,106.96,120.2,68.04,124.74,312.98,Unlimited,SBD,F,
Girls,110+,1,Reagan Kelley,Sherman Texoma Christian School,158.76,165.56,108.86,167.83,442.25,Unlimited,SBD,F,
Girls,110+,2,Emma Waldrip,Bells,122.38,151.95,106.59,133.81,392.36,Unlimited,SBD,F,
Girls,110+,3,Kryshawna Nicholson,Denison,111.58,90.72,63.5,124.74,278.96,Unlimited,SBD,F,
