Division,WeightClassKg,Place,Name,Team,BodyweightKg,Best3SquatKg,Best3BenchKg,Best3DeadliftKg,TotalKg,Equipment,Event,Sex,BirthDate
Girls,44.23,1,Victoria Gonzalez,Shepherd,43,88.45,40.82,92.99,222.26,Unlimited,SBD,F,
Girls,44.23,2,Kyleigh Pawlik,Vanderbilt Industrial,41.78,68.04,40.82,74.84,183.7,Unlimited,SBD,F,
Girls,44.23,3,D'Shai Cooper,Hitchcock,41.19,43.09,22.68,72.57,138.35,Unlimited,SBD,F,
Girls,44.23,DQ,Ruby Shirley,Woodville,43.09,90.72,,,,Unlimited,SBD,F,
Girls,44.23,DQ,Brionna Mladenka,Cleveland Tarkington,44,,,,,Unlimited,SBD,F,
Girls,47.85,1,Tessa Johnson,Buna,46.58,92.99,45.36,102.06,240.4,Unlimited,SBD,F,
Girls,47.85,2,Mykenzie Zarate,Edna,45.9,83.91,54.43,99.79,238.14,Unlimited,SBD,F,
Girls,47.85,3,Braeleigh Benavides,Vanderbilt Industrial,47.63,86.18,47.63,95.25,229.06,Unlimited,SBD,F,
Girls,47.85,4,Dakota Matthews,Winnie East Chambers,47.85,106.59,49.9,70.31,226.8,Unlimited,SBD,F,
Girls,47.85,5,Brianna Harper,Edna,46.36,68.04,47.63,90.72,206.38,Unlimited,SBD,F,
Girls,47.85,6,Cadence Youngblood,Buna,47.45,74.84,40.82,70.31,185.97,Unlimited,SBD,F,
Girls,47.85,7,Melanie Davis,Hitchcock,46.95,68.04,27.22,88.45,183.7,Unlimited,SBD,F,
Girls,47.85,8,Aliyah Perez,Hitchcock,46.99,63.5,29.48,65.77,158.76,Unlimited,SBD,F,
Girls,47.85,DQ,Hannah Lee,Cleveland Tarkington,47.63,,,,,Unlimited,SBD,F,
Girls,47.85,DQ,Kaedlyn Knox,Shepherd,46.49,,,,,Unlimited,SBD,F,
Girls,47.85,DQ,Sadie Malagarie,Orangefield,47.36,115.67,56.7,,,Unlimited,SBD,F,
Girls,51.94,1,Rain Sanchez,Palacios,50.17,117.93,90.72,127.01,335.66,Unlimited,SBD,F,
Girls,51.94,2,Kynleigh Llanes,Palacios,51.8,113.4,68.04,113.4,294.84,Unlimited,SBD,F,
Girls,51.94,3,Kiera Danna,Kirbyville,50.76,95.25,54.43,99.79,249.48,Unlimited,SBD,F,
Girls,51.94,4,Rhea Williams,Woodville,51.26,97.52,40.82,111.13,249.48,Unlimited,SBD,F,
Girls,51.94,5,London Bouldin,Hitchcock,51.39,81.65,29.48,99.79,210.92,Unlimited,SBD,F,
Girls,51.94,6,Dlyia Smith,Hitchcock,49.94,65.77,29.48,86.18,181.44,Unlimited,SBD,F,
Girls,51.94,7,Gabby Guarado,Hitchcock,51.03,74.84,34.02,72.57,181.44,Unlimited,SBD,F,
Girls,51.94,8,Holly St Claire,Cleveland Tarkington,48.17,61.23,29.48,72.57,163.29,Unlimited,SBD,F,
Girls,51.94,DQ,Shyiana Gongora,Hitchcock,49.62,,,,,Unlimited,SBD,F,
Girls,51.94,DQ,Alyssa Milstead,Buna,51.66,,,,,Unlimited,SBD,F,
Girls,51.94,DQ,Olivia Johnson,Buna,50.89,79.38,,,,Unlimited,SBD,F,
Girls,51.94,DQ,Sara Ebarb,Shepherd,49.17,120.2,,,,Unlimited,SBD,F,
Girls,51.94,DQ,Aleena Rodriguez,Winnie East Chambers,51.71,,,,,Unlimited,SBD,F,
Girls,56.02,1,Miley Alaniz,Vanderbilt Industrial,54.34,127.01,70.31,124.74,322.05,Unlimited,SBD,F,
Girls,56.02,2,Kyla Wells,Kirbyville,54.52,117.93,68.04,117.93,303.91,Unlimited,SBD,F,
Girls,56.02,3,Tyler Stevens #5,Winnie East Chambers,55.2,113.4,70.31,108.86,292.57,Unlimited,SBD,F,
Girls,56.02,4,Kaitlyn Ortiz,Winnie East Chambers,54.52,102.06,65.77,120.2,288.03,Unlimited,SBD,F,
Girls,56.02,5,Kelsey Fisk,Shepherd,52.03,104.33,54.43,124.74,283.5,Unlimited,SBD,F,
Girls,56.02,6,Tara Greer,Woodville,54.75,102.06,61.23,108.86,272.16,Unlimited,SBD,F,
Girls,56.02,7,Mack Alaniz,Vanderbilt Industrial,54.16,88.45,52.16,106.59,247.21,Unlimited,SBD,F,
Girls,56.02,8,Karen Hernandez,Winnie East Chambers,55.25,97.52,52.16,97.52,247.21,Unlimited,SBD,F,
Girls,56.02,DQ,Rae Andrews,Anahuac,53.93,,,,,Unlimited,SBD,F,
Girls,56.02,DQ,Emma McClure,Woodville,55.79,,,,,Unlimited,SBD,F,
Girls,56.02,DQ,Emma Elliott,Kirbyville,55.79,,,,,Unlimited,SBD,F,
Girls,56.02,DQ,Madison Stiles,Cleveland Tarkington,54.39,102.06,56.7,,,Unlimited,SBD,F,
Girls,60.1,1,April Sinopoli,Winnie East Chambers,58.69,158.76,92.99,158.76,410.5,Unlimited,SBD,F,
Girls,60.1,2,Debahni Cantera,Shepherd,57.79,122.47,52.16,113.4,288.03,Unlimited,SBD,F,
Girls,60.1,3,Deziree Evans,Vanderbilt Industrial,59.69,108.86,52.16,108.86,269.89,Unlimited,SBD,F,
Girls,60.1,DQ,Hannah Leach,Buna,59.56,138.35,,,,Unlimited,SBD,F,
Girls,60.1,DQ,Breana Quinonez,Edna,59.47,,,,,Unlimited,SBD,F,
Girls,60.1,DQ,Alley Evans,Cleveland Tarkington,59.56,,,,,Unlimited,SBD,F,
Girls,60.1,DQ,Haley Limbrick,Woodville,58.92,,,,,Unlimited,SBD,F,
Girls,60.1,DQ,Jayda Granger,Anahuac,57.7,,,,,Unlimited,SBD,F,
Girls,60.1,DQ,Jade Blanscett,Anahuac,59.87,,,,,Unlimited,SBD,F,
Girls,60.1,DQ,Brooklynn Baker,Cleveland Tarkington,59.87,,,,,Unlimited,SBD,F,
Girls,60.1,DQ,Emrie Bazan,Edna,59.87,,,,,Unlimited,SBD,F,
Girls,60.1,DQ,Keilyn Avila,Winnie East Chambers,57.97,95.25,54.43,,,Unlimited,SBD,F,
Girls,67.36,1,Autumn Kallus,Vanderbilt Industrial,65.23,136.08,92.99,133.81,362.87,Unlimited,SBD,F,
Girls,67.36,2,Desiree Alaniz,Vanderbilt Industrial,64.23,120.2,90.72,138.35,349.27,Unlimited,SBD,F,
Girls,67.36,3,Makenna Meads,Orangefield,66.59,136.08,99.79,111.13,347,Unlimited,SBD,F,
Girls,67.36,4,Kaydence Pinson,Winnie East Chambers,66.41,120.2,58.97,124.74,303.91,Unlimited,SBD,F,
Girls,67.36,5,Paola Herrera,Winnie East Chambers,63.23,117.93,68.04,115.67,301.64,Unlimited,SBD,F,
Girls,67.36,6,Lindsey Guerrero,Winnie East Chambers,65.77,120.2,52.16,108.86,281.23,Unlimited,SBD,F,
Girls,67.36,DQ,Daniela Lopez,Winnie East Chambers,64.09,,,,,Unlimited,SBD,F,
Girls,67.36,DQ,Zelia Williams,Woodville,66.9,,,,,Unlimited,SBD,F,
Girls,67.36,DQ,Julissa Mayorga,Shepherd,64.23,,,,,Unlimited,SBD,F,
Girls,67.36,DQ,Sarya Contreras,Shepherd,66.63,,,,,Unlimited,SBD,F,
Girls,67.36,DQ,Relissa Rach,Buna,64.86,111.13,,,,Unlimited,SBD,F,
Girls,67.36,DQ,Mi Reyna Zarate,Edna,64.32,145.15,65.77,,,Unlimited,SBD,F,
Girls,75.07,1,Aphia Baker,Shepherd,72.08,163.29,115.67,122.47,401.43,Unlimited,SBD,F,
Girls,75.07,2,Kelly Santana,Winnie East Chambers,73.21,142.88,70.31,124.74,337.93,Unlimited,SBD,F,
Girls,75.07,3,Kirsten Ratcliff,Kirbyville,71.17,115.67,83.91,127.01,326.59,Unlimited,SBD,F,
Girls,75.07,4,Abby Dupree,Buna,68.22,124.74,74.84,122.47,322.05,Unlimited,SBD,F,
Girls,75.07,5,Kirstin Kangas,Shepherd,70.53,115.67,72.57,115.67,303.91,Unlimited,SBD,F,
Girls,75.07,6,Desire Walker,Winnie East Chambers,69.26,113.4,63.5,117.93,294.84,Unlimited,SBD,F,
Girls,75.07,7,Luz Martinez,Winnie East Chambers,72.53,104.33,58.97,117.93,281.23,Unlimited,SBD,F,
Girls,75.07,8,Dallaina Brown,Kirbyville,68.67,108.86,58.97,106.59,274.42,Unlimited,SBD,F,
Girls,75.07,DQ,Heaven Burleson,Coldspring-Oakhurst,70.53,136.08,,,,Unlimited,SBD,F,
Girls,75.07,DQ,Hannah Lemmons,Buna,72.89,136.08,,,,Unlimited,SBD,F,
Girls,75.07,DQ,Teagan Duke,Palacios,70.31,122.47,,,,Unlimited,SBD,F,
Girls,75.07,DQ,Kilea Schaffer,Edna,74.84,,,,,Unlimited,SBD,F,
Girls,82.33,1,Ashley Gonzalez,Shepherd,79.47,161.03,95.25,142.88,399.16,Unlimited,SBD,F,
Girls,82.33,2,Nelly Garcia,Palacios,81.6,127.01,92.99,127.01,347,Unlimited,SBD,F,
Girls,82.33,3,Irma Matehuala,Winnie East Chambers,77.88,133.81,79.38,124.74,337.93,Unlimited,SBD,F,
Girls,82.33,4,Jayla Kerl,Anahuac,82.33,127.01,68.04,140.61,335.66,Unlimited,SBD,F,
Girls,82.33,5,Kaylee Honc,Vanderbilt Industrial,77.75,122.47,68.04,129.27,319.78,Unlimited,SBD,F,
Girls,82.33,6,Danica Morris,Cleveland Tarkington,79.51,124.74,72.57,120.2,317.51,Unlimited,SBD,F,
Girls,82.33,7,Sherlyn Vargas,Winnie East Chambers,76.66,117.93,65.77,111.13,294.84,Unlimited,SBD,F,
Girls,82.33,8,Aili Blacklund,Anahuac,78.43,113.4,63.5,104.33,281.23,Unlimited,SBD,F,
Girls,82.33,9,Kayla Kerl,Anahuac,80.88,102.06,58.97,115.67,276.69,Unlimited,SBD,F,
Girls,82.33,10,Rayonna McDade,Hitchcock,81.74,99.79,63.5,90.72,254.01,Unlimited,SBD,F,
Girls,82.33,11,Jaiden Pool,Hitchcock,81.74,90.72,54.43,108.86,254.01,Unlimited,SBD,F,
Girls,82.33,DQ,Karlee Buckley,Palacios,78.52,,,,,Unlimited,SBD,F,
Girls,90.04,1,Olivia Sommerfeld,Edna,83.69,176.9,97.52,142.88,417.3,Unlimited,SBD,F,
Girls,90.04,2,Marley Morgan,Winnie East Chambers,83.82,165.56,113.4,117.93,396.89,Unlimited,SBD,F,
Girls,90.04,3,Alyssa Jimenez,Shepherd,84.69,136.08,72.57,124.74,333.39,Unlimited,SBD,F,
Girls,90.04,4,Jahanna Starrett,Palacios,82.6,113.4,65.77,142.88,322.05,Unlimited,SBD,F,
Girls,90.04,5,Braylynn Kellar,Buna,84.73,136.08,74.84,108.86,319.78,Unlimited,SBD,F,
Girls,90.04,6,Andrea Salinas,Hitchcock,84.1,111.13,52.16,113.4,276.69,Unlimited,SBD,F,
Girls,90.04,DQ,Angie Martinez,Hitchcock,89.81,,,,,Unlimited,SBD,F,
Girls,90.04,DQ,Takayla Watson,Hardin,89.81,,,,,Unlimited,SBD,F,
Girls,90.04,DQ,Marissah Shird,Woodville,89.81,,,,,Unlimited,SBD,F,
Girls,90.04,DQ,Serenity Velasquez,Coldspring-Oakhurst,84.96,179.17,86.18,,,Unlimited,SBD,F,
Girls,90.04,DQ,Emma Strelczyk,Edna,84.91,151.95,90.72,,,Unlimited,SBD,F,
Girls,100.02,1,Emily Gonzalez,Shepherd,92.12,176.9,81.65,127.01,385.55,Unlimited,SBD,F,
Girls,100.02,2,Naveah Washington,Orangefield,100.02,129.27,63.5,124.74,317.51,Unlimited,SBD,F,
Girls,100.02,3,Jaelyn Dosia,Coldspring-Oakhurst,92.94,129.27,61.23,124.74,315.25,Unlimited,SBD,F,
Girls,100.02,4,Olivia Tucker,Hardin,96.84,124.74,61.23,122.47,308.44,Unlimited,SBD,F,
Girls,100.02,DQ,Yessica Baez,Palacios,94.89,158.76,97.52,,,Unlimited,SBD,F,
Girls,100.02,DQ,Katie Kurtz,Vanderbilt Industrial,98.11,,,,,Unlimited,SBD,F,
Girls,100.02,DQ,Cayce Foote,Winnie East Chambers,90.4,124.74,81.65,,,Unlimited,SBD,F,
Girls,100.02,DQ,Paisely Wells,Anahuac,90.08,,,,,Unlimited,SBD,F,
Girls,100.02,DQ,Ayden Powell,Anahuac,97.75,115.67,63.5,,,Unlimited,SBD,F,
Girls,100.02,DQ,Zariah Junior,Hardin,99.79,,,,,Unlimited,SBD,F,
Girls,110,1,Maria Gomez,Buna,107.64,190.51,99.79,167.83,458.13,Unlimited,SBD,F,
Girls,110,2,Lyniah Evans,Vanderbilt Industrial,104.78,147.42,83.91,127.01,358.34,Unlimited,SBD,F,
Girls,110,3,Saylah Salazar,Vanderbilt Industrial,107,147.42,74.84,115.67,337.93,Unlimited,SBD,F,
Girls,110,4,Trinity Perez,Palacios,102.47,97.52,77.11,127.01,301.64,Unlimited,SBD,F,
Girls,110,5,Izabell Colbert,Cleveland Tarkington,108.5,106.59,63.5,117.93,288.03,Unlimited,SBD,F,
Girls,110,6,Riley Kinder,Shepherd,100.74,99.79,58.97,86.18,244.94,Unlimited,SBD,F,
Girls,110,DQ,Peyton Greenwood,Coldspring-Oakhurst,109.77,,,,,Unlimited,SBD,F,
Girls,110+,1,Makhyla Johnson,Anahuac,118.16,167.83,90.72,181.44,439.98,Unlimited,SBD,F,
Girls,110+,2,Jasmine King,Hitchcock,110.18,174.63,88.45,149.69,412.77,Unlimited,SBD,F,
Girls,110+,DQ,Kadence Alexander,Shepherd,120.02,,,,,Unlimited,SBD,F,
Girls,110+,DQ,Selena Kellum,Kirbyville,110.22,,,,,Unlimited,SBD,F,
