{
  "profiles": {
    "DotnetWeb.ConsoleApplication": {
      "commandName": "Project",
      "commandLineArgs": "1337",
      "environmentVariables": {
        "ASPNETCORE_ENVIRONMENT": "%ASPNETCORE_ENVIRONMENT%"
      }
    }
  }
}