first_name;last_name;email;km;cost_per_km
Howard;Mitchell;lphillips0@ow.ly;165;4.4
Raymond;Snyder;rdaniels1@kickstarter.com;610;4.62
Deborah;Lewis;tfernandez2@weebly.com;427;0.25
Joyce;Ward;lwest3@pen.io;918;2.24
Janice;Rivera;egonzales4@census.gov;644;7.38
Martin;Ramos;jlynch5@example.com;571;1.25
Edward;Miller;emiller6@123-reg.co.uk;859;5.56
Jane;Smith;jward7@twitpic.com;513;2.8
Deborah;Lewis;adunn8@barnesandnoble.com;29;4.54
Martin;Ramos;jdunn9@microsoft.com;738;3.46
Edward;Miller;ewelcha@webs.com;260;9.57
Janice;Rivera;rjohnstonb@squidoo.com;907;1.66
Howard;Mitchell;hbradleyc@walmart.com;16;1.57
Arthur;Daniels;ahawkinsd@tamu.edu;913;5.1
Raymond;Snyder;rhamiltone@archive.org;732;7.11
Joyce;Ward;cmartinf@cam.ac.uk;751;2.46
Raymond;Snyder;wdixong@dell.com;777;6.1
Raymond;Snyder;cwilsonh@nymag.com;401;2.92
Janice;Rivera;bweaveri@icq.com;173;5.43
Edward;Miller;amontgomeryj@google.it;544;4.54
Jack;Martinez;wblackk@cdbaby.com;409;4.37
Jack;Martinez;agarrettl@bbb.org;506;1.16
Jane;Smith;aandrewsm@prnewswire.com;846;7.78
Edward;Miller;grichardsonn@engadget.com;399;8.48
Raymond;Snyder;jsmitho@slate.com;765;2.02
Martin;Ramos;hmitchellp@ucoz.ru;727;8.49
Raymond;Snyder;ebrooksq@indiatimes.com;657;6.65
Jack;Martinez;kramosr@bloglovin.com;687;3.5
Edward;Miller;ckennedys@infoseek.co.jp;377;4.49
Edward;Miller;rsnydert@goo.gl;87;0.94
Janice;Rivera;croseu@bloglines.com;331;3.02
Martin;Ramos;jmartinezv@ovh.net;471;7.27
Joyce;Ward;iwarrenw@army.mil;323;4.75
Martin;Ramos;adanielsx@nbcnews.com;996;3.56
Arthur;Daniels;efraziery@cisco.com;257;0.06
Arthur;Daniels;asandersz@fema.gov;28;4.11
Howard;Mitchell;adean10@unblog.fr;240;0.21
Arthur;Daniels;jboyd11@github.io;276;6.88
Jack;Martinez;jlong12@aol.com;126;5.69
Jack;Martinez;ameyer13@freewebs.com;568;6.28
Martin;Ramos;jcoleman14@nbcnews.com;953;3.04
Jane;Smith;nhughes15@domainmarket.com;377;3.22
Edward;Miller;hwillis16@edublogs.org;75;5.01
Janice;Rivera;kgardner17@indiegogo.com;609;4.01
Jane;Smith;bcampbell18@state.tx.us;142;2.56
Raymond;Snyder;dmeyer19@last.fm;261;6.5
Howard;Mitchell;bwallace1a@simplemachines.org;250;1.98
Jane;Smith;jstanley1b@berkeley.edu;506;7.71
Howard;Mitchell;pgomez1c@angelfire.com;911;6.35
Martin;Ramos;jlawrence1d@a8.net;881;3.24
Jack;Martinez;ewatson1e@census.gov;26;0.45
Joyce;Ward;rcollins1f@europa.eu;714;9.47
Janice;Rivera;agarrett1g@xinhuanet.com;757;9.4
Raymond;Snyder;tporter1h@instagram.com;288;6.82
Jack;Martinez;tjordan1i@engadget.com;965;2.39
Jack;Martinez;mmcdonald1j@usda.gov;866;6.79
Jane;Smith;pchapman1k@samsung.com;604;8.33
Deborah;Lewis;aflores1l@wired.com;584;6.02
Martin;Ramos;mhernandez1m@nba.com;480;2.49
Joyce;Ward;rphillips1n@360.cn;21;3.15
Jane;Smith;bhansen1o@woothemes.com;408;4.46
Deborah;Lewis;chunt1p@furl.net;580;6.51
Raymond;Snyder;hwarren1q@free.fr;530;4.59
Edward;Miller;bstevens1r@yahoo.co.jp;479;1.06
Howard;Mitchell;cjames1s@fc2.com;504;1.31
Jane;Smith;lmyers1t@friendfeed.com;983;1.05
Janice;Rivera;bray1u@independent.co.uk;280;2.73
Jane;Smith;nhunter1v@twitter.com;564;9.97
Joyce;Ward;bwatkins1w@purevolume.com;735;7.19
Edward;Miller;lellis1x@ning.com;423;5.73
Edward;Miller;eperry1y@discuz.net;844;5.9
Jane;Smith;talexander1z@biblegateway.com;262;0.2
Raymond;Snyder;malexander20@columbia.edu;26;0.09
Howard;Mitchell;mhowell21@aboutads.info;101;3.26
Edward;Miller;kjackson22@mac.com;762;2.3
Arthur;Daniels;apatterson23@desdev.cn;66;0.95
Janice;Rivera;jward24@plala.or.jp;240;8.49
Deborah;Lewis;jgreen25@ca.gov;599;5.66
Arthur;Daniels;fmartin26@sogou.com;160;5.98
Howard;Mitchell;breed27@ftc.gov;440;7.29
Deborah;Lewis;awelch28@google.ru;214;0.08
Joyce;Ward;jrobertson29@princeton.edu;4;7.2
Raymond;Snyder;msimmons2a@stumbleupon.com;684;3.09
Edward;Miller;mpierce2b@upenn.edu;872;5.82
Deborah;Lewis;idiaz2c@typepad.com;838;6.16
Martin;Ramos;tlarson2d@dailymail.co.uk;776;0.15
Deborah;Lewis;lsimpson2e@europa.eu;373;8.79
Janice;Rivera;kreynolds2f@ftc.gov;511;9.62
Joyce;Ward;jrivera2g@foxnews.com;644;4.69
Howard;Mitchell;mramos2h@unc.edu;211;1.16
Howard;Mitchell;wcastillo2i@nps.gov;980;6.27
Janice;Rivera;cpatterson2j@nbcnews.com;930;9.25
Edward;Miller;bsimpson2k@usda.gov;376;3.54
Arthur;Daniels;dcastillo2l@cnbc.com;891;0.14
Edward;Miller;dlewis2m@xinhuanet.com;618;0.69
Raymond;Snyder;shawkins2n@wikia.com;382;0.67
Janice;Rivera;gparker2o@dyndns.org;923;6.3
Howard;Mitchell;pwheeler2p@friendfeed.com;98;4.18
Martin;Ramos;elewis2q@geocities.com;524;0.8
Martin;Ramos;srichards2r@microsoft.com;992;3.87
