# Fdb version 3
["pdflatex"] 1614322986 "Horn.tex" "Horn.pdf" "Horn" 1614322987
  "/usr/local/texlive/2019/texmf-dist/web2c/texmf.cnf" 1557092114 35484 cb1661360667bf4db662a8895053b554 ""
  "/usr/local/texlive/2019/texmf-var/web2c/pdftex/pdflatex.fmt" 1562596787 4259635 1f92bb315d15743067efa981e6374637 ""
  "/usr/local/texlive/2019/texmf.cnf" 1557341546 577 d150fef99ac436ad1156e86b0892f6ef ""
  "Horn.aux" 1614322986 8 a94a2480d3289e625eea47cd1b285758 ""
  "Horn.tex" 1614322918 4951 6c7931701b1639bc674949eb2ef35a4e ""
  (generated)
  "Horn.pdf"
  "Horn.log"
