{
  "version": "graphviz-2.47.0",
  "archives": [
    {
      "format": "tar.xz",
      "url": "https://gitlab.com/graphviz/graphviz/-/package_files/8183717/download",
      "md5": "https://gitlab.com/graphviz/graphviz/-/package_files/8183718/download",
      "sha256": "https://gitlab.com/graphviz/graphviz/-/package_files/8183719/download"
    },
    {
      "format": "tar.gz",
      "url": "https://gitlab.com/graphviz/graphviz/-/package_files/8183714/download",
      "md5": "https://gitlab.com/graphviz/graphviz/-/package_files/8183715/download",
      "sha256": "https://gitlab.com/graphviz/graphviz/-/package_files/8183716/download"
    }
  ]
}
