{
  "project_info": {
    "project_number": "909813927236",
    "firebase_url": "https://mondplayer-14d8d.firebaseio.com",
    "project_id": "mondplayer-14d8d",
    "storage_bucket": "mondplayer-14d8d.appspot.com"
  },
  "client": [
    {
      "client_info": {
        "mobilesdk_app_id": "1:909813927236:android:ceecefe6195f0c3e",
        "android_client_info": {
          "package_name": "com.mond.player.demo"
        }
      },
      "oauth_client": [
        {
          "client_id": "909813927236-3v8507e760bkkqrqk683gc9ut8qul5jc.apps.googleusercontent.com",
          "client_type": 1,
          "android_info": {
            "package_name": "com.mond.player.demo",
            "certificate_hash": "8600776ffd356b94e3fcddba6a90a32a4a8a9e64"
          }
        },
        {
          "client_id": "909813927236-glhku1rc4876ncsdsb12ghh86fic7utr.apps.googleusercontent.com",
          "client_type": 3
        }
      ],
      "api_key": [
        {
          "current_key": "AIzaSyBEhSs1wko7Y5Hn0wZ3PH2nSrW9y1JwmFs"
        }
      ],
      "services": {
        "analytics_service": {
          "status": 1
        },
        "appinvite_service": {
          "status": 2,
          "other_platform_oauth_client": [
            {
              "client_id": "909813927236-glhku1rc4876ncsdsb12ghh86fic7utr.apps.googleusercontent.com",
              "client_type": 3
            }
          ]
        },
        "ads_service": {
          "status": 2
        }
      }
    }
  ],
  "configuration_version": "1"
}