# List of external plug-in models previously loaded. Timestamp: 1539125453504
file:/home/rambo/.p2/pool/plugins/ch.qos.logback.classic_1.0.7.v20121108-1250.jar
file:/home/rambo/.p2/pool/plugins/ch.qos.logback.core_1.0.7.v20121108-1250.jar
file:/home/rambo/.p2/pool/plugins/ch.qos.logback.slf4j_1.0.7.v201505121915.jar
file:/home/rambo/.p2/pool/plugins/com.google.gson_2.8.2.v20180104-1110.jar
file:/home/rambo/.p2/pool/plugins/com.google.guava_21.0.0.v20170206-1425.jar
file:/home/rambo/.p2/pool/plugins/com.google.guava_15.0.0.v201403281430.jar
file:/home/rambo/.p2/pool/plugins/com.google.inject_3.0.0.v201312141243.jar
file:/home/rambo/.p2/pool/plugins/com.google.inject.assistedinject_3.0.0.v201402270930.jar
file:/home/rambo/.p2/pool/plugins/com.google.inject.multibindings_3.0.0.v201402270930.jar
file:/home/rambo/.p2/pool/plugins/com.google.javascript_0.0.20160315.v20161124-1903.jar
file:/home/rambo/.p2/pool/plugins/com.google.protobuf_2.4.0.v201105131100.jar
file:/home/rambo/.p2/pool/plugins/com.gradleware.tooling.client_0.19.4.v20171108133209.jar
file:/home/rambo/.p2/pool/plugins/com.gradleware.tooling.model_0.19.4.v20171108133209.jar
file:/home/rambo/.p2/pool/plugins/com.gradleware.tooling.utils_0.19.4.v20171108133209.jar
file:/home/rambo/.p2/pool/plugins/com.ibm.icu_62.1.0.v20180727-1652.jar
file:/home/rambo/.p2/pool/plugins/com.jcraft.jsch_0.1.54.v20170116-1932.jar
file:/home/rambo/.p2/pool/plugins/com.jcraft.jzlib_1.1.1.v201205102305.jar
file:/home/rambo/.p2/pool/plugins/com.sun.el_2.2.0.v201303151357.jar
file:/home/rambo/.p2/pool/plugins/javaewah_1.1.6.v20160919-1400.jar
file:/home/rambo/.p2/pool/plugins/javax.annotation_1.2.0.v201602091430.jar
file:/home/rambo/.p2/pool/plugins/javax.el_2.2.0.v201303151357.jar
file:/home/rambo/.p2/pool/plugins/javax.inject_1.0.0.v20091030.jar
file:/home/rambo/.p2/pool/plugins/javax.servlet_3.1.0.v201410161800.jar
file:/home/rambo/.p2/pool/plugins/javax.servlet.jsp_2.2.0.v201112011158.jar
file:/home/rambo/.p2/pool/plugins/javax.xml_1.3.4.v201005080400.jar
file:/home/rambo/.p2/pool/plugins/org.antlr.runtime_3.2.0.v201101311130.jar
file:/home/rambo/.p2/pool/plugins/org.apache.ant_1.10.5.v20180808-0324/
file:/home/rambo/.p2/pool/plugins/org.apache.batik.constants_1.10.0.v20180703-1553.jar
file:/home/rambo/.p2/pool/plugins/org.apache.batik.css_1.10.0.v20180703-1553.jar
file:/home/rambo/.p2/pool/plugins/org.apache.batik.i18n_1.10.0.v20180703-1553.jar
file:/home/rambo/.p2/pool/plugins/org.apache.batik.util_1.10.0.v20180703-1553.jar
file:/home/rambo/.p2/pool/plugins/org.apache.commons.cli_1.2.0.v201404270220.jar
file:/home/rambo/.p2/pool/plugins/org.apache.commons.codec_1.10.0.v20180409-1845.jar
file:/home/rambo/.p2/pool/plugins/org.apache.commons.compress_1.15.0.v20180119-1613.jar
file:/home/rambo/.p2/pool/plugins/org.apache.commons.exec_1.1.0.v201301240602.jar
file:/home/rambo/.p2/pool/plugins/org.apache.commons.httpclient_3.1.0.v201012070820.jar
file:/home/rambo/.p2/pool/plugins/org.apache.commons.io_2.2.0.v201405211200.jar
file:/home/rambo/.p2/pool/plugins/org.apache.commons.jxpath_1.3.0.v200911051830.jar
file:/home/rambo/.p2/pool/plugins/org.apache.commons.lang_2.6.0.v201404270220.jar
file:/home/rambo/.p2/pool/plugins/org.apache.commons.lang3_3.1.0.v201403281430.jar
file:/home/rambo/.p2/pool/plugins/org.apache.commons.logging_1.2.0.v20180409-1502.jar
file:/home/rambo/.p2/pool/plugins/org.apache.commons.math_2.1.0.v201105210652.jar
file:/home/rambo/.p2/pool/plugins/org.apache.commons.pool_1.6.0.v201204271246.jar
file:/home/rambo/.p2/pool/plugins/org.apache.felix.gogo.command_1.0.2.v20170914-1324.jar
file:/home/rambo/.p2/pool/plugins/org.apache.felix.gogo.runtime_1.1.0.v20180713-1646.jar
file:/home/rambo/.p2/pool/plugins/org.apache.felix.gogo.shell_1.1.0.v20180713-1646.jar
file:/home/rambo/.p2/pool/plugins/org.apache.felix.scr_2.0.14.v20180822-1822.jar
file:/home/rambo/.p2/pool/plugins/org.apache.httpcomponents.httpclient_4.5.5.v20180409-1525.jar
file:/home/rambo/.p2/pool/plugins/org.apache.httpcomponents.httpcore_4.4.9.v20180409-1525.jar
file:/home/rambo/.p2/pool/plugins/org.apache.jasper.glassfish_2.2.2.v201501141630.jar
file:/home/rambo/.p2/pool/plugins/org.apache.log4j_1.2.15.v201012070815.jar
file:/home/rambo/.p2/pool/plugins/org.apache.lucene.analyzers-common_7.1.0.v20180122-2126.jar
file:/home/rambo/.p2/pool/plugins/org.apache.lucene.analyzers-common_6.1.0.v20161115-1612.jar
file:/home/rambo/.p2/pool/plugins/org.apache.lucene.analyzers-smartcn_7.1.0.v20180122-2126.jar
file:/home/rambo/.p2/pool/plugins/org.apache.lucene.core_7.1.0.v20171214-1510.jar
file:/home/rambo/.p2/pool/plugins/org.apache.lucene.core_6.1.0.v20170814-1820.jar
file:/home/rambo/.p2/pool/plugins/org.apache.lucene.core_3.5.0.v20120725-1805.jar
file:/home/rambo/.p2/pool/plugins/org.apache.lucene.misc_7.1.0.v20180220-1923.jar
file:/home/rambo/.p2/pool/plugins/org.apache.lucene.queryparser_6.1.0.v20161115-1612.jar
file:/home/rambo/.p2/pool/plugins/org.apache.maven.resolver.api_1.0.3.v20170405-0725.jar
file:/home/rambo/.p2/pool/plugins/org.apache.maven.resolver.connector.basic_1.0.3.v20170405-0725.jar
file:/home/rambo/.p2/pool/plugins/org.apache.maven.resolver.impl_1.0.3.v20170405-0725.jar
file:/home/rambo/.p2/pool/plugins/org.apache.maven.resolver.spi_1.0.3.v20170405-0725.jar
file:/home/rambo/.p2/pool/plugins/org.apache.maven.resolver.transport.file_1.0.3.v20170405-0725.jar
file:/home/rambo/.p2/pool/plugins/org.apache.maven.resolver.transport.http_1.0.3.v20170405-0725.jar
file:/home/rambo/.p2/pool/plugins/org.apache.maven.resolver.util_1.0.3.v20170405-0725.jar
file:/home/rambo/.p2/pool/plugins/org.apache.solr.client.solrj_3.5.0.v20150506-0844.jar
file:/home/rambo/.p2/pool/plugins/org.apache.ws.commons.util_1.0.1.v20100518-1140.jar
file:/home/rambo/.p2/pool/plugins/org.apache.xerces_2.9.0.v201101211617.jar
file:/home/rambo/.p2/pool/plugins/org.apache.xml.resolver_1.2.0.v201005080400.jar
file:/home/rambo/.p2/pool/plugins/org.apache.xml.serializer_2.7.1.v201005080400.jar
file:/home/rambo/.p2/pool/plugins/org.apache.xmlgraphics_2.2.0.v20180809-1640.jar
file:/home/rambo/.p2/pool/plugins/org.apache.xmlrpc_3.0.0.v20100427-1100.jar
file:/home/rambo/.p2/pool/plugins/org.apiguardian_1.0.0.v20180327-1502.jar
file:/home/rambo/.p2/pool/plugins/org.eclipse.aether.maven_3.1.0.v20140706-2237.jar
file:/home/rambo/.p2/pool/plugins/org.eclipse.ant.core_3.5.200.v20180822-0553.jar
file:/home/rambo/.p2/pool/plugins/org.eclipse.ant.launching_1.2.200.v20180822-0553.jar
file:/home/rambo/.p2/pool/plugins/org.eclipse.ant.ui_3.7.200.v20180822-0553.jar
file:/home/rambo/.p2/pool/plugins/org.eclipse.birt.chart.device.swt_4.7.0.v201706222054.jar
file:/home/rambo/.p2/pool/plugins/org.eclipse.birt.chart.engine_4.7.0.v201706222054.jar
file:/home/rambo/.p2/pool/plugins/org.eclipse.birt.chart.engine.extension_4.7.0.v201706222054.jar
file:/home/rambo/.p2/pool/plugins/org.eclipse.birt.core_4.7.0.v201706222054.jar
file:/home/rambo/.p2/pool/plugins/org.eclipse.buildship.branding_2.2.1.v20180125-1441.jar
file:/home/rambo/.p2/pool/plugins/org.eclipse.buildship.core_2.2.1.v20180125-1441.jar
file:/home/rambo/.p2/pool/plugins/org.eclipse.buildship.stsmigration_2.2.1.v20180125-1441.jar
file:/home/rambo/.p2/pool/plugins/org.eclipse.buildship.ui_2.2.1.v20180125-1441.jar
file:/home/rambo/.p2/pool/plugins/org.eclipse.cdt.core_6.5.0.201809121146.jar
file:/home/rambo/.p2/pool/plugins/org.eclipse.cdt.core.linux_5.3.0.201809121146.jar
file:/home/rambo/.p2/pool/plugins/org.eclipse.cdt.core.linux.x86_64_5.3.0.201809121146.jar
file:/home/rambo/.p2/pool/plugins/org.eclipse.cdt.core.native_5.10.0.201809121146.jar
file:/home/rambo/.p2/pool/plugins/org.eclipse.cdt.native.serial_1.1.0.201809121146.jar
file:/home/rambo/.p2/pool/plugins/org.eclipse.compare_3.7.300.v20180827-1041.jar
file:/home/rambo/.p2/pool/plugins/org.eclipse.compare.core_3.6.300.v20180827-1041.jar
file:/home/rambo/.p2/pool/plugins/org.eclipse.core.commands_3.9.200.v20180827-1727.jar
file:/home/rambo/.p2/pool/plugins/org.eclipse.core.contenttype_3.7.100.v20180817-1401.jar
file:/home/rambo/.p2/pool/plugins/org.eclipse.core.databinding_1.7.0.v20180827-2028.jar
file:/home/rambo/.p2/pool/plugins/org.eclipse.core.databinding.beans_1.4.200.v20180827-2028.jar
file:/home/rambo/.p2/pool/plugins/org.eclipse.core.databinding.observable_1.6.300.v20180827-2028.jar
file:/home/rambo/.p2/pool/plugins/org.eclipse.core.databinding.property_1.6.300.v20180827-2028.jar
file:/home/rambo/.p2/pool/plugins/org.eclipse.core.expressions_3.6.200.v20180817-1401.jar
file:/home/rambo/.p2/pool/plugins/org.eclipse.core.externaltools_1.1.200.v20180821-1744.jar
file:/home/rambo/.p2/pool/plugins/org.eclipse.core.filebuffers_3.6.300.v20180822-1339.jar
file:/home/rambo/.p2/pool/plugins/org.eclipse.core.filesystem_1.7.200.v20180828-0158.jar
file:/home/rambo/.p2/pool/plugins/org.eclipse.core.filesystem.linux.x86_64_1.2.300.v20180828-0158.jar
file:/home/rambo/.p2/pool/plugins/org.eclipse.core.jobs_3.10.100.v20180817-1215.jar
file:/home/rambo/.p2/pool/plugins/org.eclipse.core.net_1.3.300.v20180827-1041.jar
file:/home/rambo/.p2/pool/plugins/org.eclipse.core.net.linux.x86_64_1.2.200.v20180827-1041.jar
file:/home/rambo/.p2/pool/plugins/org.eclipse.core.resources_3.13.100.v20180828-0158.jar
file:/home/rambo/.p2/pool/plugins/org.eclipse.core.runtime_3.15.0.v20180817-1401.jar
file:/home/rambo/.p2/pool/plugins/org.eclipse.core.variables_3.4.200.v20180821-1744.jar
file:/home/rambo/.p2/pool/plugins/org.eclipse.debug.core_3.13.0.v20180821-1744.jar
file:/home/rambo/.p2/pool/plugins/org.eclipse.debug.ui_3.13.100.v20180827-0649.jar
file:/home/rambo/.p2/pool/plugins/org.eclipse.dltk_5.10.0.201808292040.jar
file:/home/rambo/.p2/pool/plugins/org.eclipse.dltk.annotations_5.10.0.201808292040.jar
file:/home/rambo/.p2/pool/plugins/org.eclipse.dltk.console_5.10.0.201808292040.jar
file:/home/rambo/.p2/pool/plugins/org.eclipse.dltk.console.ui_5.10.0.201808292040.jar
file:/home/rambo/.p2/pool/plugins/org.eclipse.dltk.core_5.10.0.201808292040.jar
file:/home/rambo/.p2/pool/plugins/org.eclipse.dltk.core.index_5.10.0.201808292040.jar
file:/home/rambo/.p2/pool/plugins/org.eclipse.dltk.core.index.lucene_5.10.0.201808292040.jar
file:/home/rambo/.p2/pool/plugins/org.eclipse.dltk.core.manipulation_5.10.0.201808292040.jar
file:/home/rambo/.p2/pool/plugins/org.eclipse.dltk.debug_5.10.0.201808292040.jar
file:/home/rambo/.p2/pool/plugins/org.eclipse.dltk.debug.ui_5.10.0.201808292040.jar
file:/home/rambo/.p2/pool/plugins/org.eclipse.dltk.formatter_5.10.0.201808292040.jar
file:/home/rambo/.p2/pool/plugins/org.eclipse.dltk.launching_5.10.0.201808292040.jar
file:/home/rambo/.p2/pool/plugins/org.eclipse.dltk.logconsole_5.10.0.201808292040.jar
file:/home/rambo/.p2/pool/plugins/org.eclipse.dltk.logconsole.ui_5.10.0.201808292040.jar
file:/home/rambo/.p2/pool/plugins/org.eclipse.dltk.mylyn_5.10.0.201808292040.jar
file:/home/rambo/.p2/pool/plugins/org.eclipse.dltk.testing_5.10.0.201808292040.jar
file:/home/rambo/.p2/pool/plugins/org.eclipse.dltk.ui_5.10.0.201808292040.jar
file:/home/rambo/.p2/pool/plugins/org.eclipse.dltk.validators.core_5.10.0.201808292040.jar
file:/home/rambo/.p2/pool/plugins/org.eclipse.dltk.validators.externalchecker_5.10.0.201808292040.jar
file:/home/rambo/.p2/pool/plugins/org.eclipse.dltk.validators.ui_5.10.0.201808292040.jar
file:/home/rambo/.p2/pool/plugins/org.eclipse.draw2d_3.10.100.201606061308.jar
file:/home/rambo/.p2/pool/plugins/org.eclipse.e4.core.commands_0.12.300.v20180828-0227.jar
file:/home/rambo/.p2/pool/plugins/org.eclipse.e4.core.contexts_1.7.100.v20180817-1215.jar
file:/home/rambo/.p2/pool/plugins/org.eclipse.e4.core.di_1.7.100.v20180817-1215.jar
file:/home/rambo/.p2/pool/plugins/org.eclipse.e4.core.di.annotations_1.6.200.v20180817-1215.jar
file:/home/rambo/.p2/pool/plugins/org.eclipse.e4.core.di.extensions_0.15.200.v20180817-1215.jar
file:/home/rambo/.p2/pool/plugins/org.eclipse.e4.core.di.extensions.supplier_0.15.200.v20180817-1215.jar
file:/home/rambo/.p2/pool/plugins/org.eclipse.e4.core.services_2.1.200.v20180817-1215.jar
file:/home/rambo/.p2/pool/plugins/org.eclipse.e4.emf.xpath_0.2.200.v20180828-0227.jar
file:/home/rambo/.p2/pool/plugins/org.eclipse.e4.ui.bindings_0.12.200.v20180828-0227.jar
file:/home/rambo/.p2/pool/plugins/org.eclipse.e4.ui.css.core_0.12.300.v20180828-0227.jar
file:/home/rambo/.p2/pool/plugins/org.eclipse.e4.ui.css.swt_0.13.200.v20180828-0227.jar
file:/home/rambo/.p2/pool/plugins/org.eclipse.e4.ui.css.swt.theme_0.12.100.v20180828-0227.jar
file:/home/rambo/.p2/pool/plugins/org.eclipse.e4.ui.di_1.2.300.v20180906-1121.jar
file:/home/rambo/.p2/pool/plugins/org.eclipse.e4.ui.dialogs_1.1.300.v20180828-0227.jar
file:/home/rambo/.p2/pool/plugins/org.eclipse.e4.ui.model.workbench_2.1.100.v20180904-1914.jar
file:/home/rambo/.p2/pool/plugins/org.eclipse.e4.ui.services_1.3.200.v20180906-1121.jar
file:/home/rambo/.p2/pool/plugins/org.eclipse.e4.ui.swt.gtk_1.0.400.v20180828-0227.jar
file:/home/rambo/.p2/pool/plugins/org.eclipse.e4.ui.widgets_1.2.200.v20180828-0227.jar
file:/home/rambo/.p2/pool/plugins/org.eclipse.e4.ui.workbench_1.7.0.v20180906-1121.jar
file:/home/rambo/.p2/pool/plugins/org.eclipse.e4.ui.workbench.addons.swt_1.3.200.v20180828-0227.jar
file:/home/rambo/.p2/pool/plugins/org.eclipse.e4.ui.workbench.renderers.swt_0.14.300.v20180828-0227.jar
file:/home/rambo/.p2/pool/plugins/org.eclipse.e4.ui.workbench.swt_0.14.300.v20180906-1121.jar
file:/home/rambo/.p2/pool/plugins/org.eclipse.e4.ui.workbench3_0.14.200.v20180828-0227.jar
file:/home/rambo/.p2/pool/plugins/org.eclipse.ecf_3.9.1.v20180801-1752.jar
file:/home/rambo/.p2/pool/plugins/org.eclipse.ecf.filetransfer_5.0.100.v20180301-0132.jar
file:/home/rambo/.p2/pool/plugins/org.eclipse.ecf.identity_3.9.1.v20180810-0833.jar
file:/home/rambo/.p2/pool/plugins/org.eclipse.ecf.provider.filetransfer_3.2.400.v20180306-0429.jar
file:/home/rambo/.p2/pool/plugins/org.eclipse.ecf.provider.filetransfer.httpclient4_1.1.300.v20180301-0132.jar
file:/home/rambo/.p2/pool/plugins/org.eclipse.ecf.provider.filetransfer.httpclient4.ssl_1.1.100.v20180301-0132.jar
file:/home/rambo/.p2/pool/plugins/org.eclipse.ecf.provider.filetransfer.ssl_1.0.100.v20180301-0132.jar
file:/home/rambo/.p2/pool/plugins/org.eclipse.ecf.ssl_1.2.100.v20180301-0132.jar
file:/home/rambo/.p2/pool/plugins/org.eclipse.eclemma.core_3.1.1.201809121651.jar
file:/home/rambo/.p2/pool/plugins/org.eclipse.eclemma.doc_3.1.1.201809121651.jar
file:/home/rambo/.p2/pool/plugins/org.eclipse.eclemma.ui_3.1.1.201809121651.jar
file:/home/rambo/.p2/pool/plugins/org.eclipse.egit_5.1.0.201809111528-r.jar
file:/home/rambo/.p2/pool/plugins/org.eclipse.egit.core_5.1.0.201809111528-r.jar
file:/home/rambo/.p2/pool/plugins/org.eclipse.egit.doc_5.1.0.201809111528-r.jar
file:/home/rambo/.p2/pool/plugins/org.eclipse.egit.mylyn.ui_5.1.0.201809111528-r.jar
file:/home/rambo/.p2/pool/plugins/org.eclipse.egit.ui_5.1.0.201809111528-r.jar
file:/home/rambo/.p2/pool/plugins/org.eclipse.emf.codegen_2.14.0.v20180706-1146.jar
file:/home/rambo/.p2/pool/plugins/org.eclipse.emf.codegen.ecore_2.15.0.v20180905-1732.jar
file:/home/rambo/.p2/pool/plugins/org.eclipse.emf.common_2.15.0.v20180723-1316.jar
file:/home/rambo/.p2/pool/plugins/org.eclipse.emf.common.ui_2.14.0.v20180706-1146.jar
file:/home/rambo/.p2/pool/plugins/org.eclipse.emf.databinding_1.5.0.v20180706-1146.jar
file:/home/rambo/.p2/pool/plugins/org.eclipse.emf.databinding.edit_1.5.0.v20180823-0456.jar
file:/home/rambo/.p2/pool/plugins/org.eclipse.emf.ecore_2.15.0.v20180722-1159.jar
file:/home/rambo/.p2/pool/plugins/org.eclipse.emf.ecore.change_2.13.0.v20180706-1146.jar
file:/home/rambo/.p2/pool/plugins/org.eclipse.emf.ecore.edit_2.11.0.v20180823-0905.jar
file:/home/rambo/.p2/pool/plugins/org.eclipse.emf.ecore.editor_2.15.0.v20180823-0905.jar
file:/home/rambo/.p2/pool/plugins/org.eclipse.emf.ecore.xmi_2.15.0.v20180706-1146.jar
file:/home/rambo/.p2/pool/plugins/org.eclipse.emf.edit_2.14.0.v20180823-0456.jar
file:/home/rambo/.p2/pool/plugins/org.eclipse.emf.edit.ui_2.15.0.v20180823-0914.jar
file:/home/rambo/.p2/pool/plugins/org.eclipse.emf.mwe.core_1.3.21.201705291011.jar
file:/home/rambo/.p2/pool/plugins/org.eclipse.emf.mwe.utils_1.3.21.201705291011.jar
file:/home/rambo/.p2/pool/plugins/org.eclipse.emf.mwe2.language_2.9.1.201705291011.jar
file:/home/rambo/.p2/pool/plugins/org.eclipse.emf.mwe2.language.ui_2.9.1.201705291011.jar
file:/home/rambo/.p2/pool/plugins/org.eclipse.emf.mwe2.launch_2.9.1.201705291011.jar
file:/home/rambo/.p2/pool/plugins/org.eclipse.emf.mwe2.launch.ui_2.9.1.201705291011.jar
file:/home/rambo/.p2/pool/plugins/org.eclipse.emf.mwe2.lib_2.9.1.201705291011.jar
file:/home/rambo/.p2/pool/plugins/org.eclipse.emf.mwe2.runtime_2.9.1.201705291011.jar
file:/home/rambo/.p2/pool/plugins/org.eclipse.epp.logging.aeri.core_2.0.7.v20180504-0806.jar
file:/home/rambo/.p2/pool/plugins/org.eclipse.epp.logging.aeri.ide_2.0.7.v20180504-0806.jar
file:/home/rambo/.p2/pool/plugins/org.eclipse.epp.mpc.core_1.7.2.v20180829-1931.jar
file:/home/rambo/.p2/pool/plugins/org.eclipse.epp.mpc.help.ui_1.7.2.v20180718-2001.jar
file:/home/rambo/.p2/pool/plugins/org.eclipse.epp.mpc.ui_1.7.2.v20180718-2001.jar
file:/home/rambo/.p2/pool/plugins/org.eclipse.epp.mpc.ui.css_1.7.2.v20180718-2001.jar
file:/home/rambo/.p2/pool/plugins/org.eclipse.epp.package.common_4.9.0.20180917-1800/
file:/home/rambo/.p2/pool/plugins/org.eclipse.epp.package.java_4.9.0.20180917-1800/
file:/home/rambo/.p2/pool/plugins/org.eclipse.equinox.app_1.3.600.v20180827-1235.jar
file:/home/rambo/.p2/pool/plugins/org.eclipse.equinox.bidi_1.1.200.v20180827-1235.jar
file:/home/rambo/.p2/pool/plugins/org.eclipse.equinox.common_3.10.100.v20180827-1235.jar
file:/home/rambo/.p2/pool/plugins/org.eclipse.equinox.concurrent_1.1.200.v20180827-1235.jar
file:/home/rambo/.p2/pool/plugins/org.eclipse.equinox.console_1.3.100.v20180827-1235.jar
file:/home/rambo/.p2/pool/plugins/org.eclipse.equinox.ds_1.5.200.v20180827-1235.jar
file:/home/rambo/.p2/pool/plugins/org.eclipse.equinox.event_1.4.300.v20180827-1235.jar
file:/home/rambo/.p2/pool/plugins/org.eclipse.equinox.frameworkadmin_2.1.100.v20180822-1258.jar
file:/home/rambo/.p2/pool/plugins/org.eclipse.equinox.frameworkadmin.equinox_1.1.100.v20180822-1258.jar
file:/home/rambo/.p2/pool/plugins/org.eclipse.equinox.http.jetty_3.6.100.v20180827-1235.jar
file:/home/rambo/.p2/pool/plugins/org.eclipse.equinox.http.registry_1.1.600.v20180827-1235.jar
file:/home/rambo/.p2/pool/plugins/org.eclipse.equinox.http.servlet_1.5.100.v20180904-1442.jar
file:/home/rambo/.p2/pool/plugins/org.eclipse.equinox.jsp.jasper_1.1.100.v20180827-1235.jar
file:/home/rambo/.p2/pool/plugins/org.eclipse.equinox.jsp.jasper.registry_1.1.100.v20180827-1235.jar
file:/home/rambo/.p2/pool/plugins/org.eclipse.equinox.launcher_1.5.100.v20180827-1352.jar
file:/home/rambo/.p2/pool/plugins/org.eclipse.equinox.launcher.gtk.linux.x86_64_1.1.800.v20180827-1352/
file:/home/rambo/.p2/pool/plugins/org.eclipse.equinox.p2.artifact.repository_1.2.100.v20180822-1258.jar
file:/home/rambo/.p2/pool/plugins/org.eclipse.equinox.p2.console_1.1.100.v20180822-1258.jar
file:/home/rambo/.p2/pool/plugins/org.eclipse.equinox.p2.core_2.5.100.v20180822-1532.jar
file:/home/rambo/.p2/pool/plugins/org.eclipse.equinox.p2.director_2.4.100.v20180822-1258.jar
file:/home/rambo/.p2/pool/plugins/org.eclipse.equinox.p2.director.app_1.1.200.v20180822-1302.jar
file:/home/rambo/.p2/pool/plugins/org.eclipse.equinox.p2.directorywatcher_1.2.100.v20180822-1302.jar
file:/home/rambo/.p2/pool/plugins/org.eclipse.equinox.p2.discovery_1.1.100.v20180822-1302.jar
file:/home/rambo/.p2/pool/plugins/org.eclipse.equinox.p2.discovery.compatibility_1.1.100.v20180822-1302.jar
file:/home/rambo/.p2/pool/plugins/org.eclipse.equinox.p2.engine_2.6.100.v20180822-1302.jar
file:/home/rambo/.p2/pool/plugins/org.eclipse.equinox.p2.extensionlocation_1.3.100.v20180822-1302.jar
file:/home/rambo/.p2/pool/plugins/org.eclipse.equinox.p2.garbagecollector_1.1.100.v20180822-1302.jar
file:/home/rambo/.p2/pool/plugins/org.eclipse.equinox.p2.jarprocessor_1.1.100.v20180822-1302.jar
file:/home/rambo/.p2/pool/plugins/org.eclipse.equinox.p2.metadata_2.4.100.v20180822-1302.jar
file:/home/rambo/.p2/pool/plugins/org.eclipse.equinox.p2.metadata.repository_1.3.100.v20180822-1302.jar
file:/home/rambo/.p2/pool/plugins/org.eclipse.equinox.p2.operations_2.5.100.v20180822-1302.jar
file:/home/rambo/.p2/pool/plugins/org.eclipse.equinox.p2.publisher_1.5.100.v20180822-1302.jar
file:/home/rambo/.p2/pool/plugins/org.eclipse.equinox.p2.publisher.eclipse_1.3.100.v20180822-1354.jar
file:/home/rambo/.p2/pool/plugins/org.eclipse.equinox.p2.reconciler.dropins_1.2.100.v20180822-1354.jar
file:/home/rambo/.p2/pool/plugins/org.eclipse.equinox.p2.repository_2.4.100.v20180822-1354.jar
file:/home/rambo/.p2/pool/plugins/org.eclipse.equinox.p2.repository.tools_2.2.100.v20180822-1354.jar
file:/home/rambo/.p2/pool/plugins/org.eclipse.equinox.p2.touchpoint.eclipse_2.2.100.v20180822-1354.jar
file:/home/rambo/.p2/pool/plugins/org.eclipse.equinox.p2.touchpoint.natives_1.3.100.v20180822-1354.jar
file:/home/rambo/.p2/pool/plugins/org.eclipse.equinox.p2.transport.ecf_1.2.100.v20180822-1354.jar
file:/home/rambo/.p2/pool/plugins/org.eclipse.equinox.p2.ui_2.5.200.v20180822-1357.jar
file:/home/rambo/.p2/pool/plugins/org.eclipse.equinox.p2.ui.discovery_1.1.100.v20180822-1357.jar
file:/home/rambo/.p2/pool/plugins/org.eclipse.equinox.p2.ui.importexport_1.2.100.v20180827-1122.jar
file:/home/rambo/.p2/pool/plugins/org.eclipse.equinox.p2.ui.sdk_1.1.100.v20180827-1122.jar
file:/home/rambo/.p2/pool/plugins/org.eclipse.equinox.p2.ui.sdk.scheduler_1.4.100.v20180827-1122.jar
file:/home/rambo/.p2/pool/plugins/org.eclipse.equinox.p2.updatechecker_1.2.100.v20180827-1122.jar
file:/home/rambo/.p2/pool/plugins/org.eclipse.equinox.p2.updatesite_1.1.100.v20180827-1122.jar
file:/home/rambo/.p2/pool/plugins/org.eclipse.equinox.preferences_3.7.200.v20180827-1235.jar
file:/home/rambo/.p2/pool/plugins/org.eclipse.equinox.registry_3.8.100.v20180827-1235.jar
file:/home/rambo/.p2/pool/plugins/org.eclipse.equinox.security_1.2.500.v20180827-1235.jar
file:/home/rambo/.p2/pool/plugins/org.eclipse.equinox.security.linux.x86_64_1.1.100.v20180827-1235/
file:/home/rambo/.p2/pool/plugins/org.eclipse.equinox.security.ui_1.2.100.v20180827-1235.jar
file:/home/rambo/.p2/pool/plugins/org.eclipse.equinox.simpleconfigurator_1.3.100.v20180827-1122.jar
file:/home/rambo/.p2/pool/plugins/org.eclipse.equinox.simpleconfigurator.manipulator_2.1.100.v20180827-1122.jar
file:/home/rambo/.p2/pool/plugins/org.eclipse.equinox.util_1.1.100.v20180827-1235.jar
file:/home/rambo/.p2/pool/plugins/org.eclipse.fx.code.editor.configuration_3.3.0.201809010600.jar
file:/home/rambo/.p2/pool/plugins/org.eclipse.fx.code.editor.ldef_3.3.0.201809010700.jar
file:/home/rambo/.p2/pool/plugins/org.eclipse.fx.code.editor.ldef.ui_3.3.0.201809010700.jar
file:/home/rambo/.p2/pool/plugins/org.eclipse.fx.core_3.3.0.201809010600.jar
file:/home/rambo/.p2/pool/plugins/org.eclipse.fx.core.guice_3.3.0.201809010600.jar
file:/home/rambo/.p2/pool/plugins/org.eclipse.fx.formats.svg_3.3.0.201809010600.jar
file:/home/rambo/.p2/pool/plugins/org.eclipse.fx.ide.converter_3.3.0.201809010700.jar
file:/home/rambo/.p2/pool/plugins/org.eclipse.fx.ide.css_3.3.0.201809010700.jar
file:/home/rambo/.p2/pool/plugins/org.eclipse.fx.ide.css.cssext_3.3.0.201809010700.jar
file:/home/rambo/.p2/pool/plugins/org.eclipse.fx.ide.css.cssext.proposals_3.3.0.201809010700.jar
file:/home/rambo/.p2/pool/plugins/org.eclipse.fx.ide.css.cssext.ui_3.3.0.201809010700.jar
file:/home/rambo/.p2/pool/plugins/org.eclipse.fx.ide.css.jfx2_3.3.0.201809010700.jar
file:/home/rambo/.p2/pool/plugins/org.eclipse.fx.ide.css.jfx8_3.3.0.201809010700.jar
file:/home/rambo/.p2/pool/plugins/org.eclipse.fx.ide.css.ui_3.3.0.201809010700/
file:/home/rambo/.p2/pool/plugins/org.eclipse.fx.ide.fxgraph_3.3.0.201809010700.jar
file:/home/rambo/.p2/pool/plugins/org.eclipse.fx.ide.fxgraph.ui_3.3.0.201809010700.jar
file:/home/rambo/.p2/pool/plugins/org.eclipse.fx.ide.fxml_3.3.0.201809010700.jar
file:/home/rambo/.p2/pool/plugins/org.eclipse.fx.ide.fxml.compiler_3.3.0.201809010700.jar
file:/home/rambo/.p2/pool/plugins/org.eclipse.fx.ide.gmodel_3.3.0.201809010700.jar
file:/home/rambo/.p2/pool/plugins/org.eclipse.fx.ide.gmodel.ui_3.3.0.201809010700.jar
file:/home/rambo/.p2/pool/plugins/org.eclipse.fx.ide.jdt.core_3.3.0.201809010700.jar
file:/home/rambo/.p2/pool/plugins/org.eclipse.fx.ide.jdt.ui_3.3.0.201809010700.jar
file:/home/rambo/.p2/pool/plugins/org.eclipse.fx.ide.l10n_3.3.0.201809010700/
file:/home/rambo/.p2/pool/plugins/org.eclipse.fx.ide.l10n.ui_3.3.0.201809010700/
file:/home/rambo/.p2/pool/plugins/org.eclipse.fx.ide.m2e_3.3.0.201809010700.jar
file:/home/rambo/.p2/pool/plugins/org.eclipse.fx.ide.model_3.3.0.201809010700.jar
file:/home/rambo/.p2/pool/plugins/org.eclipse.fx.ide.mvnosgi.launching_3.3.0.201809010700/
file:/home/rambo/.p2/pool/plugins/org.eclipse.fx.ide.mvnosgi.launching.ui_3.3.0.201809010700/
file:/home/rambo/.p2/pool/plugins/org.eclipse.fx.ide.pde.core_3.3.0.201809010700.jar
file:/home/rambo/.p2/pool/plugins/org.eclipse.fx.ide.pde.ui_3.3.0.201809010700.jar
file:/home/rambo/.p2/pool/plugins/org.eclipse.fx.ide.pde.ui.e4_3.3.0.201809010700/
file:/home/rambo/.p2/pool/plugins/org.eclipse.fx.ide.rrobot_3.3.0.201809010700.jar
file:/home/rambo/.p2/pool/plugins/org.eclipse.fx.ide.rrobot.dsl_3.3.0.201809010700.jar
file:/home/rambo/.p2/pool/plugins/org.eclipse.fx.ide.rrobot.dsl.ui_3.3.0.201809010700.jar
file:/home/rambo/.p2/pool/plugins/org.eclipse.fx.ide.rrobot.model_3.3.0.201809010700.jar
file:/home/rambo/.p2/pool/plugins/org.eclipse.fx.ide.ui_3.3.0.201809010700.jar
file:/home/rambo/.p2/pool/plugins/org.eclipse.fx.ide.ui.preview_3.3.0.201809010700.jar
file:/home/rambo/.p2/pool/plugins/org.eclipse.fx.osgi_3.3.0.201809010500.jar
file:/home/rambo/.p2/pool/plugins/org.eclipse.fx.osgi.util_3.3.0.201809010600.jar
file:/home/rambo/.p2/pool/plugins/org.eclipse.fx.ui.animation_3.3.0.201809010600.jar
file:/home/rambo/.p2/pool/plugins/org.eclipse.fx.ui.controls_3.3.0.201809010600.jar
file:/home/rambo/.p2/pool/plugins/org.eclipse.fx.ui.panes_3.3.0.201809010600.jar
file:/home/rambo/.p2/pool/plugins/org.eclipse.fx.ui.workbench3_3.3.0.201809010500.jar
file:/home/rambo/.p2/pool/plugins/org.eclipse.gef_3.11.0.201606061308.jar
file:/home/rambo/.p2/pool/plugins/org.eclipse.gef.common_5.0.0.201805280201.jar
file:/home/rambo/.p2/pool/plugins/org.eclipse.gef.common.doc_5.0.0.201805280201.jar
file:/home/rambo/.p2/pool/plugins/org.eclipse.gef.fx_5.0.1.201805280201.jar
file:/home/rambo/.p2/pool/plugins/org.eclipse.gef.fx.doc_5.0.2.201805280201.jar
file:/home/rambo/.p2/pool/plugins/org.eclipse.gef.fx.jface_5.0.2.201805280201.jar
file:/home/rambo/.p2/pool/plugins/org.eclipse.gef.fx.swt_5.0.2.201805280201.jar
file:/home/rambo/.p2/pool/plugins/org.eclipse.gef.geometry_5.0.0.201805280201.jar
file:/home/rambo/.p2/pool/plugins/org.eclipse.gef.geometry.convert.fx_5.0.0.201805280201.jar
file:/home/rambo/.p2/pool/plugins/org.eclipse.gef.geometry.convert.swt_5.0.2.201805280201.jar
file:/home/rambo/.p2/pool/plugins/org.eclipse.gef.geometry.doc_5.0.2.201805280201.jar
file:/home/rambo/.p2/pool/plugins/org.eclipse.gef.graph_5.0.0.201805280201.jar
file:/home/rambo/.p2/pool/plugins/org.eclipse.gef.graph.doc_5.0.0.201805280201.jar
file:/home/rambo/.p2/pool/plugins/org.eclipse.gef.layout_5.0.0.201805280201.jar
file:/home/rambo/.p2/pool/plugins/org.eclipse.gef.layout.doc_5.0.0.201805280201.jar
file:/home/rambo/.p2/pool/plugins/org.eclipse.gef.mvc.doc_5.0.2.201805280201.jar
file:/home/rambo/.p2/pool/plugins/org.eclipse.gef.mvc.fx_5.0.2.201805280201.jar
file:/home/rambo/.p2/pool/plugins/org.eclipse.gef.mvc.fx.ui_5.0.2.201805280201.jar
file:/home/rambo/.p2/pool/plugins/org.eclipse.gef.zest.doc_5.0.2.201805280201.jar
file:/home/rambo/.p2/pool/plugins/org.eclipse.gef.zest.fx_5.0.1.201805280201.jar
file:/home/rambo/.p2/pool/plugins/org.eclipse.gef.zest.fx.jface_5.0.2.201805280201.jar
file:/home/rambo/.p2/pool/plugins/org.eclipse.gef.zest.fx.ui_5.0.2.201805280201.jar
file:/home/rambo/.p2/pool/plugins/org.eclipse.help_3.8.200.v20180821-0700.jar
file:/home/rambo/.p2/pool/plugins/org.eclipse.help.base_4.2.300.v20180906-0745.jar
file:/home/rambo/.p2/pool/plugins/org.eclipse.help.ui_4.1.200.v20180821-0700.jar
file:/home/rambo/.p2/pool/plugins/org.eclipse.help.webapp_3.9.200.v20180821-0700.jar
file:/home/rambo/.p2/pool/plugins/org.eclipse.jdt_3.15.0.v20180906-0745.jar
file:/home/rambo/.p2/pool/plugins/org.eclipse.jdt.annotation_2.2.100.v20180905-0314.jar
file:/home/rambo/.p2/pool/plugins/org.eclipse.jdt.annotation_1.1.300.v20180905-0314.jar
file:/home/rambo/.p2/pool/plugins/org.eclipse.jdt.apt.core_3.6.100.v20180905-0315.jar
file:/home/rambo/.p2/pool/plugins/org.eclipse.jdt.apt.pluggable.core_1.2.200.v20180905-0315.jar
file:/home/rambo/.p2/pool/plugins/org.eclipse.jdt.apt.ui_3.6.100.v20180905-0315.jar
file:/home/rambo/.p2/pool/plugins/org.eclipse.jdt.compiler.apt_1.3.300.v20180905-0315.jar
file:/home/rambo/.p2/pool/plugins/org.eclipse.jdt.compiler.tool_1.2.300.v20180905-0319.jar
file:/home/rambo/.p2/pool/plugins/org.eclipse.jdt.core_3.15.0.v20180905-0317.jar
file:/home/rambo/.p2/pool/plugins/org.eclipse.jdt.core.manipulation_1.10.100.v20180829-0618.jar
file:/home/rambo/.p2/pool/plugins/org.eclipse.jdt.debug_3.12.0.v20180827-1040/
file:/home/rambo/.p2/pool/plugins/org.eclipse.jdt.debug.ui_3.10.0.v20180827-1040.jar
file:/home/rambo/.p2/pool/plugins/org.eclipse.jdt.doc.user_3.15.0.v20180905-1254.jar
file:/home/rambo/.p2/pool/plugins/org.eclipse.jdt.junit_3.11.100.v20180829-0645.jar
file:/home/rambo/.p2/pool/plugins/org.eclipse.jdt.junit.core_3.10.100.v20180829-0645.jar
file:/home/rambo/.p2/pool/plugins/org.eclipse.jdt.junit.runtime_3.4.800.v20180829-0645.jar
file:/home/rambo/.p2/pool/plugins/org.eclipse.jdt.junit4.runtime_1.1.800.v20180829-0645.jar
file:/home/rambo/.p2/pool/plugins/org.eclipse.jdt.junit5.runtime_1.0.200.v20180829-0645.jar
file:/home/rambo/.p2/pool/plugins/org.eclipse.jdt.launching_3.11.0.v20180827-1040.jar
file:/home/rambo/.p2/pool/plugins/org.eclipse.jdt.ui_3.15.0.v20180829-2215.jar
file:/home/rambo/.p2/pool/plugins/org.eclipse.jem.util_2.1.201.v201707201954.jar
file:/home/rambo/.p2/pool/plugins/org.eclipse.jetty.continuation_9.4.11.v20180605.jar
file:/home/rambo/.p2/pool/plugins/org.eclipse.jetty.http_9.4.11.v20180605.jar
file:/home/rambo/.p2/pool/plugins/org.eclipse.jetty.io_9.4.11.v20180605.jar
file:/home/rambo/.p2/pool/plugins/org.eclipse.jetty.security_9.4.11.v20180605.jar
file:/home/rambo/.p2/pool/plugins/org.eclipse.jetty.server_9.4.11.v20180605.jar
file:/home/rambo/.p2/pool/plugins/org.eclipse.jetty.servlet_9.4.11.v20180605.jar
file:/home/rambo/.p2/pool/plugins/org.eclipse.jetty.util_9.4.11.v20180605.jar
file:/home/rambo/.p2/pool/plugins/org.eclipse.jface_3.14.100.v20180828-0836.jar
file:/home/rambo/.p2/pool/plugins/org.eclipse.jface.databinding_1.8.300.v20180828-0836.jar
file:/home/rambo/.p2/pool/plugins/org.eclipse.jface.text_3.14.0.v20180824-1140.jar
file:/home/rambo/.p2/pool/plugins/org.eclipse.jgit_5.1.0.201809111528-r.jar
file:/home/rambo/.p2/pool/plugins/org.eclipse.jgit.archive_5.1.0.201809111528-r.jar
file:/home/rambo/.p2/pool/plugins/org.eclipse.jsch.core_1.3.200.v20180827-1041.jar
file:/home/rambo/.p2/pool/plugins/org.eclipse.jsch.ui_1.3.200.v20180827-1041.jar
file:/home/rambo/.p2/pool/plugins/org.eclipse.json_1.1.0.v201802171654.jar
file:/home/rambo/.p2/pool/plugins/org.eclipse.ltk.core.refactoring_3.9.100.v20180828-0626.jar
file:/home/rambo/.p2/pool/plugins/org.eclipse.ltk.ui.refactoring_3.9.200.v20180828-0626.jar
file:/home/rambo/.p2/pool/plugins/org.eclipse.m2e.archetype.common_1.9.1.20180912-1600/
file:/home/rambo/.p2/pool/plugins/org.eclipse.m2e.binaryproject_1.9.1.20180912-1601.jar
file:/home/rambo/.p2/pool/plugins/org.eclipse.m2e.binaryproject.ui_1.9.1.20180912-1601.jar
file:/home/rambo/.p2/pool/plugins/org.eclipse.m2e.core_1.9.1.20180912-1601.jar
file:/home/rambo/.p2/pool/plugins/org.eclipse.m2e.core.ui_1.9.1.20180912-1601.jar
file:/home/rambo/.p2/pool/plugins/org.eclipse.m2e.discovery_1.9.1.20180912-1601.jar
file:/home/rambo/.p2/pool/plugins/org.eclipse.m2e.editor_1.9.1.20180912-1601.jar
file:/home/rambo/.p2/pool/plugins/org.eclipse.m2e.editor.xml_1.9.1.20180912-1601.jar
file:/home/rambo/.p2/pool/plugins/org.eclipse.m2e.importer_1.9.1.20180912-1601.jar
file:/home/rambo/.p2/pool/plugins/org.eclipse.m2e.jdt_1.9.1.20180912-1601.jar
file:/home/rambo/.p2/pool/plugins/org.eclipse.m2e.jdt.ui_1.9.1.20180912-1601.jar
file:/home/rambo/.p2/pool/plugins/org.eclipse.m2e.launching_1.9.1.20180912-1601.jar
file:/home/rambo/.p2/pool/plugins/org.eclipse.m2e.lifecyclemapping.defaults_1.9.1.20180912-1601.jar
file:/home/rambo/.p2/pool/plugins/org.eclipse.m2e.logback.appender_1.9.1.20180912-1601.jar
file:/home/rambo/.p2/pool/plugins/org.eclipse.m2e.logback.configuration_1.9.1.20180912-1601.jar
file:/home/rambo/.p2/pool/plugins/org.eclipse.m2e.maven.indexer_1.9.1.20180912-1600/
file:/home/rambo/.p2/pool/plugins/org.eclipse.m2e.maven.runtime_1.9.1.20180912-1600/
file:/home/rambo/.p2/pool/plugins/org.eclipse.m2e.maven.runtime.slf4j.simple_1.9.1.20180912-1600/
file:/home/rambo/.p2/pool/plugins/org.eclipse.m2e.model.edit_1.9.1.20180912-1601.jar
file:/home/rambo/.p2/pool/plugins/org.eclipse.m2e.profiles.core_1.9.1.20180912-1601.jar
file:/home/rambo/.p2/pool/plugins/org.eclipse.m2e.profiles.ui_1.9.1.20180912-1601.jar
file:/home/rambo/.p2/pool/plugins/org.eclipse.m2e.refactoring_1.9.1.20180912-1601.jar
file:/home/rambo/.p2/pool/plugins/org.eclipse.m2e.scm_1.9.1.20180912-1601.jar
file:/home/rambo/.p2/pool/plugins/org.eclipse.m2e.sourcelookup_1.9.1.20180912-1601/
file:/home/rambo/.p2/pool/plugins/org.eclipse.m2e.sourcelookup.ui_1.9.1.20180912-1601.jar
file:/home/rambo/.p2/pool/plugins/org.eclipse.m2e.workspace.cli_0.3.1.jar
file:/home/rambo/.p2/pool/plugins/org.eclipse.mylyn.bugzilla.core_3.24.2.v20180905-0003.jar
file:/home/rambo/.p2/pool/plugins/org.eclipse.mylyn.bugzilla.ide_3.24.2.v20180905-0014.jar
file:/home/rambo/.p2/pool/plugins/org.eclipse.mylyn.bugzilla.ui_3.24.2.v20180905-0003.jar
file:/home/rambo/.p2/pool/plugins/org.eclipse.mylyn.builds.core_1.16.0.v20170629-2231.jar
file:/home/rambo/.p2/pool/plugins/org.eclipse.mylyn.builds.ui_1.16.0.v20170629-2231.jar
file:/home/rambo/.p2/pool/plugins/org.eclipse.mylyn.commons.core_3.24.2.v20180904-2231.jar
file:/home/rambo/.p2/pool/plugins/org.eclipse.mylyn.commons.identity.core_1.16.0.v20180904-2231.jar
file:/home/rambo/.p2/pool/plugins/org.eclipse.mylyn.commons.net_3.24.2.v20180904-2231.jar
file:/home/rambo/.p2/pool/plugins/org.eclipse.mylyn.commons.notifications.core_1.16.0.v20180904-2231.jar
file:/home/rambo/.p2/pool/plugins/org.eclipse.mylyn.commons.notifications.feed_1.16.0.v20180904-2231.jar
file:/home/rambo/.p2/pool/plugins/org.eclipse.mylyn.commons.notifications.ui_1.16.0.v20180904-2231.jar
file:/home/rambo/.p2/pool/plugins/org.eclipse.mylyn.commons.repositories.core_1.16.0.v20180904-2231.jar
file:/home/rambo/.p2/pool/plugins/org.eclipse.mylyn.commons.repositories.http.core_1.16.0.v20180904-2231.jar
file:/home/rambo/.p2/pool/plugins/org.eclipse.mylyn.commons.repositories.ui_1.16.0.v20180904-2231.jar
file:/home/rambo/.p2/pool/plugins/org.eclipse.mylyn.commons.screenshots_3.24.2.v20180904-2231.jar
file:/home/rambo/.p2/pool/plugins/org.eclipse.mylyn.commons.ui_3.24.2.v20180904-2231.jar
file:/home/rambo/.p2/pool/plugins/org.eclipse.mylyn.commons.workbench_3.24.2.v20180904-2231.jar
file:/home/rambo/.p2/pool/plugins/org.eclipse.mylyn.commons.xmlrpc_3.24.2.v20180904-2231.jar
file:/home/rambo/.p2/pool/plugins/org.eclipse.mylyn.context.core_3.24.2.v20180905-0014.jar
file:/home/rambo/.p2/pool/plugins/org.eclipse.mylyn.context.tasks.ui_3.24.2.v20180905-0014.jar
file:/home/rambo/.p2/pool/plugins/org.eclipse.mylyn.context.ui_3.24.2.v20180905-0014.jar
file:/home/rambo/.p2/pool/plugins/org.eclipse.mylyn.debug.ui_3.24.2.v20180905-0014.jar
file:/home/rambo/.p2/pool/plugins/org.eclipse.mylyn.discovery.core_3.24.2.v20180904-2231.jar
file:/home/rambo/.p2/pool/plugins/org.eclipse.mylyn.discovery.ui_3.24.2.v20180904-2231.jar
file:/home/rambo/.p2/pool/plugins/org.eclipse.mylyn.git.core_1.16.0.v20170629-1738.jar
file:/home/rambo/.p2/pool/plugins/org.eclipse.mylyn.git.ui_1.16.0.v20170629-1738.jar
file:/home/rambo/.p2/pool/plugins/org.eclipse.mylyn.help.ui_3.24.2.v20180905-0003.jar
file:/home/rambo/.p2/pool/plugins/org.eclipse.mylyn.hudson.core_1.16.0.v20180403-2055.jar
file:/home/rambo/.p2/pool/plugins/org.eclipse.mylyn.hudson.ui_1.16.0.v20170629-2231.jar
file:/home/rambo/.p2/pool/plugins/org.eclipse.mylyn.ide.ant_3.24.2.v20180905-0014.jar
file:/home/rambo/.p2/pool/plugins/org.eclipse.mylyn.ide.ui_3.24.2.v20180905-0014.jar
file:/home/rambo/.p2/pool/plugins/org.eclipse.mylyn.java.tasks_3.24.2.v20180905-0014.jar
file:/home/rambo/.p2/pool/plugins/org.eclipse.mylyn.java.ui_3.24.2.v20180905-0014.jar
file:/home/rambo/.p2/pool/plugins/org.eclipse.mylyn.monitor.core_3.24.2.v20180904-2231.jar
file:/home/rambo/.p2/pool/plugins/org.eclipse.mylyn.monitor.ui_3.24.2.v20180904-2231.jar
file:/home/rambo/.p2/pool/plugins/org.eclipse.mylyn.resources.ui_3.24.2.v20180905-0014.jar
file:/home/rambo/.p2/pool/plugins/org.eclipse.mylyn.tasks.bugs_3.24.2.v20180905-0003.jar
file:/home/rambo/.p2/pool/plugins/org.eclipse.mylyn.tasks.core_3.24.2.v20180905-0003.jar
file:/home/rambo/.p2/pool/plugins/org.eclipse.mylyn.tasks.index.core_3.24.2.v20180905-0003.jar
file:/home/rambo/.p2/pool/plugins/org.eclipse.mylyn.tasks.index.ui_3.24.2.v20180905-0003.jar
file:/home/rambo/.p2/pool/plugins/org.eclipse.mylyn.tasks.search_3.24.2.v20180905-0003.jar
file:/home/rambo/.p2/pool/plugins/org.eclipse.mylyn.tasks.ui_3.24.2.v20180905-0003.jar
file:/home/rambo/.p2/pool/plugins/org.eclipse.mylyn.team.ui_3.24.2.v20180905-0014.jar
file:/home/rambo/.p2/pool/plugins/org.eclipse.mylyn.versions.core_1.16.0.v20170629-1738.jar
file:/home/rambo/.p2/pool/plugins/org.eclipse.mylyn.versions.ui_1.16.0.v20170629-1738.jar
file:/home/rambo/.p2/pool/plugins/org.eclipse.mylyn.wikitext_3.0.25.20180620133858.jar
file:/home/rambo/.p2/pool/plugins/org.eclipse.mylyn.wikitext.ant_3.0.25.20180620133858.jar
file:/home/rambo/.p2/pool/plugins/org.eclipse.mylyn.wikitext.asciidoc_3.0.25.20180620133858.jar
file:/home/rambo/.p2/pool/plugins/org.eclipse.mylyn.wikitext.asciidoc.ui_3.0.25.201806201740.jar
file:/home/rambo/.p2/pool/plugins/org.eclipse.mylyn.wikitext.confluence_3.0.25.20180620133858.jar
file:/home/rambo/.p2/pool/plugins/org.eclipse.mylyn.wikitext.confluence.ui_3.0.25.201806201740.jar
file:/home/rambo/.p2/pool/plugins/org.eclipse.mylyn.wikitext.context.ui_3.0.25.201806201740.jar
file:/home/rambo/.p2/pool/plugins/org.eclipse.mylyn.wikitext.help.ui_3.0.25.201806201740.jar
file:/home/rambo/.p2/pool/plugins/org.eclipse.mylyn.wikitext.html_3.0.25.20180620133858.jar
file:/home/rambo/.p2/pool/plugins/org.eclipse.mylyn.wikitext.markdown_3.0.25.20180620133858.jar
file:/home/rambo/.p2/pool/plugins/org.eclipse.mylyn.wikitext.markdown.ui_3.0.25.201806201740.jar
file:/home/rambo/.p2/pool/plugins/org.eclipse.mylyn.wikitext.mediawiki_3.0.25.20180620133858.jar
file:/home/rambo/.p2/pool/plugins/org.eclipse.mylyn.wikitext.mediawiki.ui_3.0.25.201806201740.jar
file:/home/rambo/.p2/pool/plugins/org.eclipse.mylyn.wikitext.osgi_3.0.25.201806201740.jar
file:/home/rambo/.p2/pool/plugins/org.eclipse.mylyn.wikitext.tasks.ui_3.0.25.201806201740.jar
file:/home/rambo/.p2/pool/plugins/org.eclipse.mylyn.wikitext.textile_3.0.25.20180620133858.jar
file:/home/rambo/.p2/pool/plugins/org.eclipse.mylyn.wikitext.textile.ui_3.0.25.201806201740.jar
file:/home/rambo/.p2/pool/plugins/org.eclipse.mylyn.wikitext.tracwiki_3.0.25.20180620133858.jar
file:/home/rambo/.p2/pool/plugins/org.eclipse.mylyn.wikitext.tracwiki.ui_3.0.25.201806201740.jar
file:/home/rambo/.p2/pool/plugins/org.eclipse.mylyn.wikitext.twiki_3.0.25.20180620133858.jar
file:/home/rambo/.p2/pool/plugins/org.eclipse.mylyn.wikitext.twiki.ui_3.0.25.201806201740.jar
file:/home/rambo/.p2/pool/plugins/org.eclipse.mylyn.wikitext.ui_3.0.25.201806201740.jar
file:/home/rambo/.p2/pool/plugins/org.eclipse.nebula.widgets.tablecombo_1.2.0.201808161734.jar
file:/home/rambo/.p2/pool/plugins/org.eclipse.oomph.base_1.10.0.v20180706-1242.jar
file:/home/rambo/.p2/pool/plugins/org.eclipse.oomph.base.edit_1.10.0.v20180706-1242.jar
file:/home/rambo/.p2/pool/plugins/org.eclipse.oomph.extractor.lib_1.5.0.v20180706-1242.jar
file:/home/rambo/.p2/pool/plugins/org.eclipse.oomph.jreinfo_1.10.0.v20180706-1242.jar
file:/home/rambo/.p2/pool/plugins/org.eclipse.oomph.jreinfo.ui_1.10.0.v20180706-1242.jar
file:/home/rambo/.p2/pool/plugins/org.eclipse.oomph.p2_1.10.0.v20180706-1242.jar
file:/home/rambo/.p2/pool/plugins/org.eclipse.oomph.p2.core_1.10.0.v20180712-0540.jar
file:/home/rambo/.p2/pool/plugins/org.eclipse.oomph.p2.doc_1.10.0.v20180706-1242.jar
file:/home/rambo/.p2/pool/plugins/org.eclipse.oomph.p2.edit_1.10.0.v20180706-1242.jar
file:/home/rambo/.p2/pool/plugins/org.eclipse.oomph.p2.ui_1.10.0.v20180829-1028.jar
file:/home/rambo/.p2/pool/plugins/org.eclipse.oomph.predicates_1.10.0.v20180706-1242.jar
file:/home/rambo/.p2/pool/plugins/org.eclipse.oomph.predicates.edit_1.10.0.v20180706-1242.jar
file:/home/rambo/.p2/pool/plugins/org.eclipse.oomph.preferences_1.10.0.v20180706-1242.jar
file:/home/rambo/.p2/pool/plugins/org.eclipse.oomph.resources_1.10.0.v20180828-0657.jar
file:/home/rambo/.p2/pool/plugins/org.eclipse.oomph.resources.edit_1.10.0.v20180706-1242.jar
file:/home/rambo/.p2/pool/plugins/org.eclipse.oomph.setup_1.10.0.v20180828-0705.jar
file:/home/rambo/.p2/pool/plugins/org.eclipse.oomph.setup.core_1.10.0.v20180714-0556.jar
file:/home/rambo/.p2/pool/plugins/org.eclipse.oomph.setup.doc_1.10.0.v20180706-1242.jar
file:/home/rambo/.p2/pool/plugins/org.eclipse.oomph.setup.edit_1.10.0.v20180706-1242.jar
file:/home/rambo/.p2/pool/plugins/org.eclipse.oomph.setup.editor_1.10.0.v20180821-1848.jar
file:/home/rambo/.p2/pool/plugins/org.eclipse.oomph.setup.p2_1.10.0.v20180706-1242.jar
file:/home/rambo/.p2/pool/plugins/org.eclipse.oomph.setup.p2.edit_1.10.0.v20180706-1242.jar
file:/home/rambo/.p2/pool/plugins/org.eclipse.oomph.setup.sync_1.10.0.v20180706-1242.jar
file:/home/rambo/.p2/pool/plugins/org.eclipse.oomph.setup.ui_1.10.0.v20180904-1112.jar
file:/home/rambo/.p2/pool/plugins/org.eclipse.oomph.setup.ui.questionnaire_1.10.0.v20180706-1242.jar
file:/home/rambo/.p2/pool/plugins/org.eclipse.oomph.ui_1.10.0.v20180904-1112.jar
file:/home/rambo/.p2/pool/plugins/org.eclipse.oomph.util_1.10.0.v20180706-1242.jar
file:/home/rambo/.p2/pool/plugins/org.eclipse.oomph.workingsets_1.10.0.v20180706-1242.jar
file:/home/rambo/.p2/pool/plugins/org.eclipse.oomph.workingsets.edit_1.10.0.v20180706-1242.jar
file:/home/rambo/.p2/pool/plugins/org.eclipse.oomph.workingsets.editor_1.10.0.v20180904-1112.jar
file:/home/rambo/.p2/pool/plugins/org.eclipse.osgi_3.13.100.v20180827-1536.jar
file:/home/rambo/.p2/pool/plugins/org.eclipse.osgi.compatibility.state_1.1.200.v20180827-1536.jar
file:/home/rambo/.p2/pool/plugins/org.eclipse.osgi.services_3.7.100.v20180827-1536.jar
file:/home/rambo/.p2/pool/plugins/org.eclipse.osgi.util_3.5.100.v20180827-1536.jar
file:/home/rambo/.p2/pool/plugins/org.eclipse.pde.build_3.10.100.v20180828-1915/
file:/home/rambo/.p2/pool/plugins/org.eclipse.pde.core_3.12.100.v20180829-1412.jar
file:/home/rambo/.p2/pool/plugins/org.eclipse.pde.launching_3.7.200.v20180827-1331.jar
file:/home/rambo/.p2/pool/plugins/org.eclipse.pde.ui_3.10.400.v20180829-0709.jar
file:/home/rambo/.p2/pool/plugins/org.eclipse.pde.ui.templates_3.6.300.v20180827-1331.jar
file:/home/rambo/.p2/pool/plugins/org.eclipse.php.builtin.server.core_6.1.0.201808281524.jar
file:/home/rambo/.p2/pool/plugins/org.eclipse.php.builtin.server.ui_6.1.0.201808281524.jar
file:/home/rambo/.p2/pool/plugins/org.eclipse.php.composer.api_6.1.0.201808281524.jar
file:/home/rambo/.p2/pool/plugins/org.eclipse.php.composer.core_6.1.0.201808281524.jar
file:/home/rambo/.p2/pool/plugins/org.eclipse.php.composer.ui_6.1.0.201808281524.jar
file:/home/rambo/.p2/pool/plugins/org.eclipse.php.core_6.1.0.201808281524.jar
file:/home/rambo/.p2/pool/plugins/org.eclipse.php.core.parser_6.1.0.201808281524.jar
file:/home/rambo/.p2/pool/plugins/org.eclipse.php.debug.core_6.1.0.201808281524.jar
file:/home/rambo/.p2/pool/plugins/org.eclipse.php.debug.daemon_6.1.0.201808281524.jar
file:/home/rambo/.p2/pool/plugins/org.eclipse.php.debug.ui_6.1.0.201808281524.jar
file:/home/rambo/.p2/pool/plugins/org.eclipse.php.formatter.core_6.1.0.201808281524.jar
file:/home/rambo/.p2/pool/plugins/org.eclipse.php.formatter.ui_6.1.0.201808281524.jar
file:/home/rambo/.p2/pool/plugins/org.eclipse.php.help_6.1.0.201808281524.jar
file:/home/rambo/.p2/pool/plugins/org.eclipse.php.mylyn.ui_6.1.0.201808281524.jar
file:/home/rambo/.p2/pool/plugins/org.eclipse.php.phpunit_6.1.0.201808281524/
file:/home/rambo/.p2/pool/plugins/org.eclipse.php.profile.core_6.1.0.201808281524.jar
file:/home/rambo/.p2/pool/plugins/org.eclipse.php.profile.ui_6.1.0.201808281524.jar
file:/home/rambo/.p2/pool/plugins/org.eclipse.php.rdt.sync.ui_6.1.0.201808281524.jar
file:/home/rambo/.p2/pool/plugins/org.eclipse.php.refactoring.core_6.1.0.201808281524.jar
file:/home/rambo/.p2/pool/plugins/org.eclipse.php.refactoring.ui_6.1.0.201808281524.jar
file:/home/rambo/.p2/pool/plugins/org.eclipse.php.server.core_6.1.0.201808281524.jar
file:/home/rambo/.p2/pool/plugins/org.eclipse.php.server.ui_6.1.0.201808281524.jar
file:/home/rambo/.p2/pool/plugins/org.eclipse.php.ui_6.1.0.201808281524.jar
file:/home/rambo/.p2/pool/plugins/org.eclipse.platform_4.9.0.v20180906-0745/
file:/home/rambo/.p2/pool/plugins/org.eclipse.platform.doc.isv_4.9.0.v20180905-1254.jar
file:/home/rambo/.p2/pool/plugins/org.eclipse.platform.doc.user_4.9.0.v20180905-1254.jar
file:/home/rambo/.p2/pool/plugins/org.eclipse.ptp.rdt.sync.core_6.0.0.201805221500.jar
file:/home/rambo/.p2/pool/plugins/org.eclipse.ptp.rdt.sync.git.core_2.0.0.201805221500.jar
file:/home/rambo/.p2/pool/plugins/org.eclipse.ptp.rdt.sync.git.ui_1.0.0.201805221500.jar
file:/home/rambo/.p2/pool/plugins/org.eclipse.ptp.rdt.sync.ui_2.0.0.201805221500.jar
file:/home/rambo/.p2/pool/plugins/org.eclipse.ptp.remote.server.core_3.0.0.201805221500.jar
file:/home/rambo/.p2/pool/plugins/org.eclipse.rcp_4.9.100.v20180906-0745.jar
file:/home/rambo/.p2/pool/plugins/org.eclipse.recommenders.apidocs_2.5.4.v20180909-1132.jar
file:/home/rambo/.p2/pool/plugins/org.eclipse.recommenders.apidocs.rcp_2.5.4.v20180909-1132.jar
file:/home/rambo/.p2/pool/plugins/org.eclipse.recommenders.calls_2.5.4.v20180909-1132.jar
file:/home/rambo/.p2/pool/plugins/org.eclipse.recommenders.calls.rcp_2.5.4.v20180909-1132.jar
file:/home/rambo/.p2/pool/plugins/org.eclipse.recommenders.chain.rcp_2.5.4.v20180909-1132.jar
file:/home/rambo/.p2/pool/plugins/org.eclipse.recommenders.completion.rcp_2.5.4.v20180909-1132.jar
file:/home/rambo/.p2/pool/plugins/org.eclipse.recommenders.constructors_2.5.4.v20180909-1132.jar
file:/home/rambo/.p2/pool/plugins/org.eclipse.recommenders.constructors.rcp_2.5.4.v20180909-1132.jar
file:/home/rambo/.p2/pool/plugins/org.eclipse.recommenders.coordinates_2.5.4.v20180909-1132.jar
file:/home/rambo/.p2/pool/plugins/org.eclipse.recommenders.coordinates.rcp_2.5.4.v20180909-1132.jar
file:/home/rambo/.p2/pool/plugins/org.eclipse.recommenders.injection_2.5.4.v20180909-1132.jar
file:/home/rambo/.p2/pool/plugins/org.eclipse.recommenders.jayes_2.5.4.v20180909-1132.jar
file:/home/rambo/.p2/pool/plugins/org.eclipse.recommenders.jayes.io_2.5.4.v20180909-1132.jar
file:/home/rambo/.p2/pool/plugins/org.eclipse.recommenders.jdt_2.5.4.v20180909-1132.jar
file:/home/rambo/.p2/pool/plugins/org.eclipse.recommenders.models_2.5.4.v20180909-1132.jar
file:/home/rambo/.p2/pool/plugins/org.eclipse.recommenders.models.rcp_2.5.4.v20180909-1132.jar
file:/home/rambo/.p2/pool/plugins/org.eclipse.recommenders.mylyn.rcp_2.5.4.v20180909-1132.jar
file:/home/rambo/.p2/pool/plugins/org.eclipse.recommenders.net_2.5.4.v20180909-1132.jar
file:/home/rambo/.p2/pool/plugins/org.eclipse.recommenders.news_2.5.4.v20180909-1132.jar
file:/home/rambo/.p2/pool/plugins/org.eclipse.recommenders.news.api_2.5.4.v20180909-1132.jar
file:/home/rambo/.p2/pool/plugins/org.eclipse.recommenders.news.impl_2.5.4.v20180909-1132.jar
file:/home/rambo/.p2/pool/plugins/org.eclipse.recommenders.news.rcp_2.5.4.v20180909-1132.jar
file:/home/rambo/.p2/pool/plugins/org.eclipse.recommenders.overrides_2.5.4.v20180909-1132.jar
file:/home/rambo/.p2/pool/plugins/org.eclipse.recommenders.overrides.rcp_2.5.4.v20180909-1132.jar
file:/home/rambo/.p2/pool/plugins/org.eclipse.recommenders.rcp_2.5.4.v20180909-1132.jar
file:/home/rambo/.p2/pool/plugins/org.eclipse.recommenders.snipmatch_2.5.4.v20180909-1132.jar
file:/home/rambo/.p2/pool/plugins/org.eclipse.recommenders.snipmatch.rcp_2.5.4.v20180909-1132.jar
file:/home/rambo/.p2/pool/plugins/org.eclipse.recommenders.statics_2.5.4.v20180909-1132.jar
file:/home/rambo/.p2/pool/plugins/org.eclipse.recommenders.statics.rcp_2.5.4.v20180909-1132.jar
file:/home/rambo/.p2/pool/plugins/org.eclipse.recommenders.subwords.rcp_2.5.4.v20180909-1132.jar
file:/home/rambo/.p2/pool/plugins/org.eclipse.recommenders.types.rcp_2.5.4.v20180909-1132.jar
file:/home/rambo/.p2/pool/plugins/org.eclipse.recommenders.utils_2.5.4.v20180909-1132.jar
file:/home/rambo/.p2/pool/plugins/org.eclipse.recommenders.utils.rcp_2.5.4.v20180909-1132.jar
file:/home/rambo/.p2/pool/plugins/org.eclipse.remote.console_1.2.0.201803121903.jar
file:/home/rambo/.p2/pool/plugins/org.eclipse.remote.core_4.0.0.201803121903.jar
file:/home/rambo/.p2/pool/plugins/org.eclipse.remote.doc.isv_1.0.0.201803121903.jar
file:/home/rambo/.p2/pool/plugins/org.eclipse.remote.jsch.core_1.0.0.201803121903.jar
file:/home/rambo/.p2/pool/plugins/org.eclipse.remote.jsch.ui_1.0.0.201803121903.jar
file:/home/rambo/.p2/pool/plugins/org.eclipse.remote.serial.core_1.0.0.201803121903.jar
file:/home/rambo/.p2/pool/plugins/org.eclipse.remote.serial.ui_1.0.0.201803121903.jar
file:/home/rambo/.p2/pool/plugins/org.eclipse.remote.telnet.core_1.0.0.201803121903.jar
file:/home/rambo/.p2/pool/plugins/org.eclipse.remote.telnet.ui_1.0.0.201803121903.jar
file:/home/rambo/.p2/pool/plugins/org.eclipse.remote.ui_2.1.0.201803121903.jar
file:/home/rambo/.p2/pool/plugins/org.eclipse.search_3.11.300.v20180822-1339.jar
file:/home/rambo/.p2/pool/plugins/org.eclipse.swt_3.108.0.v20180904-1901.jar
file:/home/rambo/.p2/pool/plugins/org.eclipse.swt.gtk.linux.x86_64_3.108.0.v20180904-1901.jar
file:/home/rambo/.p2/pool/plugins/org.eclipse.team.core_3.8.300.v20180827-1041.jar
file:/home/rambo/.p2/pool/plugins/org.eclipse.team.genericeditor.diff.extension_1.0.200.v20180827-1041.jar
file:/home/rambo/.p2/pool/plugins/org.eclipse.team.ui_3.8.200.v20180827-1338.jar
file:/home/rambo/.p2/pool/plugins/org.eclipse.text_3.7.0.v20180822-1511.jar
file:/home/rambo/.p2/pool/plugins/org.eclipse.tips.core_0.1.200.v20180821-0700.jar
file:/home/rambo/.p2/pool/plugins/org.eclipse.tips.ide_0.1.200.v20180821-0700.jar
file:/home/rambo/.p2/pool/plugins/org.eclipse.tips.json_0.1.200.v20180821-0700.jar
file:/home/rambo/.p2/pool/plugins/org.eclipse.tips.ui_0.1.200.v20180821-0700.jar
file:/home/rambo/.p2/pool/plugins/org.eclipse.tm.terminal.connector.cdtserial_4.5.0.201808290101.jar
file:/home/rambo/.p2/pool/plugins/org.eclipse.tm.terminal.connector.local_4.5.0.201808290101.jar
file:/home/rambo/.p2/pool/plugins/org.eclipse.tm.terminal.connector.process_4.5.0.201808290101.jar
file:/home/rambo/.p2/pool/plugins/org.eclipse.tm.terminal.connector.remote_4.5.0.201808290101.jar
file:/home/rambo/.p2/pool/plugins/org.eclipse.tm.terminal.connector.ssh_4.5.0.201808290101.jar
file:/home/rambo/.p2/pool/plugins/org.eclipse.tm.terminal.connector.telnet_4.5.0.201808290101.jar
file:/home/rambo/.p2/pool/plugins/org.eclipse.tm.terminal.control_4.5.0.201808290101.jar
file:/home/rambo/.p2/pool/plugins/org.eclipse.tm.terminal.view.core_4.5.0.201808290101.jar
file:/home/rambo/.p2/pool/plugins/org.eclipse.tm.terminal.view.ui_4.5.0.201808290101.jar
file:/home/rambo/.p2/pool/plugins/org.eclipse.ui_3.110.0.v20180828-1350.jar
file:/home/rambo/.p2/pool/plugins/org.eclipse.ui.browser_3.6.300.v20180828-0837.jar
file:/home/rambo/.p2/pool/plugins/org.eclipse.ui.cheatsheets_3.5.300.v20180823-1505.jar
file:/home/rambo/.p2/pool/plugins/org.eclipse.ui.console_3.8.100.v20180821-1744.jar
file:/home/rambo/.p2/pool/plugins/org.eclipse.ui.editors_3.11.200.v20180822-1511.jar
file:/home/rambo/.p2/pool/plugins/org.eclipse.ui.externaltools_3.4.200.v20180821-1744.jar
file:/home/rambo/.p2/pool/plugins/org.eclipse.ui.forms_3.7.300.v20180828-1350.jar
file:/home/rambo/.p2/pool/plugins/org.eclipse.ui.genericeditor_1.1.100.v20180824-1616.jar
file:/home/rambo/.p2/pool/plugins/org.eclipse.ui.ide_3.14.100.v20180828-1350.jar
file:/home/rambo/.p2/pool/plugins/org.eclipse.ui.ide.application_1.3.0.v20180828-1350.jar
file:/home/rambo/.p2/pool/plugins/org.eclipse.ui.intro_3.5.300.v20180823-1505.jar
file:/home/rambo/.p2/pool/plugins/org.eclipse.ui.intro.quicklinks_1.0.300.v20180821-0700.jar
file:/home/rambo/.p2/pool/plugins/org.eclipse.ui.intro.universal_3.3.300.v20180821-0700.jar
file:/home/rambo/.p2/pool/plugins/org.eclipse.ui.monitoring_1.1.300.v20180828-1350.jar
file:/home/rambo/.p2/pool/plugins/org.eclipse.ui.navigator_3.7.200.v20180828-0837.jar
file:/home/rambo/.p2/pool/plugins/org.eclipse.ui.navigator.resources_3.6.200.v20180828-0837.jar
file:/home/rambo/.p2/pool/plugins/org.eclipse.ui.net_1.3.300.v20180827-1041.jar
file:/home/rambo/.p2/pool/plugins/org.eclipse.ui.themes_1.2.200.v20180828-1350/
file:/home/rambo/.p2/pool/plugins/org.eclipse.ui.trace_1.1.200.v20180829-0709.jar
file:/home/rambo/.p2/pool/plugins/org.eclipse.ui.views_3.9.200.v20180828-0837.jar
file:/home/rambo/.p2/pool/plugins/org.eclipse.ui.views.log_1.2.300.v20180827-1331.jar
file:/home/rambo/.p2/pool/plugins/org.eclipse.ui.views.properties.tabbed_3.8.200.v20180828-0837.jar
file:/home/rambo/.p2/pool/plugins/org.eclipse.ui.workbench_3.112.0.v20180906-1121.jar
file:/home/rambo/.p2/pool/plugins/org.eclipse.ui.workbench.texteditor_3.11.100.v20180824-1030.jar
file:/home/rambo/.p2/pool/plugins/org.eclipse.update.configurator_3.4.100.v20180821-1913.jar
file:/home/rambo/.p2/pool/plugins/org.eclipse.urischeme_1.0.0.v20180828-1120.jar
file:/home/rambo/.p2/pool/plugins/org.eclipse.userstorage_1.1.0.v20170328-0205.jar
file:/home/rambo/.p2/pool/plugins/org.eclipse.userstorage.oauth_1.0.0.v20170526-1605.jar
file:/home/rambo/.p2/pool/plugins/org.eclipse.userstorage.ui_1.0.2.v20170526-1605.jar
file:/home/rambo/.p2/pool/plugins/org.eclipse.wst.common.core_1.2.0.v201802151734.jar
file:/home/rambo/.p2/pool/plugins/org.eclipse.wst.common.emf_1.2.600.v201803151712.jar
file:/home/rambo/.p2/pool/plugins/org.eclipse.wst.common.emfworkbench.integration_1.2.101.v201802262042.jar
file:/home/rambo/.p2/pool/plugins/org.eclipse.wst.common.environment_1.0.400.v201802151734.jar
file:/home/rambo/.p2/pool/plugins/org.eclipse.wst.common.frameworks_1.2.201.v201707201954.jar
file:/home/rambo/.p2/pool/plugins/org.eclipse.wst.common.frameworks.ui_1.2.400.v201802151734.jar
file:/home/rambo/.p2/pool/plugins/org.eclipse.wst.common.infopop_1.0.300.v201802151734.jar
file:/home/rambo/.p2/pool/plugins/org.eclipse.wst.common.modulecore_1.3.0.v201805260536.jar
file:/home/rambo/.p2/pool/plugins/org.eclipse.wst.common.modulecore.ui_1.0.301.v201707201954.jar
file:/home/rambo/.p2/pool/plugins/org.eclipse.wst.common.project.facet.core_1.4.400.v201808012032.jar
file:/home/rambo/.p2/pool/plugins/org.eclipse.wst.common.project.facet.ui_1.4.601.v201707201954.jar
file:/home/rambo/.p2/pool/plugins/org.eclipse.wst.common.snippets_1.2.400.v201803040536.jar
file:/home/rambo/.p2/pool/plugins/org.eclipse.wst.common.ui_1.1.500.v200911182011.jar
file:/home/rambo/.p2/pool/plugins/org.eclipse.wst.common.uriresolver_1.2.300.v201802151734.jar
file:/home/rambo/.p2/pool/plugins/org.eclipse.wst.css.core_1.2.0.v201802171654.jar
file:/home/rambo/.p2/pool/plugins/org.eclipse.wst.css.ui_1.1.100.v201807090620.jar
file:/home/rambo/.p2/pool/plugins/org.eclipse.wst.doc.user_1.2.0.v201711201733.jar
file:/home/rambo/.p2/pool/plugins/org.eclipse.wst.dtd.core_1.2.0.v201802171654.jar
file:/home/rambo/.p2/pool/plugins/org.eclipse.wst.dtd.ui_1.1.100.v201807090620.jar
file:/home/rambo/.p2/pool/plugins/org.eclipse.wst.dtd.ui.infopop_1.0.400.v201711201733.jar
file:/home/rambo/.p2/pool/plugins/org.eclipse.wst.dtdeditor.doc.user_1.1.0.v201802171654.jar
file:/home/rambo/.p2/pool/plugins/org.eclipse.wst.html.core_1.3.0.v201804302243.jar
file:/home/rambo/.p2/pool/plugins/org.eclipse.wst.html.ui_1.1.100.v201807090620.jar
file:/home/rambo/.p2/pool/plugins/org.eclipse.wst.html.ui.infopop_1.0.201.v201711201733.jar
file:/home/rambo/.p2/pool/plugins/org.eclipse.wst.internet.cache_1.0.800.v201702270716.jar
file:/home/rambo/.p2/pool/plugins/org.eclipse.wst.internet.monitor.core_1.0.600.v201309182039.jar
file:/home/rambo/.p2/pool/plugins/org.eclipse.wst.internet.monitor.ui_1.0.700.v201309182039.jar
file:/home/rambo/.p2/pool/plugins/org.eclipse.wst.jsdt.chromium_0.5.200.v201610211901.jar
file:/home/rambo/.p2/pool/plugins/org.eclipse.wst.jsdt.chromium.debug_0.4.0.v201605131737.jar
file:/home/rambo/.p2/pool/plugins/org.eclipse.wst.jsdt.chromium.debug.core_0.5.300.v201705091354.jar
file:/home/rambo/.p2/pool/plugins/org.eclipse.wst.jsdt.chromium.debug.js_0.1.200.v201610211901.jar
file:/home/rambo/.p2/pool/plugins/org.eclipse.wst.jsdt.chromium.debug.jsdtbridge_0.5.200.v201610211901.jar
file:/home/rambo/.p2/pool/plugins/org.eclipse.wst.jsdt.chromium.debug.ui_0.6.200.v201701261810.jar
file:/home/rambo/.p2/pool/plugins/org.eclipse.wst.jsdt.chromium.wip.eclipse_0.5.200.v201610212001.jar
file:/home/rambo/.p2/pool/plugins/org.eclipse.wst.jsdt.chromium.wipbackend.dev_0.5.200.v201610212001.jar
file:/home/rambo/.p2/pool/plugins/org.eclipse.wst.jsdt.chromium.wipbackend.protocol_1_0_0.5.200.v201610212001.jar
file:/home/rambo/.p2/pool/plugins/org.eclipse.wst.jsdt.core_2.0.302.v201804042202.jar
file:/home/rambo/.p2/pool/plugins/org.eclipse.wst.jsdt.debug.core_3.2.200.v201610211901.jar
file:/home/rambo/.p2/pool/plugins/org.eclipse.wst.jsdt.debug.crossfire_1.0.500.v201505071819.jar
file:/home/rambo/.p2/pool/plugins/org.eclipse.wst.jsdt.debug.rhino_1.0.500.v201605251607.jar
file:/home/rambo/.p2/pool/plugins/org.eclipse.wst.jsdt.debug.rhino.debugger_1.0.600.v201604292217.jar
file:/home/rambo/.p2/pool/plugins/org.eclipse.wst.jsdt.debug.transport_1.0.300.v201502261613.jar
file:/home/rambo/.p2/pool/plugins/org.eclipse.wst.jsdt.debug.ui_1.0.600.v201605311817.jar
file:/home/rambo/.p2/pool/plugins/org.eclipse.wst.jsdt.doc_2.0.200.v201710302345.jar
file:/home/rambo/.p2/pool/plugins/org.eclipse.wst.jsdt.js.bower_1.0.200.v201610220243.jar
file:/home/rambo/.p2/pool/plugins/org.eclipse.wst.jsdt.js.cli_1.0.0.v201605192332.jar
file:/home/rambo/.p2/pool/plugins/org.eclipse.wst.jsdt.js.common_1.0.200.v201610211901.jar
file:/home/rambo/.p2/pool/plugins/org.eclipse.wst.jsdt.js.grunt_1.0.200.v201610211901.jar
file:/home/rambo/.p2/pool/plugins/org.eclipse.wst.jsdt.js.gulp_1.0.200.v201610211901.jar
file:/home/rambo/.p2/pool/plugins/org.eclipse.wst.jsdt.js.node_1.1.100.v201705091354.jar
file:/home/rambo/.p2/pool/plugins/org.eclipse.wst.jsdt.js.node.common_1.0.0.v201605131737.jar
file:/home/rambo/.p2/pool/plugins/org.eclipse.wst.jsdt.js.npm_1.0.300.v201711211802.jar
file:/home/rambo/.p2/pool/plugins/org.eclipse.wst.jsdt.manipulation_1.0.601.v201602241911.jar
file:/home/rambo/.p2/pool/plugins/org.eclipse.wst.jsdt.support.firefox_1.0.501.v201602241911.jar
file:/home/rambo/.p2/pool/plugins/org.eclipse.wst.jsdt.support.ie_1.0.601.v201602241911.jar
file:/home/rambo/.p2/pool/plugins/org.eclipse.wst.jsdt.ui_2.0.301.v201710051729.jar
file:/home/rambo/.p2/pool/plugins/org.eclipse.wst.jsdt.web.core_1.1.0.v201807090620.jar
file:/home/rambo/.p2/pool/plugins/org.eclipse.wst.jsdt.web.ui_1.2.0.v201807090620.jar
file:/home/rambo/.p2/pool/plugins/org.eclipse.wst.json.bower.core_1.0.0.v201711201732.jar
file:/home/rambo/.p2/pool/plugins/org.eclipse.wst.json.bower.ui_1.0.100.v201807090620.jar
file:/home/rambo/.p2/pool/plugins/org.eclipse.wst.json.core_1.1.0.v201804162113.jar
file:/home/rambo/.p2/pool/plugins/org.eclipse.wst.json.eslint.core_1.0.0.v201711201732.jar
file:/home/rambo/.p2/pool/plugins/org.eclipse.wst.json.eslint.ui_1.0.100.v201807090620.jar
file:/home/rambo/.p2/pool/plugins/org.eclipse.wst.json.jshint.core_1.0.0.v201711201732.jar
file:/home/rambo/.p2/pool/plugins/org.eclipse.wst.json.jshint.ui_1.0.100.v201807090620.jar
file:/home/rambo/.p2/pool/plugins/org.eclipse.wst.json.npm.core_1.0.0.v201711201732.jar
file:/home/rambo/.p2/pool/plugins/org.eclipse.wst.json.npm.ui_1.0.100.v201807090620.jar
file:/home/rambo/.p2/pool/plugins/org.eclipse.wst.json.schemaprocessor_1.0.200.v201711201732.jar
file:/home/rambo/.p2/pool/plugins/org.eclipse.wst.json.ui_1.0.200.v201807090620.jar
file:/home/rambo/.p2/pool/plugins/org.eclipse.wst.server.core_1.10.0.v201803052214.jar
file:/home/rambo/.p2/pool/plugins/org.eclipse.wst.server.discovery_1.3.100.v201805282004.jar
file:/home/rambo/.p2/pool/plugins/org.eclipse.wst.server.ui_1.5.401.v201804051745.jar
file:/home/rambo/.p2/pool/plugins/org.eclipse.wst.server.ui.doc.user_1.1.600.v201309182117.jar
file:/home/rambo/.p2/pool/plugins/org.eclipse.wst.server.ui.infopop_1.1.200.v201309182117.jar
file:/home/rambo/.p2/pool/plugins/org.eclipse.wst.sse.core_1.2.100.v201807090620.jar
file:/home/rambo/.p2/pool/plugins/org.eclipse.wst.sse.doc.user_1.2.0.v201802171654.jar
file:/home/rambo/.p2/pool/plugins/org.eclipse.wst.sse.ui_1.5.0.v201807252207.jar
file:/home/rambo/.p2/pool/plugins/org.eclipse.wst.sse.ui.infopop_1.0.300.v201711201733.jar
file:/home/rambo/.p2/pool/plugins/org.eclipse.wst.standard.schemas_1.0.800.v201711201732.jar
file:/home/rambo/.p2/pool/plugins/org.eclipse.wst.validation_1.2.701.v201707142105.jar
file:/home/rambo/.p2/pool/plugins/org.eclipse.wst.validation.infopop_1.0.300.v201309101952.jar
file:/home/rambo/.p2/pool/plugins/org.eclipse.wst.validation.ui_1.2.501.v201802151734.jar
file:/home/rambo/.p2/pool/plugins/org.eclipse.wst.web_1.2.0.v201802171654.jar
file:/home/rambo/.p2/pool/plugins/org.eclipse.wst.web.ui_1.2.0.v201802171744.jar
file:/home/rambo/.p2/pool/plugins/org.eclipse.wst.web.ui.infopop_1.0.300.v201711222247.jar
file:/home/rambo/.p2/pool/plugins/org.eclipse.wst.webtools.doc.user_1.0.500.v201711201733.jar
file:/home/rambo/.p2/pool/plugins/org.eclipse.wst.xml.core_1.2.100.v201808220605.jar
file:/home/rambo/.p2/pool/plugins/org.eclipse.wst.xml.ui_1.2.100.v201807252207.jar
file:/home/rambo/.p2/pool/plugins/org.eclipse.wst.xml.ui.infopop_1.0.400.v201711201733.jar
file:/home/rambo/.p2/pool/plugins/org.eclipse.wst.xmleditor.doc.user_1.1.0.v201802171654.jar
file:/home/rambo/.p2/pool/plugins/org.eclipse.wst.xsd.core_1.2.0.v201802171838.jar
file:/home/rambo/.p2/pool/plugins/org.eclipse.wst.xsd.ui_1.3.100.v201807090620.jar
file:/home/rambo/.p2/pool/plugins/org.eclipse.wst.xsdeditor.doc.user_1.0.800.v201711201733.jar
file:/home/rambo/.p2/pool/plugins/org.eclipse.xpand_2.2.0.v201605260315.jar
file:/home/rambo/.p2/pool/plugins/org.eclipse.xsd_2.15.0.v20180722-1116.jar
file:/home/rambo/.p2/pool/plugins/org.eclipse.xsd.edit_2.10.0.v20180706-1143.jar
file:/home/rambo/.p2/pool/plugins/org.eclipse.xtend_2.2.0.v201605260315.jar
file:/home/rambo/.p2/pool/plugins/org.eclipse.xtend.core_2.15.0.v20180916-0915.jar
file:/home/rambo/.p2/pool/plugins/org.eclipse.xtend.doc_2.15.0.v20180916-0915.jar
file:/home/rambo/.p2/pool/plugins/org.eclipse.xtend.examples_2.15.0.v20180916-0915.jar
file:/home/rambo/.p2/pool/plugins/org.eclipse.xtend.ide_2.15.0.v20180916-0915.jar
file:/home/rambo/.p2/pool/plugins/org.eclipse.xtend.ide.common_2.15.0.v20180916-0915.jar
file:/home/rambo/.p2/pool/plugins/org.eclipse.xtend.lib_2.15.0.v20180916-1130.jar
file:/home/rambo/.p2/pool/plugins/org.eclipse.xtend.lib.macro_2.15.0.v20180916-1130.jar
file:/home/rambo/.p2/pool/plugins/org.eclipse.xtend.m2e_2.15.0.v20180916-0915.jar
file:/home/rambo/.p2/pool/plugins/org.eclipse.xtend.standalone_2.15.0.v20180916-0915.jar
file:/home/rambo/.p2/pool/plugins/org.eclipse.xtend.typesystem.emf_2.2.0.v201605260315.jar
file:/home/rambo/.p2/pool/plugins/org.eclipse.xtext_2.15.0.v20180916-0722.jar
file:/home/rambo/.p2/pool/plugins/org.eclipse.xtext.activities_2.15.0.v20180916-1016.jar
file:/home/rambo/.p2/pool/plugins/org.eclipse.xtext.builder_2.15.0.v20180916-1016.jar
file:/home/rambo/.p2/pool/plugins/org.eclipse.xtext.builder.standalone_2.15.0.v20180916-1104.jar
file:/home/rambo/.p2/pool/plugins/org.eclipse.xtext.common.types_2.15.0.v20180916-1104.jar
file:/home/rambo/.p2/pool/plugins/org.eclipse.xtext.common.types.edit_2.15.0.v20180916-1016.jar
file:/home/rambo/.p2/pool/plugins/org.eclipse.xtext.common.types.shared_2.15.0.v20180916-1016.jar
file:/home/rambo/.p2/pool/plugins/org.eclipse.xtext.common.types.shared.jdt38_2.15.0.v20180916-1016.jar
file:/home/rambo/.p2/pool/plugins/org.eclipse.xtext.common.types.ui_2.15.0.v20180916-1016.jar
file:/home/rambo/.p2/pool/plugins/org.eclipse.xtext.doc_2.15.0.v20180916-1016.jar
file:/home/rambo/.p2/pool/plugins/org.eclipse.xtext.ecore_2.15.0.v20180916-1104.jar
file:/home/rambo/.p2/pool/plugins/org.eclipse.xtext.generator_2.15.0.v20180916-1104.jar
file:/home/rambo/.p2/pool/plugins/org.eclipse.xtext.ide_2.15.0.v20180916-0722.jar
file:/home/rambo/.p2/pool/plugins/org.eclipse.xtext.idea.generator_2.15.0.v20180916-1016.jar
file:/home/rambo/.p2/pool/plugins/org.eclipse.xtext.java_2.15.0.v20180916-1104.jar
file:/home/rambo/.p2/pool/plugins/org.eclipse.xtext.junit4_2.15.0.v20180916-1016.jar
file:/home/rambo/.p2/pool/plugins/org.eclipse.xtext.logging_1.2.15.v20180916-1016.jar
file:/home/rambo/.p2/pool/plugins/org.eclipse.xtext.m2e_2.15.0.v20180916-1016.jar
file:/home/rambo/.p2/pool/plugins/org.eclipse.xtext.purexbase_2.15.0.v20180916-1104.jar
file:/home/rambo/.p2/pool/plugins/org.eclipse.xtext.purexbase.ide_2.15.0.v20180916-1104.jar
file:/home/rambo/.p2/pool/plugins/org.eclipse.xtext.purexbase.ui_2.15.0.v20180916-1016.jar
file:/home/rambo/.p2/pool/plugins/org.eclipse.xtext.smap_2.15.0.v20180916-1104.jar
file:/home/rambo/.p2/pool/plugins/org.eclipse.xtext.testing_2.15.0.v20180916-0722.jar
file:/home/rambo/.p2/pool/plugins/org.eclipse.xtext.ui_2.15.0.v20180916-1016.jar
file:/home/rambo/.p2/pool/plugins/org.eclipse.xtext.ui.codemining_2.15.0.v20180916-1016.jar
file:/home/rambo/.p2/pool/plugins/org.eclipse.xtext.ui.codetemplates_2.15.0.v20180916-1016.jar
file:/home/rambo/.p2/pool/plugins/org.eclipse.xtext.ui.codetemplates.ide_2.15.0.v20180916-1016.jar
file:/home/rambo/.p2/pool/plugins/org.eclipse.xtext.ui.codetemplates.ui_2.15.0.v20180916-1016.jar
file:/home/rambo/.p2/pool/plugins/org.eclipse.xtext.ui.ecore_2.15.0.v20180916-1016.jar
file:/home/rambo/.p2/pool/plugins/org.eclipse.xtext.ui.shared_2.15.0.v20180916-1016.jar
file:/home/rambo/.p2/pool/plugins/org.eclipse.xtext.ui.testing_2.15.0.v20180916-1016.jar
file:/home/rambo/.p2/pool/plugins/org.eclipse.xtext.util_2.15.0.v20180916-0722.jar
file:/home/rambo/.p2/pool/plugins/org.eclipse.xtext.xbase_2.15.0.v20180916-1104.jar
file:/home/rambo/.p2/pool/plugins/org.eclipse.xtext.xbase.ide_2.15.0.v20180916-1104.jar
file:/home/rambo/.p2/pool/plugins/org.eclipse.xtext.xbase.junit_2.15.0.v20180916-1016.jar
file:/home/rambo/.p2/pool/plugins/org.eclipse.xtext.xbase.lib_2.15.0.v20180916-1130.jar
file:/home/rambo/.p2/pool/plugins/org.eclipse.xtext.xbase.testing_2.15.0.v20180916-1104.jar
file:/home/rambo/.p2/pool/plugins/org.eclipse.xtext.xbase.ui_2.15.0.v20180916-1016.jar
file:/home/rambo/.p2/pool/plugins/org.eclipse.xtext.xbase.ui.testing_2.15.0.v20180916-1016.jar
file:/home/rambo/.p2/pool/plugins/org.eclipse.xtext.xtext.generator_2.15.0.v20180916-0722.jar
file:/home/rambo/.p2/pool/plugins/org.eclipse.xtext.xtext.ide_2.15.0.v20180916-0722.jar
file:/home/rambo/.p2/pool/plugins/org.eclipse.xtext.xtext.ui_2.15.0.v20180916-1016.jar
file:/home/rambo/.p2/pool/plugins/org.eclipse.xtext.xtext.ui.examples_2.15.0.v20180916-1016.jar
file:/home/rambo/.p2/pool/plugins/org.eclipse.xtext.xtext.ui.graph_2.15.0.v20180916-1016.jar
file:/home/rambo/.p2/pool/plugins/org.eclipse.xtext.xtext.wizard_2.15.0.v20180916-0722.jar
file:/home/rambo/.p2/pool/plugins/org.eclipse.zest.core_1.5.300.201606061308.jar
file:/home/rambo/.p2/pool/plugins/org.eclipse.zest.layouts_1.1.300.201606061308.jar
file:/home/rambo/.p2/pool/plugins/org.gradle.toolingapi_4.3.0.v20171108133209.jar
file:/home/rambo/.p2/pool/plugins/org.hamcrest.core_1.3.0.v20180420-1519.jar
file:/home/rambo/.p2/pool/plugins/org.jacoco.agent_0.8.2.v20180823-1901.jar
file:/home/rambo/.p2/pool/plugins/org.jacoco.core_0.8.2.v20180823-1901.jar
file:/home/rambo/.p2/pool/plugins/org.jacoco.report_0.8.2.v20180823-1901.jar
file:/home/rambo/.p2/pool/plugins/org.jsoup_1.7.2.v201411291515.jar
file:/home/rambo/.p2/pool/plugins/org.junit_4.12.0.v201504281640/
file:/home/rambo/.p2/pool/plugins/org.junit.jupiter.api_5.1.0.v20180327-1502.jar
file:/home/rambo/.p2/pool/plugins/org.junit.jupiter.engine_5.1.0.v20180327-1502.jar
file:/home/rambo/.p2/pool/plugins/org.junit.jupiter.migrationsupport_5.1.0.v20180327-1502.jar
file:/home/rambo/.p2/pool/plugins/org.junit.jupiter.params_5.1.0.v20180327-1502.jar
file:/home/rambo/.p2/pool/plugins/org.junit.platform.commons_1.1.0.v20180327-1502.jar
file:/home/rambo/.p2/pool/plugins/org.junit.platform.engine_1.1.0.v20180327-1502.jar
file:/home/rambo/.p2/pool/plugins/org.junit.platform.launcher_1.1.0.v20180327-1502.jar
file:/home/rambo/.p2/pool/plugins/org.junit.platform.runner_1.1.0.v20180327-1502.jar
file:/home/rambo/.p2/pool/plugins/org.junit.platform.suite.api_1.1.0.v20180327-1502.jar
file:/home/rambo/.p2/pool/plugins/org.junit.vintage.engine_5.1.0.v20180327-1502.jar
file:/home/rambo/.p2/pool/plugins/org.mozilla.javascript_1.7.5.v201504281450.jar
file:/home/rambo/.p2/pool/plugins/org.objectweb.asm_6.2.1.v20180823-1831.jar
file:/home/rambo/.p2/pool/plugins/org.objectweb.asm.commons_6.2.1.v20180823-1831.jar
file:/home/rambo/.p2/pool/plugins/org.objectweb.asm.tree_6.2.1.v20180823-1831.jar
file:/home/rambo/.p2/pool/plugins/org.opentest4j_1.0.0.v20180327-1502.jar
file:/home/rambo/.p2/pool/plugins/org.sat4j.core_2.3.5.v201308161310.jar
file:/home/rambo/.p2/pool/plugins/org.sat4j.pb_2.3.5.v201404071733.jar
file:/home/rambo/.p2/pool/plugins/org.slf4j.api_1.7.2.v20121108-1250.jar
file:/home/rambo/.p2/pool/plugins/org.slf4j.impl.log4j12_1.7.2.v20131105-2200.jar
file:/home/rambo/.p2/pool/plugins/org.tukaani.xz_1.8.0.v20180207-1613.jar
file:/home/rambo/.p2/pool/plugins/org.w3c.css.sac_1.3.1.v200903091627.jar
file:/home/rambo/.p2/pool/plugins/org.w3c.dom.events_3.0.0.draft20060413_v201105210656.jar
file:/home/rambo/.p2/pool/plugins/org.w3c.dom.smil_1.0.1.v200903091627.jar
file:/home/rambo/.p2/pool/plugins/org.w3c.dom.svg_1.1.0.v201011041433.jar
file:/home/rambo/.p2/pool/plugins/org.eclipse.emf.common.source_2.15.0.v20180723-1316.jar
file:/home/rambo/.p2/pool/plugins/org.eclipse.emf.ecore.source_2.15.0.v20180722-1159.jar
file:/home/rambo/.p2/pool/plugins/org.eclipse.emf.mwe2.language.source_2.9.1.201705291011.jar
file:/home/rambo/.p2/pool/plugins/org.eclipse.emf.mwe2.language.ui.source_2.9.1.201705291011.jar
file:/home/rambo/.p2/pool/plugins/org.eclipse.emf.mwe2.launch.source_2.9.1.201705291011.jar
file:/home/rambo/.p2/pool/plugins/org.eclipse.emf.mwe2.launch.ui.source_2.9.1.201705291011.jar
file:/home/rambo/.p2/pool/plugins/org.eclipse.emf.mwe2.lib.source_2.9.1.201705291011.jar
file:/home/rambo/.p2/pool/plugins/org.eclipse.emf.mwe2.runtime.source_2.9.1.201705291011.jar
file:/home/rambo/.p2/pool/plugins/org.eclipse.gef.common.source_5.0.0.201805280201.jar
file:/home/rambo/.p2/pool/plugins/org.eclipse.gef.fx.jface.source_5.0.2.201805280201.jar
file:/home/rambo/.p2/pool/plugins/org.eclipse.gef.fx.source_5.0.1.201805280201.jar
file:/home/rambo/.p2/pool/plugins/org.eclipse.gef.fx.swt.source_5.0.2.201805280201.jar
file:/home/rambo/.p2/pool/plugins/org.eclipse.gef.geometry.convert.fx.source_5.0.0.201805280201.jar
file:/home/rambo/.p2/pool/plugins/org.eclipse.gef.geometry.convert.swt.source_5.0.2.201805280201.jar
file:/home/rambo/.p2/pool/plugins/org.eclipse.gef.geometry.source_5.0.0.201805280201.jar
file:/home/rambo/.p2/pool/plugins/org.eclipse.gef.graph.source_5.0.0.201805280201.jar
file:/home/rambo/.p2/pool/plugins/org.eclipse.gef.layout.source_5.0.0.201805280201.jar
file:/home/rambo/.p2/pool/plugins/org.eclipse.gef.mvc.fx.source_5.0.2.201805280201.jar
file:/home/rambo/.p2/pool/plugins/org.eclipse.gef.mvc.fx.ui.source_5.0.2.201805280201.jar
file:/home/rambo/.p2/pool/plugins/org.eclipse.gef.zest.fx.jface.source_5.0.2.201805280201.jar
file:/home/rambo/.p2/pool/plugins/org.eclipse.gef.zest.fx.source_5.0.1.201805280201.jar
file:/home/rambo/.p2/pool/plugins/org.eclipse.gef.zest.fx.ui.source_5.0.2.201805280201.jar
file:/home/rambo/.p2/pool/plugins/org.eclipse.xtend.core.source_2.15.0.v20180916-0915.jar
file:/home/rambo/.p2/pool/plugins/org.eclipse.xtend.ide.common.source_2.15.0.v20180916-0915.jar
file:/home/rambo/.p2/pool/plugins/org.eclipse.xtend.ide.source_2.15.0.v20180916-0915.jar
file:/home/rambo/.p2/pool/plugins/org.eclipse.xtend.lib.macro.source_2.15.0.v20180916-1130.jar
file:/home/rambo/.p2/pool/plugins/org.eclipse.xtend.lib.source_2.15.0.v20180916-1130.jar
file:/home/rambo/.p2/pool/plugins/org.eclipse.xtend.m2e.source_2.15.0.v20180916-0915.jar
file:/home/rambo/.p2/pool/plugins/org.eclipse.xtend.standalone.source_2.15.0.v20180916-0915.jar
file:/home/rambo/.p2/pool/plugins/org.eclipse.xtext.activities.source_2.15.0.v20180916-1016.jar
file:/home/rambo/.p2/pool/plugins/org.eclipse.xtext.builder.source_2.15.0.v20180916-1016.jar
file:/home/rambo/.p2/pool/plugins/org.eclipse.xtext.builder.standalone.source_2.15.0.v20180916-1104.jar
file:/home/rambo/.p2/pool/plugins/org.eclipse.xtext.common.types.edit.source_2.15.0.v20180916-1016.jar
file:/home/rambo/.p2/pool/plugins/org.eclipse.xtext.common.types.shared.jdt38.source_2.15.0.v20180916-1016.jar
file:/home/rambo/.p2/pool/plugins/org.eclipse.xtext.common.types.shared.source_2.15.0.v20180916-1016.jar
file:/home/rambo/.p2/pool/plugins/org.eclipse.xtext.common.types.source_2.15.0.v20180916-1104.jar
file:/home/rambo/.p2/pool/plugins/org.eclipse.xtext.common.types.ui.source_2.15.0.v20180916-1016.jar
file:/home/rambo/.p2/pool/plugins/org.eclipse.xtext.ecore.source_2.15.0.v20180916-1104.jar
file:/home/rambo/.p2/pool/plugins/org.eclipse.xtext.generator.source_2.15.0.v20180916-1104.jar
file:/home/rambo/.p2/pool/plugins/org.eclipse.xtext.ide.source_2.15.0.v20180916-0722.jar
file:/home/rambo/.p2/pool/plugins/org.eclipse.xtext.idea.generator.source_2.15.0.v20180916-1016.jar
file:/home/rambo/.p2/pool/plugins/org.eclipse.xtext.java.source_2.15.0.v20180916-1104.jar
file:/home/rambo/.p2/pool/plugins/org.eclipse.xtext.junit4.source_2.15.0.v20180916-1016.jar
file:/home/rambo/.p2/pool/plugins/org.eclipse.xtext.logging.source_1.2.15.v20180916-1016.jar
file:/home/rambo/.p2/pool/plugins/org.eclipse.xtext.m2e.source_2.15.0.v20180916-1016.jar
file:/home/rambo/.p2/pool/plugins/org.eclipse.xtext.purexbase.ide.source_2.15.0.v20180916-1104.jar
file:/home/rambo/.p2/pool/plugins/org.eclipse.xtext.purexbase.source_2.15.0.v20180916-1104.jar
file:/home/rambo/.p2/pool/plugins/org.eclipse.xtext.purexbase.ui.source_2.15.0.v20180916-1016.jar
file:/home/rambo/.p2/pool/plugins/org.eclipse.xtext.smap.source_2.15.0.v20180916-1104.jar
file:/home/rambo/.p2/pool/plugins/org.eclipse.xtext.source_2.15.0.v20180916-0722.jar
file:/home/rambo/.p2/pool/plugins/org.eclipse.xtext.testing.source_2.15.0.v20180916-0722.jar
file:/home/rambo/.p2/pool/plugins/org.eclipse.xtext.ui.codemining.source_2.15.0.v20180916-1016.jar
file:/home/rambo/.p2/pool/plugins/org.eclipse.xtext.ui.codetemplates.ide.source_2.15.0.v20180916-1016.jar
file:/home/rambo/.p2/pool/plugins/org.eclipse.xtext.ui.codetemplates.source_2.15.0.v20180916-1016.jar
file:/home/rambo/.p2/pool/plugins/org.eclipse.xtext.ui.codetemplates.ui.source_2.15.0.v20180916-1016.jar
file:/home/rambo/.p2/pool/plugins/org.eclipse.xtext.ui.ecore.source_2.15.0.v20180916-1016.jar
file:/home/rambo/.p2/pool/plugins/org.eclipse.xtext.ui.shared.source_2.15.0.v20180916-1016.jar
file:/home/rambo/.p2/pool/plugins/org.eclipse.xtext.ui.source_2.15.0.v20180916-1016.jar
file:/home/rambo/.p2/pool/plugins/org.eclipse.xtext.ui.testing.source_2.15.0.v20180916-1016.jar
file:/home/rambo/.p2/pool/plugins/org.eclipse.xtext.util.source_2.15.0.v20180916-0722.jar
file:/home/rambo/.p2/pool/plugins/org.eclipse.xtext.xbase.ide.source_2.15.0.v20180916-1104.jar
file:/home/rambo/.p2/pool/plugins/org.eclipse.xtext.xbase.junit.source_2.15.0.v20180916-1016.jar
file:/home/rambo/.p2/pool/plugins/org.eclipse.xtext.xbase.lib.source_2.15.0.v20180916-1130.jar
file:/home/rambo/.p2/pool/plugins/org.eclipse.xtext.xbase.source_2.15.0.v20180916-1104.jar
file:/home/rambo/.p2/pool/plugins/org.eclipse.xtext.xbase.testing.source_2.15.0.v20180916-1104.jar
file:/home/rambo/.p2/pool/plugins/org.eclipse.xtext.xbase.ui.source_2.15.0.v20180916-1016.jar
file:/home/rambo/.p2/pool/plugins/org.eclipse.xtext.xbase.ui.testing.source_2.15.0.v20180916-1016.jar
file:/home/rambo/.p2/pool/plugins/org.eclipse.xtext.xtext.generator.source_2.15.0.v20180916-0722.jar
file:/home/rambo/.p2/pool/plugins/org.eclipse.xtext.xtext.ide.source_2.15.0.v20180916-0722.jar
file:/home/rambo/.p2/pool/plugins/org.eclipse.xtext.xtext.ui.graph.source_2.15.0.v20180916-1016.jar
file:/home/rambo/.p2/pool/plugins/org.eclipse.xtext.xtext.ui.source_2.15.0.v20180916-1016.jar
file:/home/rambo/.p2/pool/plugins/org.eclipse.xtext.xtext.wizard.source_2.15.0.v20180916-0722.jar
