{
	"partitions" : [
		{
			"name" : "Top",
			"pins" : [
				{
					"name" : "seg-1",
					"strict" : false
				},
				{
					"name" : "seg-0",
					"strict" : false
				},
				{
					"name" : "seg-2",
					"strict" : false
				},
				{
					"name" : "seg-3",
					"strict" : false
				},
				{
					"name" : "seg-4",
					"strict" : false
				},
				{
					"name" : "seg-5",
					"strict" : false
				},
				{
					"name" : "seg-6",
					"strict" : false
				},
				{
					"name" : "A",
					"strict" : false
				},
				{
					"name" : "C",
					"strict" : false
				},
				{
					"name" : "D",
					"strict" : false
				},
				{
					"name" : "B",
					"strict" : false
				}
			]
		}
	]
}