m255
K4
z2
!s11e vcom 2020.1 2020.02, Feb 28 2020
13
!s112 1.1
!i10d 8192
!i10e 25
!i10f 100
cModel Technology
Z0 d/home/leug/aulas-usp/pratica-log-digital/aula-02/simulation/modelsim
E\aula-02-simplificacao-de-expressao-logica\
Z1 w1622326717
Z2 DPx4 ieee 16 vital_primitives 0 22 G>kiXP8Q9dRClKfK1Zn7j1
Z3 DPx8 cyclonev 18 cyclonev_atom_pack 0 22 3HQPc5MVbmOPN?>a5EBYj2
Z4 DPx4 ieee 12 vital_timing 0 22 J>EBealN09f8GzldA[z2>3
Z5 DPx8 cyclonev 19 cyclonev_components 0 22 jZ]H46BQLgIP5mfRTO`3B1
Z6 DPx3 std 6 textio 0 22 zE1`LPoLg^DX3Oz^4Fj1K3
Z7 DPx4 ieee 14 std_logic_1164 0 22 cVAk:aDinOX8^VGI1ekP<3
Z8 DPx12 altera_lnsim 23 altera_lnsim_components 0 22 ^Ch;U@;bMk1;>A2B<UV`k2
!i122 0
R0
Z9 8aula-02-simplificacao-de-expressao-logica.vho
Z10 Faula-02-simplificacao-de-expressao-logica.vho
l0
L37 1
VR[lX5g9K@2AC:3VDg0MAK1
!s100 aCL]07G0zcz84ccNT9ln^1
Z11 OV;C;2020.1;71
31
Z12 !s110 1622326722
!i10b 1
Z13 !s108 1622326722.000000
Z14 !s90 -reportprogress|300|-93|-work|work|aula-02-simplificacao-de-expressao-logica.vho|
!s107 aula-02-simplificacao-de-expressao-logica.vho|
!i113 1
Z15 o-93 -work work
Z16 tExplicit 1 CvgOpt 0
n@134aula-02-simplificacao-de-expressao-logica@134
Astructure
R2
R3
R4
R5
R6
R7
R8
DEx4 work 43 \aula-02-simplificacao-de-expressao-logica\ 0 22 R[lX5g9K@2AC:3VDg0MAK1
!i122 0
l79
L55 126
VCXmXR4nGdF[O8JDb3iMF61
!s100 PJICz<`EUzEbO6L:hR9[81
R11
31
R12
!i10b 1
R13
R14
Z17 !s107 aula-02-simplificacao-de-expressao-logica.vho|
!i113 1
R15
R16
