{
	"partitions" : [
		{
			"name" : "Top",
			"pins" : [
				{
					"name" : "R1",
					"strict" : false
				},
				{
					"name" : "R2",
					"strict" : false
				},
				{
					"name" : "R3",
					"strict" : false
				},
				{
					"name" : "R4",
					"strict" : false
				},
				{
					"name" : "Q1",
					"strict" : false
				},
				{
					"name" : "Q2",
					"strict" : false
				},
				{
					"name" : "Q3",
					"strict" : false
				},
				{
					"name" : "Q4",
					"strict" : false
				},
				{
					"name" : "A1",
					"strict" : false
				},
				{
					"name" : "A4",
					"strict" : false
				},
				{
					"name" : "B4",
					"strict" : false
				},
				{
					"name" : "B1",
					"strict" : false
				},
				{
					"name" : "B3",
					"strict" : false
				},
				{
					"name" : "B2",
					"strict" : false
				},
				{
					"name" : "A3",
					"strict" : false
				},
				{
					"name" : "A2",
					"strict" : false
				}
			]
		}
	]
}