Info: Start Nativelink Simulation process

========= EDA Simulation Settings =====================

Sim Mode              :  Gate
Family                :  cyclonev
Quartus root          :  /home/leug/intelFPGA_lite/20.1/quartus/linux64/
Quartus sim root      :  /home/leug/intelFPGA_lite/20.1/quartus/eda/sim_lib
Simulation Tool       :  modelsim-altera
Simulation Language   :  vhdl
Version               :  93
Simulation Mode       :  GUI
Sim Output File       :  aula-07.vho
Sim SDF file          :  aula-07__vhdl.sdo
Sim dir               :  simulation/modelsim

=======================================================

Info: Starting NativeLink simulation with ModelSim-Altera software
Sourced NativeLink script /home/leug/intelFPGA_lite/20.1/quartus/common/tcl/internal/nativelink/modelsim.tcl
Warning: File aula-07_run_msim_gate_vhdl.do already exists - backing up current file as aula-07_run_msim_gate_vhdl.do.bak6
Probing transcript
ModelSim-Altera Info: # do aula-07_run_msim_gate_vhdl.do
ModelSim-Altera Info: # if {[file exists gate_work]} {
ModelSim-Altera Info: # 	vdel -lib gate_work -all
ModelSim-Altera Info: # }
ModelSim-Altera Info: # vlib gate_work
ModelSim-Altera Info: # vmap work gate_work
ModelSim-Altera Info: # Model Technology ModelSim - Intel FPGA Edition vmap 2020.1 Lib Mapping Utility 2020.02 Feb 28 2020
ModelSim-Altera Info: # vmap work gate_work 
ModelSim-Altera Info: # Copying /home/leug/intelFPGA_lite/20.1/modelsim_ase/linuxaloem/../modelsim.ini to modelsim.ini
ModelSim-Altera Info: # Modifying modelsim.ini
ModelSim-Altera Info: # 
ModelSim-Altera Info: # vcom -93 -work work {aula-07.vho}
ModelSim-Altera Info: # Model Technology ModelSim - Intel FPGA Edition vcom 2020.1 Compiler 2020.02 Feb 28 2020
ModelSim-Altera Info: # Start time: 12:36:47 on Jun 14,2021
ModelSim-Altera Info: # vcom -reportprogress 300 -93 -work work aula-07.vho 
ModelSim-Altera Info: # -- Loading package STANDARD
ModelSim-Altera Info: # -- Loading package TEXTIO
ModelSim-Altera Info: # -- Loading package std_logic_1164
ModelSim-Altera Info: # -- Loading package altera_lnsim_components
ModelSim-Altera Info: # -- Loading package VITAL_Timing
ModelSim-Altera Info: # -- Loading package VITAL_Primitives
ModelSim-Altera Info: # -- Loading package cyclonev_atom_pack
ModelSim-Altera Info: # -- Loading package cyclonev_components
ModelSim-Altera Info: # -- Compiling entity \aula-07\
ModelSim-Altera Info: # -- Compiling architecture structure of \aula-07\
ModelSim-Altera Info: # End time: 12:36:47 on Jun 14,2021, Elapsed time: 0:00:00
ModelSim-Altera Info: # Errors: 0, Warnings: 0
ModelSim-Altera Info: # 
ModelSim-Altera Info: vsim work.\\aula-07\\
ModelSim-Altera Info: # vsim work.\aula-07\ 
ModelSim-Altera Info: # Start time: 12:36:51 on Jun 14,2021
ModelSim-Altera Info: # Loading std.standard
ModelSim-Altera Info: # Loading std.textio(body)
ModelSim-Altera Info: # Loading ieee.std_logic_1164(body)
ModelSim-Altera Info: # Loading altera_lnsim.altera_lnsim_components
ModelSim-Altera Info: # Loading ieee.vital_timing(body)
ModelSim-Altera Info: # Loading ieee.vital_primitives(body)
ModelSim-Altera Info: # Loading cyclonev.cyclonev_atom_pack(body)
ModelSim-Altera Info: # Loading cyclonev.cyclonev_components
ModelSim-Altera Info: # Loading work.\aula-07\(structure)
ModelSim-Altera Info: # Loading ieee.std_logic_arith(body)
ModelSim-Altera Info: # Loading cyclonev.cyclonev_io_obuf(arch)
ModelSim-Altera Info: # Loading cyclonev.cyclonev_io_ibuf(arch)
ModelSim-Altera Info: # Loading cyclonev.cyclonev_lcell_comb(vital_lcell_comb)
ModelSim-Altera Info: add wave -position insertpoint  \
ModelSim-Altera Info: {sim:/\aula-07\/A4} \
ModelSim-Altera Info: {sim:/\aula-07\/A3} \
ModelSim-Altera Info: {sim:/\aula-07\/A2} \
ModelSim-Altera Info: {sim:/\aula-07\/A1}
ModelSim-Altera Info: add wave -position insertpoint  \
ModelSim-Altera Info: {sim:/\aula-07\/B4} \
ModelSim-Altera Info: {sim:/\aula-07\/B3} \
ModelSim-Altera Info: {sim:/\aula-07\/B2} \
ModelSim-Altera Info: {sim:/\aula-07\/B1}
ModelSim-Altera Info: add wave -position insertpoint  \
ModelSim-Altera Info: {sim:/\aula-07\/S4} \
ModelSim-Altera Info: {sim:/\aula-07\/S3} \
ModelSim-Altera Info: {sim:/\aula-07\/S2} \
ModelSim-Altera Info: {sim:/\aula-07\/S1}
ModelSim-Altera Info: add wave -position insertpoint  \
ModelSim-Altera Info: {sim:/\aula-07\/Cout}
ModelSim-Altera Info: force -freeze {sim:/\aula-07\/A4} 0 0
ModelSim-Altera Info: force -freeze {sim:/\aula-07\/A4} 1 0
ModelSim-Altera Info: force -freeze {sim:/\aula-07\/A3} 0 0
ModelSim-Altera Info: force -freeze {sim:/\aula-07\/A2} 1 0
ModelSim-Altera Info: force -freeze {sim:/\aula-07\/A1} 0 0
ModelSim-Altera Info: force -freeze {sim:/\aula-07\/B4} 0 0
ModelSim-Altera Info: force -freeze {sim:/\aula-07\/B3} 0 0
ModelSim-Altera Info: force -freeze {sim:/\aula-07\/B2} 0 0
ModelSim-Altera Info: force -freeze {sim:/\aula-07\/B1} 0 0
ModelSim-Altera Info: run
ModelSim-Altera Info: force -freeze {sim:/\aula-07\/B4} 1 0
ModelSim-Altera Info: run
ModelSim-Altera Info: force -freeze {sim:/\aula-07\/B4} 0 0
ModelSim-Altera Info: force -freeze {sim:/\aula-07\/B1} 1 0
ModelSim-Altera Info: run
ModelSim-Altera Info: force -freeze {sim:/\aula-07\/B1} 0 0
ModelSim-Altera Info: force -freeze {sim:/\aula-07\/B2} 1 0
ModelSim-Altera Info: run
ModelSim-Altera Info: run
ModelSim-Altera Info: restart
ModelSim-Altera Info: force -freeze {sim:/\aula-07\/A1} 0 0
ModelSim-Altera Info: force -freeze {sim:/\aula-07\/A1} 1 0
ModelSim-Altera Info: force -freeze {sim:/\aula-07\/A2} 0 0
ModelSim-Altera Info: force -freeze {sim:/\aula-07\/A3} 1 0
ModelSim-Altera Info: force -freeze {sim:/\aula-07\/A4} 0 0
ModelSim-Altera Info: force -freeze {sim:/\aula-07\/B1} 0 0
ModelSim-Altera Info: force -freeze {sim:/\aula-07\/B2} 0 0
ModelSim-Altera Info: force -freeze {sim:/\aula-07\/B3} 0 0
ModelSim-Altera Info: force -freeze {sim:/\aula-07\/B4} 0 0
ModelSim-Altera Info: run
ModelSim-Altera Info: force -freeze {sim:/\aula-07\/B4} 1 0
ModelSim-Altera Info: run
ModelSim-Altera Info: force -freeze {sim:/\aula-07\/B3} 1 0
ModelSim-Altera Info: run
ModelSim-Altera Info: force -freeze {sim:/\aula-07\/B2} 1 0
ModelSim-Altera Info: run
ModelSim-Altera Info: # End time: 13:10:03 on Jun 14,2021, Elapsed time: 0:33:12
ModelSim-Altera Info: # Errors: 0, Warnings: 0
Info: NativeLink simulation flow was successful
