{
    "classes": {
        "Object": {
            "permissions": {
                "read": 0,
                "write": 0,
                "execute": 3
            },
            "protected": {
                "destroy-execute": 3,
                "destroy-write": 2,
                "classname-write": 4
            }
        },
        "PBCore": {
            "permissions": {
                "read": 0,
                "write": 3,
                "execute": 3
            },
            "protected": {
                "getconstruct-execute": 2,
                "getconstruct-write": 4,
                "destroy-read": 4,
                "destroy-write": 4,
                "destroy-execute": 3,
                "depend-execute": 0,
                "newobject-execute": 0,
                "newobject-write": 4,
                "newobjectclass-execute": 0,
                "newobjectclass-write": 4,
                "lookupany-read": 0,
                "lookupany-write": 4,
                "lookupany-execute": 1
            }
        },
        "Component": {
            "permissions": {
                "read": 0,
                "write": 3,
                "execute": 3
            },
            "protected": {
                "destroy-execute": 2,
                "destroy-write": 4,
                "pause-execute": 2,
                "run-execute": 2
            }
        },
        "Library": {
            "permissions": {
                "read": 0,
                "write": 3,
                "execute": 0
            },
            "protected": {
                "destroy-execute": 2,
                "destroy-write": 4,
                "pause-execute": 2,
                "run-execute": 2
            }
        },
        "Enum": {
            "permissions": {
                "read": 0,
                "write": 4,
                "execute": 0
            },
            "protected": {
                "destroy-execute": 2,
                "destroy-write": 4
            }
        },
        "Task": {
            "permissions": {
                "read": 2,
                "write": 2,
                "execute": 2
            },
            "protected": {

            }
        },
        "Session": {
            "permissions": {
                "read": 3,
                "write": 3,
                "execute": 3
            },
            "protected": {
                "destroy-execute": 4,
                "destroy-write": 4,
                "attachthread-execute": 2,
                "deattachthread-execute": 2,
                "getenvironment-execute": 2
            }
        },
        "LuaSignal": {
            "permissions": {
                "read": 0,
                "write": 3,
                "execute": 0
            },
            "protected": {
                "destroy-write": 4
            }
        },
        "LuaSignalConnection": {
            "permissions": {
                "read": 0,
                "write": 3,
                "execute": 0
            },
            "protected": {
                "destroy-write": 4
            }
        }
    },
    "objects": {
        "1": {
            "permissions": {
                "read": 2,
                "write": 4,
                "execute": 2
            },
            "protected": {
                "destroy-execute": 4
            }
        },
        "3": {
            "permissions": {
                "read": 0,
                "write": 3,
                "execute": 0
            },
            "protected": {
                "destroy-read": 4,
                "destroy-write": 4,
                "destroy-execute": 4
            }
        },
        "9": {
            "permissions": {
                "read": 0,
                "write": 4,
                "execute": 3
            },
            "protected": {
                "destroy-execute": 4,
                "scheduler-read": 0
            }
        }
    },
    "modules": {
        "system": {
            "read": 3,
            "write": 3,
            "execute": 3
        },
        "utilities": {
            "read": 1,
            "write": 0,
            "execute": 0
        },
        "threadmanager": {
            "read": 2,
            "write": 2,
            "execute": 2
        },
        "enumsmanager": {
            "read": 0,
            "write": 0,
            "execute": 1
        },
        "luasignal": {
            "read": 1,
            "write": 0,
            "execute": 0
        }
    },
    "default": {
        "read": 3,
        "write": 3,
        "execute": 3,
        "permissions": {
            "read": 3,
            "write": 3,
            "execute": 3
        },
        "protected": {
            "destroy-write": 4
        }
    }
}