{
    "debugging": {
        "enabled": true,
        "watchingComponents": {
            "enabled": true,
            "luasignal": true
        },
        "watchingFunctionNames": {
            "enabled": false
        }
    }
}