<?xml version="1.0" encoding="UTF-8"?>
<svg width="88px" height="88px" viewBox="0 0 88 88" version="1.1" xmlns="http://www.w3.org/2000/svg" xmlns:xlink="http://www.w3.org/1999/xlink">
    <title>891D279F-08A5-4B79-94FC-6DECB6DB61EF</title>
    <g id="WEB" stroke="none" stroke-width="1" fill="none" fill-rule="evenodd">
        <g id="balss-ieraksti-home" transform="translate(-160.000000, -2800.000000)">
            <rect fill="#FFFFFF" x="0" y="0" width="1440" height="4138"></rect>
            <g id="Group-6-Copy" transform="translate(0.000000, 2440.000000)" fill="#2C2C2C">
                <rect id="Mask" x="0" y="0" width="1440" height="512"></rect>
            </g>
            <g id="Basics-/-Footer-Copy-2" transform="translate(0.000000, 2736.000000)">
                <g id="Basics-/-Footer">
                    <rect id="Rectangle" x="0" y="0" width="1440" height="216"></rect>
                    <g id="Logo-/-03-full-dark" transform="translate(160.000000, 64.000000)" fill="#66C4C8" fill-rule="nonzero">
                        <polygon id="Path" points="70.9998065 59.3957935 51.2418086 46.9445507 51.2418086 42.0650096 71.0416667 54.5162524 71.0416667 38.1950287 51.2418086 25.7437859 51.2418086 20.8221797 70.9998065 33.2734226 70.9998065 16.9942639 44 0 16.9583333 17.0363289 16.9583333 33.3154876 37.5116744 20.4015296 37.5116744 25.3231358 16.9583333 38.1950287 16.9583333 54.5162524 37.5116744 41.6022945 37.5116744 46.5239006 16.9583333 59.4378585 16.9583333 75.7170172 37.5116744 62.8030593 37.5116744 88 51.2418086 88 51.2418086 63.2657744 70.9998065 75.6749522"></polygon>
                    </g>
                </g>
            </g>
        </g>
    </g>
</svg>