<?xml version="1.0" encoding="UTF-8"?>
<svg width="24px" height="24px" viewBox="0 0 24 24" version="1.1" xmlns="http://www.w3.org/2000/svg" xmlns:xlink="http://www.w3.org/1999/xlink">
    <title>DCA1631A-004E-4579-974F-73DDD90B202D</title>
    <g id="WEB" stroke="none" stroke-width="1" fill="none" fill-rule="evenodd">
        <g id="balss-ieraksti-home" transform="translate(-378.000000, -252.000000)">
            <rect fill="#FFFFFF" x="0" y="0" width="1440" height="4138"></rect>
            <g id="Group-14" fill="#FFFFFF">
                <rect id="Rectangle-Copy-4" x="0" y="0" width="1440" height="2440"></rect>
            </g>
            <g id="Group-11" transform="translate(160.000000, 156.000000)">
                <g id="Group-13" transform="translate(0.000000, 72.000000)">
                    <g id="Group-3-Copy">
                        <g id="Stacked-Group" transform="translate(0.000000, 24.000000)">
                            <g id="Form-/-controller-Copy-4" transform="translate(218.000000, 0.000000)">
                                <g id="ui/checkbox-empty">
                                    <rect id="checkbox-filled" fill="#66C4C8" fill-rule="nonzero" x="0" y="0" width="24" height="24" rx="3"></rect>
                                    <g id="Icons-/-16-/-valid" fill="#FFFFFF">
                                        <path d="M7.61991953,10.6329938 C7.03413309,10.0472074 6.08438562,10.0472074 5.49859918,10.6329938 C4.91281275,11.2187803 4.91281275,12.1685277 5.49859918,12.7543142 L10.1273776,17.3830926 L18.4526773,9.05779294 C19.0384637,8.4720065 19.0384637,7.52225903 18.4526773,6.93647259 C17.8668909,6.35068615 16.9171434,6.35068615 16.331357,6.93647259 L10.1273776,13.1404519 L7.61991953,10.6329938 Z" id="Path-3"></path>
                                    </g>
                                </g>
                            </g>
                        </g>
                    </g>
                </g>
            </g>
        </g>
    </g>
</svg>